{"text_format":"1","workbook":"xlsx","n_sheets":6,"sheets":["Character Creator","Careers","Skills","Names","Race","Notes"],"not_rendered":{"charts":0,"images":0,"macros":1,"external_links":0,"defined_names":11,"comments":0,"pivot_tables":0},"unopened":[],"bounds":{"document_bytes":16777216,"sheet_cells":100000,"rows_first":2000,"rows_last":500,"rows_between":2000,"halvings":0,"cell_chars":16384,"cell_head_chars":4096},"cells_cut":0,"cells_raw":0,"read":"whole","date_system":"1900"}

{"sheet":"Character Creator","index":0,"n_rows":21,"n_cols":24,"rows_kept":21,"cut":false,"hidden":false,"merged":[[1,2,1,3],[3,4,3,13],[20,5,25,12],[10,4,10,13],[14,5,15,12],[16,5,17,12],[18,5,19,12],[13,2,13,3],[12,4,12,12],[4,4,4,14],[5,4,5,14],[6,4,6,14],[7,4,7,14],[8,4,8,14],[9,4,9,14],[2,2,2,3]]}
[null,"Character points:  ",{"$f":"D1-(Q10+N17+N19+N21+N15)","v":20},{"$f":"INDEX(Race!A2:B20,MATCH(C2,Race!B2:B20,0),1)","v":20}]
[{"$f":"IF(OR(C2=\"Human (Reiklander)\",C2=\"Human (Averlander)\",C2=\"Human (Hochlander)\",C2=\"Human (Middenlander)\",C2=\"Human (Nordlander)\",C2=\"Human (Ostermarker)\",C2=\"Human (Ostlander)\",C2=\"Human (Stirlander)\",C2=\"Human (Talabeclander)\",C2=\"Human (Wissenlander)\"),\"Reiklander\",IF(OR(C2=\"Dwarf (Karak-Azgaraz)\",C2=\"Dwarf (Zhufbar)\",C2=\"Dwarf (Barak Varr)\",C2=\"Dwarf (Karaz-A-Karak)\"),\"Dwarf\",IF(C2=\"High Elf\",\"High Elf\",IF(C2=\"Wood Elf\",\"Wood Elf\",IF(C2=\"Halfling\",\"Halfling\",IF(C2=\"Ogre\",\"Ogre\",IF(C2=\"Choose your race...\",\"Choose your race...\",\"\")))))))","v":"Choose your race..."},"Race:  ","Choose your race..."]
[null,"Career:  ","Choose a career…",null,{"$f":"IF(C2=\"Choose your race...\", \"\", \"Wound Threshold:\")","v":""},{"$f":"IF($A$2=\"Reiklander\",(9+D6),IF($A$2=\"Dwarf\",(10+D6),IF($A$2=\"High Elf\",(8+D6),IF($A$2=\"Wood Elf\",(8+D6),IF($A$2=\"Halfling\",(7+D6),IF($A$2=\"Ogre\",(10+D6),\"\"))))))","v":""},{"$f":"IF(C2=\"Choose your race...\", \"\", \"Corruption Threshold:\")","v":""},{"$f":"IF($A$2=\"Reiklander\",(10+D6),IF($A$2=\"Dwarf\",(10+D6),IF($A$2=\"High Elf\",(10+D6),IF($A$2=\"Wood Elf\",(10+D6),IF($A$2=\"Halfling\",(15+D6),IF($A$2=\"Ogre\",(10+D6),\"\"))))))","v":""},null,null,null,null,null,{"$f":"INDEX(Careers!A2:'Careers'!N57,MATCH(C3,Careers!A2:'Careers'!A57,0),13)","v":0},{"$f":"INDEX(Careers!A2:'Careers'!N57,MATCH(C3,Careers!A2:'Careers'!A57,0),14)","v":0},"Base Value","Points spent","1st stat","2nd stat","stat check","Racial stat",null,"Starting","Current"]
[null,null,null,null,{"$f":"INDEX(Race!B2:'Race'!I21,MATCH(C2,Race!B2:'Race'!B21,0),2)","v":""},null,null,null,null,null,null,null,null,null,null,0,{"$f":"IF(P4=0,0,IF(P4=1,(W4+1),IF(P4=2,((W4+1)+(W4+2)), IF(P4=3,((W4+1)+(W4+2)+(W4+3)), IF(P4=4,((W4+1)+(W4+2)+(W4+3))+(W4+4),0)))))","v":0},{"$f":"IF(N$3=\"STR\", 1,0)","v":0},{"$f":"IF(O$3=\"STR\", 1,0)","v":0},{"$f":"SUM(R4:S4)","v":0},{"$f":"IF($A$2=\"Reiklander\",2,IF($A$2=\"Dwarf\",3,IF($A$2=\"High Elf\",2,IF($A$2=\"Wood Elf\",2,IF($A$2=\"Halfling\",1,IF($A$2=\"Ogre\",3,0))))))","v":0},null,{"$f":"IF(T4<>0, U4+1,U4)","v":0}]
[null,"Strength",null,{"$f":"IF(P4=0,W4,IF(P4=1,W4+1,IF(P4=2,W4+2,IF(P4=3,W4+3,IF(P4=4,W4+4,0)))))","v":0},{"$f":"INDEX(Race!B2:'Race'!I21,MATCH(C2,Race!B2:'Race'!B21,0),3)","v":""},null,null,null,null,null,null,null,null,null,null,0,0,{"$f":"IF(N$3=\"Tou\", 1,0)","v":0},{"$f":"IF(O$3=\"Tou\", 1,0)","v":0},0,{"$f":"IF($A$2=\"Reiklander\", 2,IF($A$2=\"Dwarf\", 3,IF($A$2=\"High Elf\", 2,IF($A$2=\"Wood Elf\", 2,IF($A$2=\"Halfling\",2,IF($A$2=\"Ogre\",3,0))))))","v":0},null,0]
[null,"Toughness",null,{"$f":"IF(P5=0,W5,IF(P5=1,W5+1,IF(P5=2,W5+2,IF(P5=3,W5+3,IF(P5=4,W5+4,0)))))","v":0},{"$f":"INDEX(Race!B2:'Race'!I21,MATCH(C2,Race!B2:'Race'!B21,0),4)","v":""},null,null,null,null,null,null,null,null,null,null,0,0,{"$f":"IF(N$3=\"Agi\", 1,0)","v":0},{"$f":"IF(O$3=\"Agi\", 1,0)","v":0},0,{"$f":"IF($A$2=\"Reiklander\", 2,IF($A$2=\"Dwarf\", 2,IF($A$2=\"High Elf\", 3,IF($A$2=\"Wood Elf\", 3,IF($A$2=\"Halfling\",3,IF($A$2=\"Ogre\",2,0))))))","v":0},null,0]
[null,"Agility",null,0,{"$f":"INDEX(Race!B2:'Race'!I21,MATCH(C2,Race!B2:'Race'!B21,0),5)","v":""},null,null,null,null,null,null,null,null,null,null,0,0,{"$f":"IF(N$3=\"Int\", 1,0)","v":0},{"$f":"IF(O$3=\"Int\", 1,0)","v":0},0,{"$f":"IF($A$2=\"Reiklander\", 2,IF($A$2=\"Dwarf\", 2,IF($A$2=\"High Elf\", 3,IF($A$2=\"Wood Elf\", 2,IF($A$2=\"Halfling\",2,IF($A$2=\"Ogre\",1,0))))))","v":0},null,0]
[null,"Intelligence",null,0,{"$f":"INDEX(Race!B2:'Race'!I21,MATCH(C2,Race!B2:'Race'!B21,0),6)","v":""},null,null,null,null,null,null,null,null,null,null,0,0,{"$f":"IF(N$3=\"WP\", 1,0)","v":0},{"$f":"IF(O$3=\"WP\", 1,0)","v":0},0,{"$f":"IF($A$2=\"Reiklander\", 2,IF($A$2=\"Dwarf\", 2,IF($A$2=\"High Elf\", 2,IF($A$2=\"Wood Elf\", 3,IF($A$2=\"Halfling\",2,IF($A$2=\"Ogre\",2,0))))))","v":0},null,0]
[null,"Willpower",null,0,{"$f":"INDEX(Race!B2:'Race'!I21,MATCH(C2,Race!B2:'Race'!B21,0),7)","v":""},null,null,null,null,null,null,null,null,null,null,0,0,{"$f":"IF(N$3=\"Fel\", 1,0)","v":0},{"$f":"IF(O$3=\"Fel\", 1,0)","v":0},0,{"$f":"IF($A$2=\"Reiklander\", 2,IF($A$2=\"Dwarf\", 2,IF($A$2=\"High Elf\", 2,IF($A$2=\"Wood Elf\", 2,IF($A$2=\"Halfling\",3,IF($A$2=\"Ogre\",1,0))))))","v":0},null,0]
[null,"Fellowship",null,0,{"$f":"INDEX(Race!B2:'Race'!I21,MATCH(C2,Race!B2:'Race'!B21,0),8)","v":""},null,null,null,null,null,null,null,null,null,null,null,{"$f":"SUM(Q4:Q9)","v":0}]
{"$rows_left_out":12}
{"sheet":"Careers","index":1,"n_rows":57,"n_cols":28,"rows_kept":57,"cut":false,"hidden":false,"merged":[[35,1,35,5],[1,17,2,17],[1,14,1,15],[1,18,2,18],[1,19,2,19],[1,20,2,20],[1,21,2,21],[0,0,0,10],[1,6,1,9],[1,12,1,13]]}
["Basic Careers"]
["Career","Human","Halflings","Dwarf","High Elf","Wood Elf","Traits",null,null,null,"Set",null,"Core Stats",null,"Special Abilities",null,null,"Reiklander","Halfling","Dwarf","High Elf","Wood Elf"]
["Choose a career…",null,null,null,null,null,null,null,null,null,null,null,null,null,"",null,null,null,null,null,null,null,"Choose your race…",null,null,null,null,{"$f":"IF('Character Creator'!$A$2=\"Reiklander\", \"Here are three careers a human is permitted to take:\", IF('Character Creator'!$A$2=\"Dwarf\", \"Here are three careers Dwarves are permitted to take:\", IF('Character Creator'!$A$2=\"High Elf\", \"Here are three careers a High Elf is permitted to take:\", IF('Character Creator'!$A$2=\"Wood Elf\", \"Here are three careers a Wood Elf is permitted to take:\", IF('Character Creator'!$A$2=\"Halfling\", \"Here are three careers a Halfling is permitted to take:\", IF('Character Creator'!$A$2=\"Ogre\", \"Here is your only career choice:\", \"Here are three entirely random careers. Remember, not all races are permitted to enter these careers:\"))))))","v":"Here are three entirely random careers. Remember, not all races are permitted to enter these careers:"}]
["Agent","X",null,"X",null,null,"Basic","Bureaucrat","Social","Urban","Core",null,"Int","Fel","Once per session, you may suffer one stress and one fatigue to add an expertise die to any skill check.",null,null,"Agent","Agitator","Agent","Apothecary","Apothecary","Choose a career…",null,{"$f":"IF('Character Creator'!C2=\"Reiklander\",INDEX(R4:R45,RANDBETWEEN(1,COUNTA(R4:R45)),1),IF('Character Creator'!C2=\"Dwarf\",INDEX(T4:T40,RANDBETWEEN(1,COUNTA(T4:T40)),1),IF('Character Creator'!C2=\"High Elf\",INDEX(U4:U26,RANDBETWEEN(1,COUNTA(U4:U26)),1),IF('Character Creator'!C2=\"Wood Elf\",INDEX(V4:V19,RANDBETWEEN(1,COUNTA(V4:V19)),1),IF('Character Creator'!C2=\"Halfling\",INDEX(S4:S24,RANDBETWEEN(1,COUNTA(S4:S24)),1),IF('Character Creator'!C2=\"Ogre\",\"Maneater\",INDEX(A4:A57,RANDBETWEEN(1,COUNTA(A4:A57)),1)))))))","v":"Ironbreaker"},{"$f":"IF('Character Creator'!C2=\"Reiklander\",INDEX(R4:R45,RANDBETWEEN(1,COUNTA(R4:R45)),1),IF('Character Creator'!C2=\"Dwarf\",INDEX(T4:T40,RANDBETWEEN(1,COUNTA(T4:T40)),1),IF('Character Creator'!C2=\"High Elf\",INDEX(U4:U26,RANDBETWEEN(1,COUNTA(U4:U26)),1),IF('Character Creator'!C2=\"Wood Elf\",INDEX(V4:V19,RANDBETWEEN(1,COUNTA(V4:V19)),1),IF('Character Creator'!C2=\"Halfling\",INDEX(S4:S24,RANDBETWEEN(1,COUNTA(S4:S24)),1),IF('Character Creator'!C2=\"Ogre\",\"Maneater\",INDEX(A4:A57,RANDBETWEEN(1,COUNTA(A4:A57)),1)))))))","v":"Waywatcher"},{"$f":"IF('Character Creator'!C2=\"Reiklander\",INDEX(R4:R45,RANDBETWEEN(1,COUNTA(R4:R45)),1),IF('Character Creator'!C2=\"Dwarf\",INDEX(T4:T40,RANDBETWEEN(1,COUNTA(T4:T40)),1),IF('Character Creator'!C2=\"High Elf\",INDEX(U4:U26,RANDBETWEEN(1,COUNTA(U4:U26)),1),IF('Character Creator'!C2=\"Wood Elf\",INDEX(V4:V19,RANDBETWEEN(1,COUNTA(V4:V19)),1),IF('Character Creator'!C2=\"Halfling\",INDEX(S4:S24,RANDBETWEEN(1,COUNTA(S4:S24)),1),IF('Character Creator'!C2=\"Ogre\",\"Maneater\",INDEX(A4:A57,RANDBETWEEN(1,COUNTA(A4:A57)),1)))))))","v":"Apprentice Runesmith"},{"$f":"IF('Character Creator'!C2=\"Ogre\", \"Maneater\", CONCATENATE(Y4,\", \",Z4,\", or \", AA4))","v":"Ironbreaker, Waywatcher, or Apprentice Runesmith"}]
["Agitator","X","X","X",null,null,"Basic","Rogue","Social","Urban","Core",null,"Int","Fel","Your social initiative checks gain two fortune dice.",null,null,"Agitator","Apothecary","Agitator","Boatman","Bounty Hunter"]
["Apothecary","X","X","X","X","X","Academic","Basic","Menial","Specialist","Winds of Magic",null,"Int","Tou","Add a fortune die to determine the effects of any healing draught you imbibe or administer to another character.",null,null,"Apothecary","Boatman","Apothecary","Bounty Hunter","Envoy"]
["Apprentice Runesmith",null,null,"X",null,null,"Academic","Basic","Runesmith","Specialist","Blackfire Pass",null,"Int","WP","You may purchase Rune cards as Talents. You may create runic items with 1 rune each.",null,null,"Apprentice Wizard","Commoner","Apprentice Runesmith","Burgher","Hunter"]
["Apprentice Wizard","X",null,null,null,null,"Academic","Arcane","Basic","Wizard","Core",null,"Int","WP","Spellcraft checks for Rank 1 or lower Spells gain a fortune die.",null,null,"Bailiff","Dockhand","Bailiff","Courtier","Mercenary"]
["Bailiff","X",null,"X",null,null,"Basic","Bureaucrat","Social","Urban","Adventurers Toolkit",null,"Tou","Fel","Add 1 fortune point to the party's fortune pool the first time you suffer stress during an encounter.",null,null,"Barber-Surgeon","Forger","Barber-Surgeon","Dilettante","Messenger"]
["Barber-Surgeon","X",null,"X",null,null,"Basic","Social","Specialist","Urban","Core",null,"Int","Fel","Once per session, you may add an expertise die to any First Aid or Medicine check.",null,null,"Boatman","Gambler","Boatman","Envoy","Mystic"]
{"$rows_left_out":48}
{"sheet":"Skills","index":2,"n_rows":57,"n_cols":12,"rows_kept":57,"cut":false,"hidden":false,"merged":[[1,9,1,12]]}
[]
[null,null,null,null,null,null,null,null,null,"Skill Specialization List"]
[null,"Choose a career…","","","","","","","","Skills","Stat","Possible Specializations"]
[null,"Agent","Charm","Education","Folklore","Guile","Intuition",null,{"$f":"CONCATENATE(C4,\", \",D4,\", \",E4,\", \",F4,\", \",G4)","v":"Charm, Education, Folklore, Guile, Intuition"},"Animal Handling","(Fel)","Command, Train, Sense Disposition, Calm Animal"]
[null,"Agitator","Charm","Guile","Intuition","Leadership","Observation",null,{"$f":"CONCATENATE(C5,\", \",D5,\", \",E5,\", \",F5,\", \",G5)","v":"Charm, Guile, Intuition, Leadership, Observation"},"Athletics","(Str)","Climbing, Swimming, Jumping, Rowing, Running, Lifting"]
[null,"Apothecary","Folklore","First Aid","Intuition","Nature Lore","Observation",null,"Folklore, First Aid, Intuition, Nature Lore, Observation","Ballistic Skill","(Agi)","Bow, Crossbow, Thrown Weapons, Blackpowder Weapons, Sling"]
[null,"Apprentice Runesmith","Discipline","Education","Intuition","Observation","Tradecraft",null,"Discipline, Education, Intuition, Observation, Tradecraft","Channelling","(Wp)","Below Capacity, Overchanneling, Conservative, Reckless, by college order"]
[null,"Apprentice Wizard","Channelling","Discipline","Education","Intuition","Magical Sight, Observation, Spellcraft",null,"Channelling, Discipline, Education, Intuition, Magical Sight, Observation, Spellcraft","Charm","(Fel)","Etiquette, Gossip, Diplomacy, Haggling, Seduction, Beg, Public Speaking"]
[null,"Bailiff","Charm","Folklore","Guile","Intimidate","Resilience",null,"Charm, Folklore, Guile, Intimidate, Resilience","Coordination","(Agi)","Dodge, Balance, Acrobatics, Juggling, Dance, Knots & Ropework, Scale Sheer Surfaces"]
[null,"Barber-Surgeon","Charm","Discipline","First Aid","Folklore","Leadership",null,"Charm, Discipline, First Aid, Folklore, Leadership","Discipline","(Wp)","Resist Charm, Resist Guile, Resist Intimidate, Resist Fear, Resist Terror, Resist Torture"]
{"$rows_left_out":48}
{"sheet":"Names","index":3,"n_rows":300,"n_cols":22,"rows_kept":300,"cut":false,"hidden":false,"merged":[[1,5,1,6]]}
["Imperial Male Names","Imperial Female Names","Imperial Surnames",null,null,null,null,null,"Dwarf Element 1","Element 2 (Male)","Element 2 (Female)",null,"Elf Element 1","Elf Connectors","Element 2 (Male)","Element 2 (Female)","Elf Surnames",null,"Halfling Element 1","Element 2 (Male)","Element 2 (Female)","Halfling Surnames"]
["Abelhard","Abbie","Adelhof",null,"Your Name:",{"$f":"IF('Character Creator'!A2=\"Reiklander\",Names!F7,IF('Character Creator'!A2=\"Dwarf\",Names!F9,IF('Character Creator'!A2=\"High Elf\",Names!F11,IF('Character Creator'!A2=\"Wood Elf\",Names!F11,IF('Character Creator'!A2=\"Halfling\",Names!F13,IF('Character Creator'!A2=\"Choose your race...\",\"You need to choose a race first.\",\"Names are not supported for that race.\"))))))","v":"You need to choose a race first."},null,null,"Al","bin","bina",null,"Aed","a","baen","a","Blackcairn",null,"Bag","belly","a","Alderberry"]
["Abelhelm","Abighild","Albrecht",null,null,null,null,null,"Ath","bor","bora",null,"Ael","al","baine","aine","Blackwood",null,"Balf","er","adell","Alepuddle"]
["Admund","Abigund","Allenstag",null,null,null,null,null,"Athran","dil","dila",null,"Aelf","an","baire","am","Blackbough",null,"Berc","fast","alor","Appleback"]
["Adred","Abigunda","Altmann",null,null,null,null,null,"Bal","din","dina",null,"Aen","ar","bar","ann","Bluefeather",null,"Bill","in","apple","Barleycorn"]
["Adric","Ada","Atzwig",null,null,null,null,null,"Bala","dok","dokina",null,"Aeth","as","bhir","arma","Bluewing",null,"Bobb","it","bell","Barncock"]
["Agis","Adel","Bacher",null,"Imperial Male Name:",{"$f":"CONCATENATE(INDEX(A2:A300,RANDBETWEEN(1,COUNTA(A2:A300))), \" \", INDEX(C2:C101,RANDBETWEEN(1,COUNTA(C2:C101))))","v":"Ingwald Jaeger"},null,null,"Bara","dor","dora",null,"Alth","e","brier","arna","Boldheart",null,"Bodg","mutch","berry","Bayleaf"]
["Alaric","Adelind","Baer",null,"Imperial Female Name:",{"$f":"CONCATENATE(INDEX(B2:B300,RANDBETWEEN(1,COUNTA(B2:B300))), \" \", INDEX(C2:C101,RANDBETWEEN(1,COUNTA(C2:C101))))","v":"Emerlyn Weber"},null,null,"Bel","drin","drinella",null,"An","el","brior","arth","Boldspear",null,"Bog","o","eena","Bloomberry"]
["Alberic","Adeline","Baumann",null,"Dwarven Male Name:",{"$f":"CONCATENATE((INDEX(I2:I101,RANDBETWEEN(1,COUNTA(I2:I101)))),(INDEX(J2:J55,RANDBETWEEN(1,COUNTA(J2:J55)))), \" (son of \",(INDEX(I2:I101,RANDBETWEEN(1,COUNTA(I2:I101)))),(INDEX(J2:J55,RANDBETWEEN(1,COUNTA(J2:J55)))), \")\")","v":"Norangan (son of Firengar)"},null,null,"Bela","fin","fina",null,"And","en","brin","ath","Bravehelm",null,"Bom","odoc","ella","Bracebelly"]
["Albrecht","Adelyn","Becker",null,"Dwarven Female Name:",{"$f":"CONCATENATE((INDEX(I2:I101,RANDBETWEEN(1,COUNTA(I2:I101)))),(INDEX(K2:K55,RANDBETWEEN(1,COUNTA(K2:K55)))), \" (daughter of \",(INDEX(I2:I101,RANDBETWEEN(1,COUNTA(I2:I101)))),(INDEX(K2:K55,RANDBETWEEN(1,COUNTA(K2:K55)))), \")\")","v":"Ullatrekina (daughter of Athranmira)"},null,null,"Ber","gan","fya",null,"Ar","er","daen","beann","Bravestar",null,"Bonn","riadoc","era","Braidgirdle"]
{"$rows_left_out":291}
{"sheet":"Race","index":4,"n_rows":22,"n_cols":10,"rows_kept":22,"cut":false,"hidden":false,"merged":[]}
["Starting Points",null,"Ability Header","Ability #1","Ability #2","Ability #3","Ability #4","Ability #5","Ability #6"]
[20,"Choose your race...","","","","","","","",""]
[25,"Human (Reiklander)","Reiklander Special Abilities","Adaptable: Career transitions for Reiklanders cost one less advance, which may reduce a career transition to zero advances","Diversity: At character creation, all humans begin with 25 creation points","Favoured by Fate: Once per session, a Reiklander may add two fortune dice to any single check","","","","Here are the three careers a Reiklander is permitted to take:"]
[25,"Human (Averlander)","Averlander Special Abilities","Diversity: At character creation, all humans begin with 25 creation points","Greenskinners: Each time an Averlander kills a non-henchman greenskin, he may recover either 1 stress or 1 fatigue or may perform a free manoeuvre","Superior Stock: The Strength score of any horse ridden by an Averlander is increased by 1.","","","","Here are the three careers an Averlander is permitted to take:"]
[25,"Human (Hochlander)","Hochlander Special Abilities","Diversity: At character creation, all humans begin with 25 creation points","Marksmen: When a Hochlander spends a fortune point on a Ballistic Skill check with a weapon with which he is specialised, he adds an expertise die to the check instead of a fortune die.","Rustic Composure: Hochlanders gain two fortune dice on initiative checks when in a rural setting.","","","","Here are the three careers a Hochlander is permitted to take:"]
[25,"Human (Middenlander)","Middenlander Special Abilities","Diversity: At character creation, all humans begin with 25 creation points","Slayers of Beastmen: All of a Middenlander's  Melee Attacks  or  Ranged Attacks, or  Spells or  Blessings that target the defence of a beastman gains: Two boons = +2 damage","Spirit of the Wolf: Once per session, when targeted by an attack, a Middenlander may increase his defence value by an amount equal to his Agility.","","","","Here are the three careers a Middenlander is permitted to take:"]
[25,"Human (Nordlander)","Nordlander Special Abilities","Diversity: At character creation, all humans begin with 25 creation points","Nautical: Nordlanders add a fortune die to any check made to handle a boat, navigate a ship, swim, or work with ropes.","Northerners: Two fewer misfortune dice are added to a Nordlander's dice pool for any effects from cold, wind or bad weather.","","","","Here are the three careers a Nordlander is permitted to take:"]
[25,"Human (Ostermarker)","Ostermark Special Abilities","Diversity: At character creation, all humans begin with 25 creation points","Monster Slayers: Ostermarkers gain a fortune die to all Melee Attacks or Ranged Attacks, or Spells or Blessings that target the defence of any creature with a Fear or Terror rating.","Stoic Defenders: Add a misfortune die to all Melee Attacks or Ranged Attacks, or Spells or Blessings that target the defence of an Ostermarker whenever he is outnumbered.","","","","Here are the three careers an Ostermarker is permitted to take:"]
[25,"Human (Ostlander)","Ostlander Special Abilities","Diversity: At character creation, all humans begin with 25 creation points","Fighters Against Chaos: Ostlanders treat the difficulty of all Fear ratings of foes aligned to Chaos as 1 less than normal (to a minimum of 1). In addition, the Terror ratings of foes aligned to Chaos are treated as Fear ratings instead (but do not have their rating reduced).","Stubborn: Ostlanders' mental characteristics are considered to be one higher for the purposes of determining whether that characteristic is distressed.","","","","Here are the three careers an Ostlander is permitted to take:"]
[25,"Human (Stirlander)","Stirlander Special Abilities","Diversity: At character creation, all humans begin with 25 creation points","Hatred of the Undead: Stirlanders gain the Invigorated condition whenever they are within long range of Undead.","Poor: During character creation, it costs 3 creation points for a Stirlander to start as comfortable, and 4 to start as affluent","Unflinching: Stirlanders treat the difficulty of all Fear ratings of Undead as 1 less than normal (to a minimum of 1). In addition, the Terror ratings of Undead are treated as Fear ratings instead (but do not have their rating reduced).","","","Here are the three careers a Stirlander is permitted to take:"]
{"$rows_left_out":13}
{"sheet":"Notes","index":5,"n_rows":8,"n_cols":3,"rows_kept":8,"cut":false,"hidden":false,"merged":[[2,2,2,16],[5,2,5,16],[3,2,4,13],[6,2,6,16],[1,1,1,4]]}
[]
[null,"List of things that aren't finished:"]
[null,null,"Ogres are not yet active"]
[null,null,"I have yet to add a switch to allow you to choose females names of any race (and only a third of human female names are coded; all others are done)"]
[]
[null,null,"I am looking to update the formula to prevent the user from raising a stat beyond 5. This is more of a wish-list item."]
[null,null,"I am looking to update the formula to prevent the user from spending points down to less-than-zero. This is more of a wish-list item."]
[null,null,"I have no easy-to-use resource regarding Ogre names so they probably wont get added at all. "]