{"text_format":"1","workbook":"xlsx","n_sheets":3,"sheets":["Gold Earned ","Items Bought","Tables"],"not_rendered":{"charts":0,"images":0,"macros":1,"external_links":0,"defined_names":1,"comments":0,"pivot_tables":0},"unopened":[],"bounds":{"document_bytes":16777216,"sheet_cells":100000,"rows_first":2000,"rows_last":500,"rows_between":2000,"halvings":0,"cell_chars":16384,"cell_head_chars":4096},"cells_cut":0,"cells_raw":0,"read":"whole","date_system":"1900"}

{"sheet":"Gold Earned ","index":0,"n_rows":175,"n_cols":5,"rows_kept":175,"cut":false,"hidden":false,"merged":[[65,1,65,2],[81,1,81,2],[1,1,1,2],[17,1,17,2],[33,1,33,2],[49,1,49,2],[97,1,97,2],[113,1,113,2],[129,1,129,2],[145,1,145,2],[161,1,161,2],[1,3,1,4],[17,3,17,4],[33,3,33,4],[49,3,49,4],[65,3,65,4],[161,3,161,4],[81,3,81,4],[97,3,97,4],[113,3,113,4],[129,3,129,4],[145,3,145,4]]}
[]
[null,"Level 1"]
[null,"Adventure # ","Gold Earn","PP Earn","Fame"]
[null,"Starting",150,0,0]
[null,1,null,null,{"$f":"D5","v":0}]
[null,2,null,null,{"$f":"D6","v":0}]
[null,3,null,null,{"$f":"D7","v":0}]
[null,4,null,null,{"$f":"D8","v":0}]
[null,5,null,null,0]
[null,6,null,null,0]
[null,"Total",{"$f":"SUM(C4:C10)","v":150},{"$f":"SUM(D4:D10)","v":0},{"$f":"SUM(E4:E10)","v":0}]
[null,"Spent",{"$f":"SUM('Items Bought'!D5:D21)","v":0},{"$f":"SUM('Items Bought'!E5:E21)","v":0},"n/a"]
[null,"Sell Back",{"$f":"SUM('Items Bought'!J5:J21)","v":0},"n/a","n/a"]
[null,"Ending Total",{"$f":"C11-C12+C13","v":150},{"$f":"D11-D12","v":0},{"$f":"E11","v":0}]
[null,"Max Item:",{"$f":"LOOKUP(E11,Tables!B$4:B$103,Tables!C$4:C$103)","v":0}]
[]
[]
[null,"Level 2"]
[null,"Adventure # ","Gold Earn","PP Earn","Fame"]
[null,"Starting",{"$f":"C14","v":150},{"$f":"D14","v":0},{"$f":"E14","v":0}]
[null,1,null,null,{"$f":"D21","v":0}]
[null,2,null,null,{"$f":"D22","v":0}]
[null,3,null,null,{"$f":"D23","v":0}]
[null,4,null,null,{"$f":"D24","v":0}]
[null,5,null,null,0]
[null,6,null,null,0]
[null,"Total",{"$f":"SUM(C20:C26)","v":150},{"$f":"SUM(D20:D26)","v":0},0]
[null,"Spent",{"$f":"SUM('Items Bought'!D21:D55)","v":0},{"$f":"SUM('Items Bought'!E21:E55)","v":0},"n/a"]
[null,"Sell Back",{"$f":"SUM('Items Bought'!J21:J55)","v":0},"n/a","n/a"]
[null,"Ending Total",{"$f":"C27-C28+C29","v":150},{"$f":"D27-D28","v":0},{"$f":"E27","v":0}]
[null,"Max Item:",{"$f":"LOOKUP(E27,Tables!B$4:B$103,Tables!C$4:C$103)","v":0}]
[]
[]
[null,"Level 3"]
[null,"Adventure # ","Gold Earn","PP Earn","Fame"]
[null,"Starting",{"$f":"C30","v":150},{"$f":"D30","v":0},{"$f":"E30","v":0}]
[null,1,null,null,{"$f":"D37","v":0}]
[null,2,null,null,{"$f":"D38","v":0}]
[null,3,null,null,{"$f":"D39","v":0}]
[null,4,null,null,{"$f":"D40","v":0}]
[null,5,null,null,0]
[null,6,null,null,0]
[null,"Total",{"$f":"SUM(C36:C42)","v":150},{"$f":"SUM(D36:D42)","v":0},{"$f":"SUM(E36:E42)","v":0}]
[null,"Spent",{"$f":"SUM('Items Bought'!D55:D89)","v":0},{"$f":"SUM('Items Bought'!E55:E89)","v":0},"n/a"]
[null,"Sell Back",{"$f":"SUM('Items Bought'!J55:J89)","v":0},"n/a","n/a"]
[null,"Ending Total",{"$f":"C43-C44+C45","v":150},{"$f":"D43-D44","v":0},{"$f":"E43","v":0}]
[null,"Max Item:",{"$f":"LOOKUP(E43,Tables!B$4:B$103,Tables!C$4:C$103)","v":0}]
[]
[]
[null,"Level 4"]
[null,"Adventure # ","Gold Earn","PP Earn","Fame"]
[null,"Starting",{"$f":"C46","v":150},{"$f":"D46","v":0},{"$f":"E46","v":0}]
[null,1,null,null,{"$f":"D53","v":0}]
[null,2,null,null,{"$f":"D54","v":0}]
[null,3,null,null,{"$f":"D55","v":0}]
[null,4,null,null,{"$f":"D56","v":0}]
[null,5,null,null,0]
[null,6,null,null,0]
[null,"Total",{"$f":"SUM(C52:C58)","v":150},{"$f":"SUM(D52:D58)","v":0},{"$f":"SUM(E52:E58)","v":0}]
[null,"Spent",{"$f":"SUM('Items Bought'!D89:D123)","v":0},{"$f":"SUM('Items Bought'!E89:E123)","v":0},"n/a"]
{"$rows_left_out":116}
{"sheet":"Items Bought","index":1,"n_rows":430,"n_cols":11,"rows_kept":430,"cut":false,"hidden":false,"merged":[[307,6,307,7],[308,6,308,7],[296,6,296,7],[297,6,297,7],[298,6,298,7],[299,6,299,7],[301,6,301,7],[302,6,302,7],[303,6,303,7],[304,6,304,7],[305,6,305,7],[4,6,4,7],[5,6,5,7],[14,6,14,7],[43,6,43,7],[133,6,133,7],[127,6,127,7],[88,6,88,7],[94,6,94,7],[49,6,49,7],[55,6,55,7],[82,6,82,7],[121,6,121,7],[125,6,125,7],[131,6,131,7],[123,6,123,7],[20,6,20,7],[47,6,47,7],[53,6,53,7],[59,6,59,7],[86,6,86,7],[92,6,92,7],[98,6,98,7],[16,6,16,7],[10,6,10,7],[359,6,359,7],[365,6,365,7],[371,6,371,7],[399,6,399,7],[208,6,208,7],[239,6,239,7],[240,6,240,7],[241,6,241,7],[242,6,242,7],[248,6,248,7],[254,6,254,7],[281,6,281,7],[287,6,287,7],[362,6,362,7],[277,6,277,7],[283,6,283,7],[289,6,289,7],[316,6,316,7],[322,6,322,7],[328,6,328,7],[320,6,320,7],[326,6,326,7],[286,6,286,7],[317,6,317,7],[6,6,6,7],[7,6,7,7],[8,6,8,7],[11,6,11,7],[12,6,12,7],[13,6,13,7],[17,6,17,7],[18,6,18,7],[19,6,19,7],[64,6,64,7],[65,6,65,7],[67,6,67,7],[68,6,68,7],[69,6,69,7],[70,6,70,7],[71,6,71,7],[73,6,73,7],[74,6,74,7],[357,6,357,7],[358,6,358,7],[95,6,95,7],[134,6,134,7],[173,6,173,7],[212,6,212,7],[290,6,290,7],[363,6,363,7],[318,6,318,7],[319,6,319,7],[323,6,323,7],[324,6,324,7],[325,6,325,7],[356,6,356,7],[329,6,329,7],[252,6,252,7],[278,6,278,7],[279,6,279,7],[280,6,280,7],[284,6,284,7],[285,6,285,7],[169,6,169,7],[200,6,200,7],[96,6,96,7],[187,6,187,7],[188,6,188,7],[408,6,408,7],[409,6,409,7],[410,6,410,7],[369,6,369,7],[370,6,370,7],[330,6,330,7],[331,6,331,7],[403,6,403,7],[404,6,404,7],[364,6,364,7],[396,6,396,7],[397,6,397,7],[398,6,398,7],[402,6,402,7],[368,6,368,7],[355,6,355,7],[361,6,361,7],[367,6,367,7],[395,6,395,7],[401,6,401,7],[407,6,407,7],[405,6,405,7],[122,6,122,7],[124,6,124,7],[128,6,128,7],[129,6,129,7],[130,6,130,7],[161,6,161,7],[135,6,135,7],[136,6,136,7],[215,6,215,7],[137,6,137,7],[164,6,164,7],[170,6,170,7],[162,6,162,7],[163,6,163,7],[167,6,167,7],[168,6,168,7],[160,6,160,7],[166,6,166,7],[172,6,172,7],[139,6,139,7],[140,6,140,7],[141,6,141,7],[142,6,142,7],[143,6,143,7],[22,6,22,7],[23,6,23,7],[24,6,24,7],[25,6,25,7],[26,6,26,7],[28,6,28,7],[29,6,29,7],[30,6,30,7],[31,6,31,7],[32,6,32,7],[34,6,34,7],[35,6,35,7],[36,6,36,7],[37,6,37,7],[38,6,38,7],[61,6,61,7],[62,6,62,7],[63,6,63,7],[44,6,44,7],[45,6,45,7],[46,6,46,7],[50,6,50,7],[51,6,51,7],[52,6,52,7],[56,6,56,7],[57,6,57,7],[58,6,58,7],[75,6,75,7],[76,6,76,7],[77,6,77,7],[100,6,100,7],[101,6,101,7],[102,6,102,7],[103,6,103,7],[104,6,104,7],[106,6,106,7],[97,6,97,7],[83,6,83,7],[84,6,84,7],[85,6,85,7],[89,6,89,7],[90,6,90,7],[91,6,91,7],[107,6,107,7],[108,6,108,7],[109,6,109,7],[110,6,110,7],[112,6,112,7],[113,6,113,7],[114,6,114,7],[115,6,115,7],[116,6,116,7],[145,6,145,7],[146,6,146,7],[147,6,147,7],[148,6,148,7],[149,6,149,7],[151,6,151,7],[152,6,152,7],[153,6,153,7],[154,6,154,7],[155,6,155,7],[178,6,178,7],[179,6,179,7],[180,6,180,7],[181,6,181,7],[182,6,182,7],[184,6,184,7],[185,6,185,7],[186,6,186,7],[174,6,174,7],[175,6,175,7],[176,6,176,7],[190,6,190,7],[191,6,191,7],[192,6,192,7],[193,6,193,7],[194,6,194,7],[217,6,217,7],[218,6,218,7],[219,6,219,7],[220,6,220,7],[213,6,213,7],[214,6,214,7],[201,6,201,7],[202,6,202,7],[206,6,206,7],[207,6,207,7],[203,6,203,7],[199,6,199,7],[205,6,205,7],[211,6,211,7],[209,6,209,7],[221,6,221,7],[223,6,223,7],[224,6,224,7],[225,6,225,7],[226,6,226,7],[227,6,227,7],[229,6,229,7],[230,6,230,7],[231,6,231,7],[232,6,232,7],[233,6,233,7],[256,6,256,7],[257,6,257,7],[258,6,258,7],[259,6,259,7],[260,6,260,7],[262,6,262,7],[263,6,263,7],[253,6,253,7],[245,6,245,7],[246,6,246,7],[247,6,247,7],[251,6,251,7],[238,6,238,7],[250,6,250,7],[244,6,244,7],[264,6,264,7],[265,6,265,7],[266,6,266,7],[268,6,268,7],[269,6,269,7],[270,6,270,7],[271,6,271,7],[272,6,272,7],[295,6,295,7],[291,6,291,7],[293,6,293,7],[292,6,292,7],[309,6,309,7],[310,6,310,7],[311,6,311,7],[334,6,334,7],[335,6,335,7],[336,6,336,7],[337,6,337,7],[338,6,338,7],[340,6,340,7],[332,6,332,7],[341,6,341,7],[342,6,342,7],[343,6,343,7],[344,6,344,7],[346,6,346,7],[347,6,347,7],[348,6,348,7],[349,6,349,7],[350,6,350,7],[373,6,373,7],[374,6,374,7],[375,6,375,7],[376,6,376,7],[377,6,377,7],[379,6,379,7],[380,6,380,7],[381,6,381,7],[382,6,382,7],[383,6,383,7],[385,6,385,7],[386,6,386,7],[387,6,387,7],[388,6,388,7],[389,6,389,7],[413,6,413,7],[414,6,414,7],[415,6,415,7],[411,6,411,7],[427,6,427,7],[428,6,428,7],[429,6,429,7],[416,6,416,7],[417,6,417,7],[419,6,419,7],[420,6,420,7],[421,6,421,7],[422,6,422,7],[423,6,423,7],[425,6,425,7],[426,6,426,7]]}
[]
[null,"Level 1"]
[null,"Adventure","Description","Gold","PP","Status",null,null,null,"Sell Back"]
[null,1,null,null,null,null,"Max Item:",{"$f":"LOOKUP(I4,Tables!B$4:B$103,Tables!C$4:C$103)","v":0},{"$f":"SUM('Gold Earned '!D4:D5)","v":0}]
[null,"Insert Date",null,null,null,"Choose One",{"$f":"IF(AND(D5>H$4,F5<>\"Bought Common\",F5<>\"Sold Common\", F5<>\"Expended Common\"), \"NOT VAILD\", \"-\")","v":"-"},null,null,{"$f":"IF(OR(F5=\"Sold\",F5=\"Sold Common\"),K5,\"-\")","v":"-"},{"$f":"D5/2","v":0}]
[null,"Insert Date",null,null,null,"Choose One",{"$f":"IF(AND(D6>H$4,F6<>\"Bought Common\",F6<>\"Sold Common\", F6<>\"Expended Common\"), \"NOT VAILD\", \"-\")","v":"-"},null,null,{"$f":"IF(OR(F6=\"Sold\",F6=\"Sold Common\"),K6,\"-\")","v":"-"},0]
[null,"Insert Date",null,null,null,"Choose One",{"$f":"IF(AND(D7>H$4,F7<>\"Bought Common\",F7<>\"Sold Common\", F7<>\"Expended Common\"), \"NOT VAILD\", \"-\")","v":"-"},null,null,{"$f":"IF(OR(F7=\"Sold\",F7=\"Sold Common\"),K7,\"-\")","v":"-"},0]
[null,"Insert Date",null,null,null,"Choose One",{"$f":"IF(AND(D8>H$4,F8<>\"Bought Common\",F8<>\"Sold Common\", F8<>\"Expended Common\"), \"NOT VAILD\", \"-\")","v":"-"},null,null,{"$f":"IF(OR(F8=\"Sold\",F8=\"Sold Common\"),K8,\"-\")","v":"-"},0]
[null,"Insert Date",null,null,null,"Choose One",{"$f":"IF(AND(D9>H$4,F9<>\"Bought Common\",F9<>\"Sold Common\", F9<>\"Expended Common\"), \"NOT VAILD\", \"-\")","v":"-"},null,null,{"$f":"IF(OR(F9=\"Sold\",F9=\"Sold Common\"),K9,\"-\")","v":"-"},0]
[null,2,null,null,null,null,"Max Item:",{"$f":"LOOKUP(I10,Tables!B$4:B$103,Tables!C$4:C$103)","v":0},{"$f":"SUM('Gold Earned '!D4:D6)","v":0},null,0]
[null,"Insert Date",null,null,null,"Choose One",{"$f":"IF(AND(D11>H$10,F11<>\"Bought Common\",F11<>\"Sold Common\", F11<>\"Expended Common\"), \"NOT VAILD\", \"-\")","v":"-"},null,null,{"$f":"IF(OR(F11=\"Sold\",F11=\"Sold Common\"),K11,\"-\")","v":"-"},0]
[null,"Insert Date",null,null,null,"Choose One",{"$f":"IF(AND(D12>H$10,F12<>\"Bought Common\",F12<>\"Sold Common\", F12<>\"Expended Common\"), \"NOT VAILD\", \"-\")","v":"-"},null,null,{"$f":"IF(OR(F12=\"Sold\",F12=\"Sold Common\"),K12,\"-\")","v":"-"},0]
[null,"Insert Date",null,null,null,"Choose One",{"$f":"IF(AND(D13>H$10,F13<>\"Bought Common\",F13<>\"Sold Common\", F13<>\"Expended Common\"), \"NOT VAILD\", \"-\")","v":"-"},null,null,{"$f":"IF(OR(F13=\"Sold\",F13=\"Sold Common\"),K13,\"-\")","v":"-"},0]
[null,"Insert Date",null,null,null,"Choose One",{"$f":"IF(AND(D14>H$10,F14<>\"Bought Common\",F14<>\"Sold Common\", F14<>\"Expended Common\"), \"NOT VAILD\", \"-\")","v":"-"},null,null,{"$f":"IF(OR(F14=\"Sold\",F14=\"Sold Common\"),K14,\"-\")","v":"-"},0]
[null,"Insert Date",null,null,null,"Choose One",{"$f":"IF(AND(D15>H$10,F15<>\"Bought Common\",F15<>\"Sold Common\", F15<>\"Expended Common\"), \"NOT VAILD\", \"-\")","v":"-"},null,null,{"$f":"IF(OR(F15=\"Sold\",F15=\"Sold Common\"),K15,\"-\")","v":"-"},0]
[null,3,null,null,null,null,"Max Item:",{"$f":"LOOKUP(I16,Tables!B$4:B$103,Tables!C$4:C$103)","v":0},{"$f":"SUM('Gold Earned '!D4:D7)","v":0},null,0]
[null,"Insert Date",null,null,null,"Choose One",{"$f":"IF(AND(D17>H$16,F17<>\"Bought Common\",F17<>\"Sold Common\", F17<>\"Expended Common\"), \"NOT VAILD\", \"-\")","v":"-"},null,null,{"$f":"IF(OR(F17=\"Sold\",F17=\"Sold Common\"),K17,\"-\")","v":"-"},0]
[null,"Insert Date",null,null,null,"Choose One",{"$f":"IF(AND(D18>H$16,F18<>\"Bought Common\",F18<>\"Sold Common\", F18<>\"Expended Common\"), \"NOT VAILD\", \"-\")","v":"-"},null,null,{"$f":"IF(OR(F18=\"Sold\",F18=\"Sold Common\"),K18,\"-\")","v":"-"},0]
[null,"Insert Date",null,null,null,"Choose One",{"$f":"IF(AND(D19>H$16,F19<>\"Bought Common\",F19<>\"Sold Common\", F19<>\"Expended Common\"), \"NOT VAILD\", \"-\")","v":"-"},null,null,{"$f":"IF(OR(F19=\"Sold\",F19=\"Sold Common\"),K19,\"-\")","v":"-"},0]
[null,"Insert Date",null,null,null,"Choose One",{"$f":"IF(AND(D20>H$16,F20<>\"Bought Common\",F20<>\"Sold Common\", F20<>\"Expended Common\"), \"NOT VAILD\", \"-\")","v":"-"},null,null,{"$f":"IF(OR(F20=\"Sold\",F20=\"Sold Common\"),K20,\"-\")","v":"-"},0]
[null,"Insert Date",null,null,null,"Choose One",{"$f":"IF(AND(D21>H$16,F21<>\"Bought Common\",F21<>\"Sold Common\", F21<>\"Expended Common\"), \"NOT VAILD\", \"-\")","v":"-"},null,null,{"$f":"IF(OR(F21=\"Sold\",F21=\"Sold Common\"),K21,\"-\")","v":"-"},0]
[null,4,null,null,null,null,"Max Item:",{"$f":"LOOKUP(I22,Tables!B$4:B$103,Tables!C$4:C$103)","v":0},{"$f":"SUM('Gold Earned '!D4:D8)","v":0},null,0]
[null,"Insert Date",null,null,null,"Choose One",{"$f":"IF(AND(D23>H$16,F23<>\"Bought Common\",F23<>\"Sold Common\", F23<>\"Expended Common\"), \"NOT VAILD\", \"-\")","v":"-"},null,null,{"$f":"IF(OR(F23=\"Sold\",F23=\"Sold Common\"),K23,\"-\")","v":"-"},0]
[null,"Insert Date",null,null,null,"Choose One",{"$f":"IF(AND(D24>H$16,F24<>\"Bought Common\",F24<>\"Sold Common\", F24<>\"Expended Common\"), \"NOT VAILD\", \"-\")","v":"-"},null,null,{"$f":"IF(OR(F24=\"Sold\",F24=\"Sold Common\"),K24,\"-\")","v":"-"},0]
[null,"Insert Date",null,null,null,"Choose One",{"$f":"IF(AND(D25>H$16,F25<>\"Bought Common\",F25<>\"Sold Common\", F25<>\"Expended Common\"), \"NOT VAILD\", \"-\")","v":"-"},null,null,{"$f":"IF(OR(F25=\"Sold\",F25=\"Sold Common\"),K25,\"-\")","v":"-"},0]
[null,"Insert Date",null,null,null,"Choose One",{"$f":"IF(AND(D26>H$16,F26<>\"Bought Common\",F26<>\"Sold Common\", F26<>\"Expended Common\"), \"NOT VAILD\", \"-\")","v":"-"},null,null,{"$f":"IF(OR(F26=\"Sold\",F26=\"Sold Common\"),K26,\"-\")","v":"-"},0]
[null,"Insert Date",null,null,null,"Choose One",{"$f":"IF(AND(D27>H$16,F27<>\"Bought Common\",F27<>\"Sold Common\", F27<>\"Expended Common\"), \"NOT VAILD\", \"-\")","v":"-"},null,null,{"$f":"IF(OR(F27=\"Sold\",F27=\"Sold Common\"),K27,\"-\")","v":"-"},0]
[null,5,null,null,null,null,"Max Item:",{"$f":"LOOKUP(I28,Tables!B$4:B$103,Tables!C$4:C$103)","v":0},{"$f":"SUM('Gold Earned '!D4:D9)","v":0},null,0]
[null,"Insert Date",null,null,null,"Choose One",{"$f":"IF(AND(D29>H$16,F29<>\"Bought Common\",F29<>\"Sold Common\", F29<>\"Expended Common\"), \"NOT VAILD\", \"-\")","v":"-"},null,null,{"$f":"IF(OR(F29=\"Sold\",F29=\"Sold Common\"),K29,\"-\")","v":"-"},0]
[null,"Insert Date",null,null,null,"Choose One",{"$f":"IF(AND(D30>H$16,F30<>\"Bought Common\",F30<>\"Sold Common\", F30<>\"Expended Common\"), \"NOT VAILD\", \"-\")","v":"-"},null,null,{"$f":"IF(OR(F30=\"Sold\",F30=\"Sold Common\"),K30,\"-\")","v":"-"},0]
[null,"Insert Date",null,null,null,"Choose One",{"$f":"IF(AND(D31>H$16,F31<>\"Bought Common\",F31<>\"Sold Common\", F31<>\"Expended Common\"), \"NOT VAILD\", \"-\")","v":"-"},null,null,{"$f":"IF(OR(F31=\"Sold\",F31=\"Sold Common\"),K31,\"-\")","v":"-"},0]
[null,"Insert Date",null,null,null,"Choose One",{"$f":"IF(AND(D32>H$16,F32<>\"Bought Common\",F32<>\"Sold Common\", F32<>\"Expended Common\"), \"NOT VAILD\", \"-\")","v":"-"},null,null,{"$f":"IF(OR(F32=\"Sold\",F32=\"Sold Common\"),K32,\"-\")","v":"-"},0]
[null,"Insert Date",null,null,null,"Choose One",{"$f":"IF(AND(D33>H$16,F33<>\"Bought Common\",F33<>\"Sold Common\", F33<>\"Expended Common\"), \"NOT VAILD\", \"-\")","v":"-"},null,null,{"$f":"IF(OR(F33=\"Sold\",F33=\"Sold Common\"),K33,\"-\")","v":"-"},0]
[null,6,null,null,null,null,"Max Item:",{"$f":"LOOKUP(I34,Tables!B$4:B$103,Tables!C$4:C$103)","v":0},{"$f":"SUM('Gold Earned '!D4:D10)","v":0},null,0]
[null,"Insert Date",null,null,null,"Choose One",{"$f":"IF(AND(D35>H$16,F35<>\"Bought Common\",F35<>\"Sold Common\", F35<>\"Expended Common\"), \"NOT VAILD\", \"-\")","v":"-"},null,null,{"$f":"IF(OR(F35=\"Sold\",F35=\"Sold Common\"),K35,\"-\")","v":"-"},0]
[null,"Insert Date",null,null,null,"Choose One",{"$f":"IF(AND(D36>H$16,F36<>\"Bought Common\",F36<>\"Sold Common\", F36<>\"Expended Common\"), \"NOT VAILD\", \"-\")","v":"-"},null,null,{"$f":"IF(OR(F36=\"Sold\",F36=\"Sold Common\"),K36,\"-\")","v":"-"},0]
[null,"Insert Date",null,null,null,"Choose One",{"$f":"IF(AND(D37>H$16,F37<>\"Bought Common\",F37<>\"Sold Common\", F37<>\"Expended Common\"), \"NOT VAILD\", \"-\")","v":"-"},null,null,{"$f":"IF(OR(F37=\"Sold\",F37=\"Sold Common\"),K37,\"-\")","v":"-"},0]
[null,"Insert Date",null,null,null,"Choose One",{"$f":"IF(AND(D38>H$16,F38<>\"Bought Common\",F38<>\"Sold Common\", F38<>\"Expended Common\"), \"NOT VAILD\", \"-\")","v":"-"},null,null,{"$f":"IF(OR(F38=\"Sold\",F38=\"Sold Common\"),K38,\"-\")","v":"-"},0]
[null,"Insert Date",null,null,null,"Choose One",{"$f":"IF(AND(D39>H$16,F39<>\"Bought Common\",F39<>\"Sold Common\", F39<>\"Expended Common\"), \"NOT VAILD\", \"-\")","v":"-"},null,null,{"$f":"IF(OR(F39=\"Sold\",F39=\"Sold Common\"),K39,\"-\")","v":"-"},0]
[]
[null,"Level 2"]
[null,"Adventure","Description","Gold","PP","Status",null,null,null,"Sell Back"]
[null,1,null,null,null,null,"Max Item:",{"$f":"LOOKUP(I43,Tables!B$4:B$103,Tables!C$4:C$103)","v":0},{"$f":"SUM('Gold Earned '!D$20:D21)","v":0},null,{"$f":"D43/2","v":0}]
[null,"Insert Date",null,null,null,"Choose One",{"$f":"IF(AND(D44>H$43,F44<>\"Bought Common\",F44<>\"Sold Common\", F44<>\"Expended Common\"), \"NOT VAILD\", \"-\")","v":"-"},null,null,{"$f":"IF(OR(F44=\"Sold\",F44=\"Sold Common\"),K44,\"-\")","v":"-"},0]
[null,"Insert Date",null,null,null,"Choose One",{"$f":"IF(AND(D45>H$43,F45<>\"Bought Common\",F45<>\"Sold Common\", F45<>\"Expended Common\"), \"NOT VAILD\", \"-\")","v":"-"},null,null,{"$f":"IF(OR(F45=\"Sold\",F45=\"Sold Common\"),K45,\"-\")","v":"-"},0]
[null,"Insert Date",null,null,null,"Choose One",{"$f":"IF(AND(D46>H$43,F46<>\"Bought Common\",F46<>\"Sold Common\", F46<>\"Expended Common\"), \"NOT VAILD\", \"-\")","v":"-"},null,null,{"$f":"IF(OR(F46=\"Sold\",F46=\"Sold Common\"),K46,\"-\")","v":"-"},0]
[null,"Insert Date",null,null,null,"Choose One",{"$f":"IF(AND(D47>H$43,F47<>\"Bought Common\",F47<>\"Sold Common\", F47<>\"Expended Common\"), \"NOT VAILD\", \"-\")","v":"-"},null,null,{"$f":"IF(OR(F47=\"Sold\",F47=\"Sold Common\"),K47,\"-\")","v":"-"},0]
[null,"Insert Date",null,null,null,"Choose One",{"$f":"IF(AND(D48>H$43,F48<>\"Bought Common\",F48<>\"Sold Common\", F48<>\"Expended Common\"), \"NOT VAILD\", \"-\")","v":"-"},null,null,{"$f":"IF(OR(F48=\"Sold\",F48=\"Sold Common\"),K48,\"-\")","v":"-"},0]
[null,2,null,null,null,null,"Max Item:",{"$f":"LOOKUP(I49,Tables!B$4:B$103,Tables!C$4:C$103)","v":0},{"$f":"SUM('Gold Earned '!D$20:D22)","v":0},null,0]
[null,"Insert Date",null,null,null,"Choose One",{"$f":"IF(AND(D50>H$49,F50<>\"Bought Common\",F50<>\"Sold Common\", F50<>\"Expended Common\"), \"NOT VAILD\", \"-\")","v":"-"},null,null,{"$f":"IF(OR(F50=\"Sold\",F50=\"Sold Common\"),K50,\"-\")","v":"-"},0]
[null,"Insert Date",null,null,null,"Choose One",{"$f":"IF(AND(D51>H$49,F51<>\"Bought Common\",F51<>\"Sold Common\", F51<>\"Expended Common\"), \"NOT VAILD\", \"-\")","v":"-"},null,null,{"$f":"IF(OR(F51=\"Sold\",F51=\"Sold Common\"),K51,\"-\")","v":"-"},0]
[null,"Insert Date",null,null,null,"Choose One",{"$f":"IF(AND(D52>H$49,F52<>\"Bought Common\",F52<>\"Sold Common\", F52<>\"Expended Common\"), \"NOT VAILD\", \"-\")","v":"-"},null,null,{"$f":"IF(OR(F52=\"Sold\",F52=\"Sold Common\"),K52,\"-\")","v":"-"},0]
[null,"Insert Date",null,null,null,"Choose One",{"$f":"IF(AND(D53>H$49,F53<>\"Bought Common\",F53<>\"Sold Common\", F53<>\"Expended Common\"), \"NOT VAILD\", \"-\")","v":"-"},null,null,{"$f":"IF(OR(F53=\"Sold\",F53=\"Sold Common\"),K53,\"-\")","v":"-"},0]
[null,"Insert Date",null,null,null,"Choose One",{"$f":"IF(AND(D54>H$49,F54<>\"Bought Common\",F54<>\"Sold Common\", F54<>\"Expended Common\"), \"NOT VAILD\", \"-\")","v":"-"},null,null,{"$f":"IF(OR(F54=\"Sold\",F54=\"Sold Common\"),K54,\"-\")","v":"-"},0]
[null,3,null,null,null,null,"Max Item:",{"$f":"LOOKUP(I55,Tables!B$4:B$103,Tables!C$4:C$103)","v":0},{"$f":"SUM('Gold Earned '!D$20:D23)","v":0},null,0]
[null,"Insert Date",null,null,null,"Choose One",{"$f":"IF(AND(D56>H$55,F56<>\"Bought Common\",F56<>\"Sold Common\", F56<>\"Expended Common\"), \"NOT VAILD\", \"-\")","v":"-"},null,null,{"$f":"IF(OR(F56=\"Sold\",F56=\"Sold Common\"),K56,\"-\")","v":"-"},0]
[null,"Insert Date",null,null,null,"Choose One",{"$f":"IF(AND(D57>H$55,F57<>\"Bought Common\",F57<>\"Sold Common\", F57<>\"Expended Common\"), \"NOT VAILD\", \"-\")","v":"-"},null,null,{"$f":"IF(OR(F57=\"Sold\",F57=\"Sold Common\"),K57,\"-\")","v":"-"},0]
[null,"Insert Date",null,null,null,"Choose One",{"$f":"IF(AND(D58>H$55,F58<>\"Bought Common\",F58<>\"Sold Common\", F58<>\"Expended Common\"), \"NOT VAILD\", \"-\")","v":"-"},null,null,{"$f":"IF(OR(F58=\"Sold\",F58=\"Sold Common\"),K58,\"-\")","v":"-"},0]
[null,"Insert Date",null,null,null,"Choose One",{"$f":"IF(AND(D59>H$55,F59<>\"Bought Common\",F59<>\"Sold Common\", F59<>\"Expended Common\"), \"NOT VAILD\", \"-\")","v":"-"},null,null,{"$f":"IF(OR(F59=\"Sold\",F59=\"Sold Common\"),K59,\"-\")","v":"-"},0]
[null,"Insert Date",null,null,null,"Choose One",{"$f":"IF(AND(D60>H$55,F60<>\"Bought Common\",F60<>\"Sold Common\", F60<>\"Expended Common\"), \"NOT VAILD\", \"-\")","v":"-"},null,null,{"$f":"IF(OR(F60=\"Sold\",F60=\"Sold Common\"),K60,\"-\")","v":"-"},0]
{"$rows_left_out":371}
{"sheet":"Tables","index":2,"n_rows":103,"n_cols":5,"rows_kept":103,"cut":false,"hidden":false,"merged":[[1,1,1,2]]}
[]
[null,"Fame Table"]
[null,"Fame","Max Item",null,"Drop Table"]
[null,0,0,null,"Bought"]
[null,1,0,null,"Bought Common"]
[null,2,0,null,"Sold"]
[null,3,0,null,"Sold Common"]
[null,4,0,null,"Expended"]
[null,5,500,null,"Expended Common"]
[null,6,500,null,"Choose One"]
[null,7,500]
[null,8,500]
[null,9,1500]
[null,10,1500]
[null,11,1500]
[null,12,1500]
[null,13,3000]
[null,14,3000]
[null,15,3000]
[null,16,3000]
[null,17,3000]
[null,18,5250]
[null,19,5250]
[null,20,5250]
[null,21,5250]
[null,22,8000]
[null,23,8000]
[null,24,8000]
[null,25,8000]
[null,26,8000]
[null,27,11750]
[null,28,11750]
[null,29,11750]
[null,30,11750]
[null,31,16500]
[null,32,16500]
[null,33,16500]
[null,34,16500]
[null,35,16500]
[null,36,23000]
[null,37,23000]
[null,38,23000]
[null,39,23000]
[null,40,31000]
[null,41,31000]
[null,42,31000]
[null,43,31000]
[null,44,31000]
[null,45,41000]
[null,46,41000]
[null,47,41000]
[null,48,41000]
[null,49,54000]
[null,50,54000]
[null,51,54000]
[null,52,54000]
[null,53,54000]
[null,54,60000]
[null,55,60000]
[null,56,60000]
{"$rows_left_out":43}