Build error on Mac OSX Sierra 10.12.1

38 views
Skip to first unread message

Leo Z

unread,
Jan 25, 2017, 5:35:06 PM1/25/17
to TaintDroid
Guys,

I'm now building TaintDroid on my lab computer, it's running Mac OS 10.12.1 Sierra. make version 3.81 and Java version 1.6.0_65. I've included mac version 10.12 in the correct files. However, whatever I tried, it kept throwing me this error message:

host C++: aidl <= frameworks/base/tools/aidl/options.cpp

<built-in>:0: error: Unknown value ‘10.12’ of -mmacosx-version-min

make: *** [out/host/darwin-x86/obj/STATIC_LIBRARIES/libhost_intermediates/CopyFile.o] Error 1

make: *** Waiting for unfinished jobs....

<built-in>:0: error: Unknown value ‘10.12’ of -mmacosx-version-min<built-in>:0: error: Unknown value ‘10.12’ of -mmacosx-version-min


<built-in>:0: error: Unknown value ‘10.12’ of -mmacosx-version-min

<built-in>:0: error: Unknown value ‘10.12’ of -mmacosx-version-min

make: *** [out/host/darwin-x86/obj/EXECUTABLES/aidl_intermediates/aidl_language.o] Error 1

make: *** [out/host/darwin-x86/obj/STATIC_LIBRARIES/libhost_intermediates/pseudolocalize.o] Error 1

make: *** [out/host/darwin-x86/obj/EXECUTABLES/aidl_intermediates/options.o] Error 1

make: *** [out/host/darwin-x86/obj/EXECUTABLES/aidl_intermediates/aidl.o] Error 1



Can Anyone help me? Thank you very much!

Reply all
Reply to author
Forward
0 new messages