Problem with installation step 4

156 views
Skip to first unread message

Filippo Randazzo

unread,
Oct 18, 2015, 1:04:05 PM10/18/15
to TaintDroid
Hi, I have this result from make on step 4:

dalvik/vm/mterp/out/InterpC-portable.cpp: In function 'void dvmInterpretPortable(Thread*)':
dalvik/vm/mterp/out/InterpC-portable.cpp:2689:1: error: 'GET_REGISTER_TAINT_FLOAT' was not declared in this scope
dalvik/vm/mterp/out/InterpC-portable.cpp:2689:1: error: 'SET_REGISTER_TAINT_FLOAT' was not declared in this scope
dalvik/vm/mterp/out/InterpC-portable.cpp:3183:1: error: 'dvmSetStaticFieldTaintIntVolatile' was not declared in this scope
dalvik/vm/mterp/out/InterpC-portable.cpp:3203:1: error: 'dvmSetStaticFieldTaintLongVolatile' was not declared in this scope
dalvik/vm/mterp/out/InterpC-portable.cpp:3486:1: error: 'dvmSetStaticFieldTaintObjectVolatile' was not declared in this scope
make: *** [out/host/linux-x86/obj/SHARED_LIBRARIES/libdvm_intermediates/mterp/out/InterpC-portable.o] Errore 1

I try all solution founded on this group and in internet but not work.
I've xubuntu 14.04 and this result from gcc -v command:

Using built-in specs.
COLLECT_GCC=gcc
COLLECT_LTO_WRAPPER=/usr/lib/gcc/x86_64-linux-gnu/4.8/lto-wrapper
Target: x86_64-linux-gnu
Configured with: ../src/configure -v --with-pkgversion='Ubuntu 4.8.4-2ubuntu1~14.04' --with-bugurl=file:///usr/share/doc/gcc-4.8/README.Bugs --enable-languages=c,c++,java,go,d,fortran,objc,obj-c++ --prefix=/usr --program-suffix=-4.8 --enable-shared --enable-linker-build-id --libexecdir=/usr/lib --without-included-gettext --enable-threads=posix --with-gxx-include-dir=/usr/include/c++/4.8 --libdir=/usr/lib --enable-nls --with-sysroot=/ --enable-clocale=gnu --enable-libstdcxx-debug --enable-libstdcxx-time=yes --enable-gnu-unique-object --disable-libmudflap --enable-plugin --with-system-zlib --disable-browser-plugin --enable-java-awt=gtk --enable-gtk-cairo --with-java-home=/usr/lib/jvm/java-1.5.0-gcj-4.8-amd64/jre --enable-java-home --with-jvm-root-dir=/usr/lib/jvm/java-1.5.0-gcj-4.8-amd64 --with-jvm-jar-dir=/usr/lib/jvm-exports/java-1.5.0-gcj-4.8-amd64 --with-arch-directory=amd64 --with-ecj-jar=/usr/share/java/eclipse-ecj.jar --enable-objc-gc --enable-multiarch --disable-werror --with-arch-32=i686 --with-abi=m64 --with-multilib-list=m32,m64,mx32 --with-tune=generic --enable-checking=release --build=x86_64-linux-gnu --host=x86_64-linux-gnu --target=x86_64-linux-gnu
Thread model: posix
gcc version 4.8.4 (Ubuntu 4.8.4-2ubuntu1~14.04) 

Anyone can help me? Thank's a lot! 

Alessandro C

unread,
Oct 19, 2015, 9:19:03 AM10/19/15
to TaintDroid
Hello everyone,

I hope someone might give his/her feedback to Filippo's request as we are stuck in this point since a while.

Thank you in advance to anyone that may give an hand.

Best regards,

Alessandro

JUNG IL CHO

unread,
Oct 23, 2015, 1:03:52 AM10/23/15
to TaintDroid
Did you make build.mk which is described at Step 4 in http://appanalysis.org/download.html?
Please make build.mk file at root directory and do "make clean" and "make".


2015년 10월 19일 월요일 오후 10시 19분 3초 UTC+9, Alessandro C 님의 말:

Alessandro C

unread,
Oct 27, 2015, 5:14:49 AM10/27/15
to TaintDroid
Jung,

finally the issue on step 4 has been solved following your advice.

Thank you for your help!

Thomas Lee

unread,
Jan 8, 2017, 8:20:34 PM1/8/17
to TaintDroid
Hi, I met the same problem as you mentioned, and I wonder that you make build.mk or buildspec.mk at root directory, please give me feedback as I am stuck in this point for a long time.
Best regards,
Thomas

在 2015年10月27日星期二 UTC+8下午5:14:49,Alessandro C写道:
Reply all
Reply to author
Forward
0 new messages