The entire output to the R console gets cut off but here is what I was able to get:
C:/Users/daniel/Documents/R/win-library/3.2/BH/include/boost/type_traits/is_base_of.hpp:10:2: error: stray '\372' in program
C:/Users/daniel/Documents/R/win-library/3.2/BH/include/boost/type_traits/is_base_of.hpp:10:2: error: stray '\266' in program
C:/Users/daniel/Documents/R/win-library/3.2/BH/include/boost/type_traits/is_base_of.hpp:10:2: error: stray '\333' in program
C:/Users/daniel/Documents/R/win-library/3.2/BH/include/boost/type_traits/is_base_of.hpp:10:2: error: stray '\373' in program
C:/Users/daniel/Documents/R/win-library/3.2/BH/include/boost/type_traits/is_base_of.hpp:10:2: error: stray '\' in program
C:/Users/daniel/Documents/R/win-library/3.2/BH/include/boost/type_traits/is_base_of.hpp:10:2: error: stray '\220' in program
C:/Users/daniel/Documents/R/win-library/3.2/BH/include/boost/type_traits/is_base_of.hpp:10:2: error: stray '\332' in program
C:/Users/daniel/Documents/R/win-library/3.2/BH/include/boost/type_traits/is_base_of.hpp:10:2: error: stray '\232' in program
C:/Users/daniel/Documents/R/win-library/3.2/BH/include/boost/type_traits/is_base_of.hpp:10:2: error: stray '\' in program
C:/Users/daniel/Documents/R/win-library/3.2/BH/include/boost/type_traits/is_base_of.hpp:10:2: error: stray '\217' in program
C:/Users/daniel/Documents/R/win-library/3.2/BH/include/boost/type_traits/is_base_of.hpp:10:2: error: stray '\262' in program
C:/Users/daniel/Documents/R/win-library/3.2/BH/include/boost/type_traits/is_base_of.hpp:10:2: error: stray '\217' in program
C:/Users/daniel/Documents/R/win-library/3.2/BH/include/boost/type_traits/is_base_of.hpp:10:2: error: stray '\33' in program
C:/Users/daniel/Documents/R/win-library/3.2/BH/include/boost/type_traits/is_base_of.hpp:10:2: error: stray '\211' in program
C:/Users/daniel/Documents/R/win-library/3.2/BH/include/boost/type_traits/is_base_of.hpp:10:2: error: stray '\362' in program
C:/Users/daniel/Documents/R/win-library/3.2/BH/include/boost/type_traits/is_base_of.hpp:10:2: error: stray '\246' in program
C:/Users/daniel/Documents/R/win-library/3.2/BH/include/boost/type_traits/is_base_of.hpp:11:1: error: stray '\374' in program
C:/Users/daniel/Documents/R/win-library/3.2/BH/include/boost/type_traits/is_base_of.hpp:11:1: error: stray '\230' in program
C:/Users/daniel/Documents/R/win-library/3.2/BH/include/boost/type_traits/is_base_of.hpp:11:1: error: stray '\317' in program
C:/Users/daniel/Documents/R/win-library/3.2/BH/include/boost/type_traits/is_base_of.hpp:11:1: error: stray '\225' in program
C:/Users/daniel/Documents/R/win-library/3.2/BH/include/boost/type_traits/is_base_of.hpp:11:1: error: stray '\362' in program
C:/Users/daniel/Documents/R/win-library/3.2/BH/include/boost/type_traits/is_base_of.hpp:11:1: error: stray '\251' in program
C:/Users/daniel/Documents/R/win-library/3.2/BH/include/boost/type_traits/is_base_of.hpp:11:1: error: stray '\330' in program
C:/Users/daniel/Documents/R/win-library/3.2/BH/include/boost/type_traits/is_base_of.hpp:11:1: error: stray '\333' in program
C:/Users/daniel/Documents/R/win-library/3.2/BH/include/boost/type_traits/is_base_of.hpp:11:1: error: stray '\225' in program
C:/Users/daniel/Documents/R/win-library/3.2/BH/include/boost/type_traits/is_base_of.hpp:11:1: error: stray '\6' in program
C:/Users/daniel/Documents/R/win-library/3.2/BH/include/boost/type_traits/is_base_of.hpp:11:1: error: stray '\201' in program
C:/Users/daniel/Documents/R/win-library/3.2/BH/include/boost/type_traits/is_base_of.hpp:11:1: error: stray '\336' in program
C:/Users/daniel/Documents/R/win-library/3.2/BH/include/boost/type_traits/is_base_of.hpp:11:1: error: stray '#' in program
C:/Users/daniel/Documents/R/win-library/3.2/BH/include/boost/type_traits/is_base_of.hpp:11:1: error: stray '\216' in program
C:/Users/daniel/Documents/R/win-library/3.2/BH/include/boost/type_traits/is_base_of.hpp:11:1: error: stray '\270' in program
C:/Users/daniel/Documents/R/win-library/3.2/BH/include/boost/type_traits/is_base_of.hpp:11:1: error: stray '\242' in program
C:/Users/daniel/Documents/R/win-library/3.2/BH/include/boost/type_traits/is_base_of.hpp:11:1: error: stray '\215' in program
C:/Users/daniel/Documents/R/win-library/3.2/BH/include/boost/type_traits/is_base_of.hpp:11:1: error: stray '\2' in program
C:/Users/daniel/Documents/R/win-library/3.2/BH/include/boost/type_traits/is_base_of.hpp:11:1: error: stray '\312' in program
C:/Users/daniel/Documents/R/win-library/3.2/BH/include/boost/type_traits/is_base_of.hpp:11:1: error: stray '\305' in program
C:/Users/daniel/Documents/R/win-library/3.2/BH/include/boost/type_traits/is_base_of.hpp:11:1: error: stray '\7' in program
C:/Users/daniel/Documents/R/win-library/3.2/BH/include/boost/type_traits/is_base_of.hpp:11:1: error: stray '\270' in program
C:/Users/daniel/Documents/R/win-library/3.2/BH/include/boost/type_traits/is_base_of.hpp:11:1: error: stray '@' in program
C:/Users/daniel/Documents/R/win-library/3.2/BH/include/boost/type_traits/is_base_of.hpp:11:1: error: stray '\211' in program
C:/Users/daniel/Documents/R/win-library/3.2/BH/include/boost/type_traits/is_base_of.hpp:11:1: error: stray '\323' in program
C:/Users/daniel/Documents/R/win-library/3.2/BH/include/boost/type_traits/is_base_of.hpp:11:1: error: stray '\16' in program
C:/Users/daniel/Documents/R/win-library/3.2/BH/include/boost/type_traits/is_base_of.hpp:11:1: error: missing terminating " character
C:/Users/daniel/Documents/R/win-library/3.2/BH/include/boost/type_traits/is_base_of.hpp:12:1: error: stray '\33' in program
C:/Users/daniel/Documents/R/win-library/3.2/BH/include/boost/type_traits/is_base_of.hpp:12:1: error: stray '\340' in program
C:/Users/daniel/Documents/R/win-library/3.2/BH/include/boost/type_traits/is_base_of.hpp:12:1: error: stray '\215' in program
C:/Users/daniel/Documents/R/win-library/3.2/BH/include/boost/type_traits/is_base_of.hpp:12:1: error: stray '\6' in program
C:/Users/daniel/Documents/R/win-library/3.2/BH/include/boost/type_traits/is_base_of.hpp:12:1: error: stray '\210' in program
C:/Users/daniel/Documents/R/win-library/3.2/BH/include/boost/type_traits/is_base_of.hpp:12:1: error: stray '\224' in program
C:/Users/daniel/Documents/R/win-library/3.2/BH/include/boost/type_traits/is_base_of.hpp:12:1: error: stray '\344' in program
C:/Users/daniel/Documents/R/win-library/3.2/BH/include/boost/type_traits/is_base_of.hpp:12:1: error: stray '\361' in program
C:/Users/daniel/Documents/R/win-library/3.2/BH/include/boost/type_traits/is_base_of.hpp:12:1: error: stray '\313' in program
C:/Users/daniel/Documents/R/win-library/3.2/BH/include/boost/type_traits/is_base_of.hpp:12:1: error: stray '\310' in program
C:/Users/daniel/Documents/R/win-library/3.2/BH/include/boost/type_traits/is_base_of.hpp:12:1: error: stray '\2' in program
C:/Users/daniel/Documents/R/win-library/3.2/BH/include/boost/type_traits/is_base_of.hpp:12:1: error: stray '\264' in program
C:/Users/daniel/Documents/R/win-library/3.2/BH/include/boost/type_traits/is_base_of.hpp:12:1: error: stray '\306' in program
C:/Users/daniel/Documents/R/win-library/3.2/BH/include/boost/type_traits/is_base_of.hpp:12:1: error: stray '@' in program
C:/Users/daniel/Documents/R/win-library/3.2/BH/include/boost/type_traits/is_base_of.hpp:12:1: error: stray '\266' in program
C:/Users/daniel/Documents/R/win-library/3.2/BH/include/boost/type_traits/is_base_of.hpp:12:1: error: stray '\311' in program
C:/Users/daniel/Documents/R/win-library/3.2/BH/include/boost/type_traits/is_base_of.hpp:12:1: error: stray '\221' in program
C:/Users/daniel/Documents/R/win-library/3.2/BH/include/boost/type_traits/is_base_of.hpp:12:1: error: stray '\25' in program
C:/Users/daniel/Documents/R/win-library/3.2/BH/include/boost/type_traits/is_base_of.hpp:12:1: error: stray '\200' in program
C:/Users/daniel/Documents/R/win-library/3.2/BH/include/boost/type_traits/is_base_of.hpp:12:1: error: stray '\272' in program
C:/Users/daniel/Documents/R/win-library/3.2/BH/include/boost/type_traits/is_base_of.hpp:12:1: error: stray '\245' in program
C:/Users/daniel/Documents/R/win-library/3.2/BH/include/boost/type_traits/is_base_of.hpp:12:1: error: stray '\301' in program
C:/Users/daniel/Documents/R/win-library/3.2/BH/include/boost/type_traits/is_base_of.hpp:12:1: error: stray '\303' in program
C:/Users/daniel/Documents/R/win-library/3.2/BH/include/boost/type_traits/is_base_of.hpp:12:1: error: stray '\325' in program
C:/Users/daniel/Documents/R/win-library/3.2/BH/include/boost/type_traits/is_base_of.hpp:12:1: error: stray '\221' in program
C:/Users/daniel/Documents/R/win-library/3.2/BH/include/boost/type_traits/is_base_of.hpp:12:1: error: stray '\215' in program
C:/Users/daniel/Documents/R/win-library/3.2/BH/include/boost/type_traits/is_base_of.hpp:12:1: error: stray '\200' in program
C:/Users/daniel/Documents/R/win-library/3.2/BH/include/boost/type_traits/is_base_of.hpp:12:1: error: stray '\202' in program
C:/Users/daniel/Documents/R/win-library/3.2/BH/include/boost/type_traits/is_base_of.hpp:12:1: error: stray '\24' in program
C:/Users/daniel/Documents/R/win-library/3.2/BH/include/boost/type_traits/is_base_of.hpp:12:1: error: stray '\326' in program
C:/Users/daniel/Documents/R/win-library/3.2/BH/include/boost/type_traits/is_base_of.hpp:12:1: error: stray '\225' in program
C:/Users/daniel/Documents/R/win-library/3.2/BH/include/boost/type_traits/is_base_of.hpp:12:1: error: stray '\244' in program
C:/Users/daniel/Documents/R/win-library/3.2/BH/include/boost/type_traits/is_base_of.hpp:12:1: error: stray '\302' in program
C:/Users/daniel/Documents/R/win-library/3.2/BH/include/boost/type_traits/is_base_of.hpp:12:1: error: stray '\277' in program
C:/Users/daniel/Documents/R/win-library/3.2/BH/include/boost/type_traits/is_base_of.hpp:12:1: error: stray '\4' in program
C:/Users/daniel/Documents/R/win-library/3.2/BH/include/boost/type_traits/is_base_of.hpp:12:1: error: stray '\10' in program
C:/Users/daniel/Documents/R/win-library/3.2/BH/include/boost/type_traits/is_base_of.hpp:12:1: error: stray '\247' in program
C:/Users/daniel/Documents/R/win-library/3.2/BH/include/boost/type_traits/is_base_of.hpp:12:1: error: stray '\35' in program
C:/Users/daniel/Documents/R/win-library/3.2/BH/include/boost/type_traits/is_base_of.hpp:12:1: error: stray '\250' in program
C:/Users/daniel/Documents/R/win-library/3.2/BH/include/boost/type_traits/is_base_of.hpp:12:1: error: stray '\275' in program
C:/Users/daniel/Documents/R/win-library/3.2/BH/include/boost/type_traits/is_base_of.hpp:12:1: error: stray '\372' in program
C:/Users/daniel/Documents/R/win-library/3.2/BH/include/boost/type_traits/is_base_of.hpp:13:1: error: stray '\313' in program
C:/Users/daniel/Documents/R/win-library/3.2/BH/include/boost/type_traits/is_base_of.hpp:13:1: error: stray '\255' in program
C:/Users/daniel/Documents/R/win-library/3.2/BH/include/boost/type_traits/is_base_of.hpp:13:1: error: stray '\325' in program
C:/Users/daniel/Documents/R/win-library/3.2/BH/include/boost/type_traits/is_base_of.hpp:13:1: error: stray '\341' in program
C:/Users/daniel/Documents/R/win-library/3.2/BH/include/boost/type_traits/is_base_of.hpp:13:1: error: stray '\360' in program
C:/Users/daniel/Documents/R/win-library/3.2/BH/include/boost/type_traits/is_base_of.hpp:13:1: error: stray '\232' in program
C:/Users/daniel/Documents/R/win-library/3.2/BH/include/boost/type_traits/is_base_of.hpp:13:1: error: stray '\276' in program
C:/Users/daniel/Documents/R/win-library/3.2/BH/include/boost/type_traits/is_base_of.hpp:13:1: error: stray '\5' in program
C:/Users/daniel/Documents/R/win-library/3.2/BH/include/boost/type_traits/is_base_of.hpp:13:1: error: stray '\263' in program
C:/Users/daniel/Documents/R/win-library/3.2/BH/include/boost/type_traits/is_base_of.hpp:13:1: error: stray '\315' in program
C:/Users/daniel/Documents/R/win-library/3.2/BH/include/boost/type_traits/is_base_of.hpp:13:1: error: stray '\253' in program
C:/Users/daniel/Documents/R/win-library/3.2/BH/include/boost/type_traits/is_base_of.hpp:13:1: error: stray '\31' in program
C:/Users/daniel/Documents/R/win-library/3.2/BH/include/boost/type_traits/is_base_of.hpp:13:1: error: stray '\271' in program
C:/Users/daniel/Documents/R/win-library/3.2/BH/include/boost/type_traits/is_base_of.hpp:13:1: error: stray '\222' in program
C:/Users/daniel/Documents/R/win-library/3.2/BH/include/boost/type_traits/is_base_of.hpp:13:1: error: stray '\254' in program
C:/Users/daniel/Documents/R/win-library/3.2/BH/include/boost/type_traits/is_base_of.hpp:13:1: error: stray '\307' in program
C:/Users/daniel/Documents/R/win-library/3.2/BH/include/boost/type_traits/is_base_of.hpp:13:1: error: stray '\33' in program
C:/Users/daniel/Documents/R/win-library/3.2/BH/include/boost/type_traits/is_base_of.hpp:13:1: error: stray '\235' in program
C:/Users/daniel/Documents/R/win-library/3.2/BH/include/boost/type_traits/is_base_of.hpp:13:1: error: stray '\202' in program
C:/Users/daniel/Documents/R/win-library/3.2/BH/include/boost/type_traits/is_base_of.hpp:13:1: error: stray '\263' in program
C:/Users/daniel/Documents/R/win-library/3.2/BH/include/boost/type_traits/is_base_of.hpp:13:1: error: stray '\20' in program
C:/Users/daniel/Documents/R/win-library/3.2/BH/include/boost/type_traits/is_base_of.hpp:14:1: error: stray '\261' in program
C:/Users/daniel/Documents/R/win-library/3.2/BH/include/boost/type_traits/is_base_of.hpp:14:1: error: stray '\320' in program
C:/Users/daniel/Documents/R/win-library/3.2/BH/include/boost/type_traits/is_base_of.hpp:14:1: error: stray '\20' in program
C:/Users/daniel/Documents/R/win-library/3.2/BH/include/boost/type_traits/is_base_of.hpp:14:1: error: stray '\17' in program
C:/Users/daniel/Documents/R/win-library/3.2/BH/include/boost/type_traits/is_base_of.hpp:14:1: error: stray '\212' in program
C:/Users/daniel/Documents/R/win-library/3.2/BH/include/boost/type_traits/is_base_of.hpp:14:1: error: stray '\346' in program
C:/Users/daniel/Documents/R/win-library/3.2/BH/include/boost/type_traits/is_base_of.hpp:14:1: error: stray '\231' in program
C:/Users/daniel/Documents/R/win-library/3.2/BH/include/boost/type_traits/is_base_of.hpp:14:1: error: stray '\27' in program
C:/Users/daniel/Documents/R/win-library/3.2/BH/include/boost/type_traits/is_base_of.hpp:14:1: error: stray '\311' in program
C:/Users/daniel/Documents/R/win-library/3.2/BH/include/boost/type_traits/is_base_of.hpp:14:1: error: stray '\346' in program
C:/Users/daniel/Documents/R/win-library/3.2/BH/include/boost/type_traits/is_base_of.hpp:14:1: error: stray '\17' in program
C:/Users/daniel/Documents/R/win-library/3.2/BH/include/boost/type_traits/is_base_of.hpp:14:1: error: stray '\370' in program
C:/Users/daniel/Documents/R/win-library/3.2/BH/include/boost/type_traits/is_base_of.hpp:14:1: error: stray '\177' in program
C:/Users/daniel/Documents/R/win-library/3.2/BH/include/boost/type_traits/is_base_of.hpp:14:1: error: stray '\361' in program
C:/Users/daniel/Documents/R/win-library/3.2/BH/include/boost/type_traits/is_base_of.hpp:14:1: error: stray '\336' in program
C:/Users/daniel/Documents/R/win-library/3.2/BH/include/boost/type_traits/is_base_of.hpp:14:1: error: stray '\216' in program
C:/Users/daniel/Documents/R/win-library/3.2/BH/include/boost/type_traits/is_base_of.hpp:14:1: error: stray '\220' in program
C:/Users/daniel/Documents/R/win-library/3.2/BH/include/boost/type_traits/is_base_of.hpp:14:1: error: missing terminating " character
C:/Users/daniel/Documents/R/win-library/3.2/BH/include/boost/type_traits/is_base_of.hpp:15:1: error: stray '\233' in program
C:/Users/daniel/Documents/R/win-library/3.2/BH/include/boost/type_traits/is_base_of.hpp:15:1: error: stray '\224' in program
C:/Users/daniel/Documents/R/win-library/3.2/BH/include/boost/type_traits/is_base_of.hpp:15:1: error: stray '\35' in program
C:/Users/daniel/Documents/R/win-library/3.2/BH/include/boost/type_traits/is_base_of.hpp:15:1: error: stray '`' in program
C:/Users/daniel/Documents/R/win-library/3.2/BH/include/boost/type_traits/is_base_of.hpp:15:1: error: stray '\360' in program
C:/Users/daniel/Documents/R/win-library/3.2/BH/include/boost/type_traits/is_base_of.hpp:15:1: error: stray '\331' in program
C:/Users/daniel/Documents/R/win-library/3.2/BH/include/boost/type_traits/is_base_of.hpp:15:1: error: stray '\260' in program
C:/Users/daniel/Documents/R/win-library/3.2/BH/include/boost/type_traits/is_base_of.hpp:15:1: error: stray '\34' in program
C:/Users/daniel/Documents/R/win-library/3.2/BH/include/boost/type_traits/is_base_of.hpp:15:1: error: stray '\312' in program
C:/Users/daniel/Documents/R/win-library/3.2/BH/include/boost/type_traits/is_base_of.hpp:15:1: error: stray '\204' in program
C:/Users/daniel/Documents/R/win-library/3.2/BH/include/boost/type_traits/is_base_of.hpp:15:1: error: stray '\4' in program
C:/Users/daniel/Documents/R/win-library/3.2/BH/include/boost/type_traits/is_base_of.hpp:15:1: error: stray '\356' in program
C:/Users/daniel/Documents/R/win-library/3.2/BH/include/boost/type_traits/is_base_of.hpp:15:1: error: stray '\337' in program
C:/Users/daniel/Documents/R/win-library/3.2/BH/include/boost/type_traits/is_base_of.hpp:15:1: error: stray '\5' in program
C:/Users/daniel/Documents/R/win-library/3.2/BH/include/boost/type_traits/is_base_of.hpp:15:20: error: invalid suffix "t" on integer constant
C:/Users/daniel/Documents/R/win-library/3.2/BH/include/boost/type_traits/is_base_of.hpp:15:1: error: stray '\335' in program
C:/Users/daniel/Documents/R/win-library/3.2/BH/include/boost/type_traits/is_base_of.hpp:15:1: error: stray '\277' in program
C:/Users/daniel/Documents/R/win-library/3.2/BH/include/boost/type_traits/is_base_of.hpp:15:1: error: stray '\217' in program
C:/Users/daniel/Documents/R/win-library/3.2/BH/include/boost/type_traits/is_base_of.hpp:15:1: error: stray '\21' in program
C:/Users/daniel/Documents/R/win-library/3.2/BH/include/boost/type_traits/is_base_of.hpp:15:1: error: stray '\270' in program
C:/Users/daniel/Documents/R/win-library/3.2/BH/include/boost/type_traits/is_base_of.hpp:15:1: error: stray '\356' in program
C:/Users/daniel/Documents/R/win-library/3.2/BH/include/boost/type_traits/is_base_of.hpp:15:33: error: invalid suffix "USyNH" on integer constant
C:/Users/daniel/Documents/R/win-library/3.2/BH/include/boost/type_traits/is_base_of.hpp:15:1: error: stray '\307' in program
C:/Users/daniel/Documents/R/win-library/3.2/BH/include/boost/type_traits/is_base_of.hpp:15:1: error: stray '\302' in program
C:/Users/daniel/Documents/R/win-library/3.2/BH/include/boost/type_traits/is_base_of.hpp:15:1: error: stray '\371' in program
C:/Users/daniel/Documents/R/win-library/3.2/BH/include/boost/type_traits/is_base_of.hpp:15:1: error: stray '\360' in program
C:/Users/daniel/Documents/R/win-library/3.2/BH/include/boost/type_traits/is_base_of.hpp:15:1: error: stray '\322' in program
C:/Users/daniel/Documents/R/win-library/3.2/BH/include/boost/type_traits/is_base_of.hpp:15:1: error: stray '\316' in program
C:/Users/daniel/Documents/R/win-library/3.2/BH/include/boost/type_traits/is_base_of.hpp:15:1: error: stray '\356' in program
C:/Users/daniel/Documents/R/win-library/3.2/BH/include/boost/type_traits/is_base_of.hpp:15:1: error: stray '\27' in program
C:/Users/daniel/Documents/R/win-library/3.2/BH/include/boost/type_traits/is_base_of.hpp:15:1: error: stray '\244' in program
C:/Users/daniel/Documents/R/win-library/3.2/BH/include/boost/type_traits/is_base_of.hpp:15:1: error: stray '\276' in program
C:/Users/daniel/Documents/R/win-library/3.2/BH/include/boost/type_traits/is_base_of.hpp:15:1: error: stray '\247' in program
C:/Users/daniel/Documents/R/win-library/3.2/BH/include/boost/type_traits/is_base_of.hpp:15:1: error: stray '\236' in program
C:/Users/daniel/Documents/R/win-library/3.2/BH/include/boost/type_traits/is_base_of.hpp:15:1: error: stray '\341' in program
C:/Users/daniel/Documents/R/win-library/3.2/BH/include/boost/type_traits/is_base_of.hpp:15:1: error: stray '\306' in program
C:/Users/daniel/Documents/R/win-library/3.2/BH/include/boost/type_traits/is_base_of.hpp:15:1: error: stray '\254' in program
C:/Users/daniel/Documents/R/win-library/3.2/BH/include/boost/type_traits/is_base_of.hpp:15:1: error: stray '\27' in program
C:/Users/daniel/Documents/R/win-library/3.2/BH/include/boost/type_traits/is_base_of.hpp:15:1: error: stray '\253' in program
C:/Users/daniel/Documents/R/win-library/3.2/BH/include/boost/type_traits/is_base_of.hpp:15:1: error: stray '\243' in program
C:/Users/daniel/Documents/R/win-library/3.2/BH/include/boost/type_traits/is_base_of.hpp:15:1: error: stray '\24' in program
C:/Users/daniel/Documents/R/win-library/3.2/BH/include/boost/type_traits/is_base_of.hpp:15:1: error: missing terminating " character
C:/Users/daniel/Documents/R/win-library/3.2/BH/include/boost/type_traits/is_base_of.hpp:16:1: error: stray '\20' in program
C:/Users/daniel/Documents/R/win-library/3.2/BH/include/boost/type_traits/is_base_of.hpp:16:1: error: stray '\246' in program
C:/Users/daniel/Documents/R/win-library/3.2/BH/include/boost/type_traits/is_base_of.hpp:16:1: error: stray '\35' in program
C:/Users/daniel/Documents/R/win-library/3.2/BH/include/boost/type_traits/is_base_of.hpp:16:1: error: stray '\236' in program
C:/Users/daniel/Documents/R/win-library/3.2/BH/include/boost/type_traits/is_base_of.hpp:16:1: error: stray '\344' in program
C:/Users/daniel/Documents/R/win-library/3.2/BH/include/boost/type_traits/is_base_of.hpp:16:1: error: stray '\331' in program
C:/Users/daniel/Documents/R/win-library/3.2/BH/include/boost/type_traits/is_base_of.hpp:16:1: error: stray '\35' in program
C:/Users/daniel/Documents/R/win-library/3.2/BH/include/boost/type_traits/is_base_of.hpp:16:1: error: stray '\36' in program
C:/Users/daniel/Documents/R/win-library/3.2/BH/include/boost/type_traits/is_base_of.hpp:16:1: error: stray '\252' in program
C:/Users/daniel/Documents/R/win-library/3.2/BH/include/boost/type_traits/is_base_of.hpp:16:1: error: stray '\255' in program
C:/Users/daniel/Documents/R/win-library/3.2/BH/include/boost/type_traits/is_base_of.hpp:16:1: error: stray '\3' in program
C:/Users/daniel/Documents/R/win-library/3.2/BH/include/boost/type_traits/is_base_of.hpp:16:1: error: stray '\7' in program
C:/Users/daniel/Documents/R/win-library/3.2/BH/include/boost/type_traits/is_base_of.hpp:16:1: error: stray '\304' in program
C:/Users/daniel/Documents/R/win-library/3.2/BH/include/boost/type_traits/is_base_of.hpp:16:1: error: stray '\356' in program
C:/Users/daniel/Documents/R/win-library/3.2/BH/include/boost/type_traits/is_base_of.hpp:16:1: error: stray '\16' in program
C:/Users/daniel/Documents/R/win-library/3.2/BH/include/boost/type_traits/is_base_of.hpp:16:1: error: stray '\6' in program
C:/Users/daniel/Documents/R/win-library/3.2/BH/include/boost/type_traits/is_base_of.hpp:16:1: error: stray '\31' in program
C:/Users/daniel/Documents/R/win-library/3.2/BH/include/boost/type_traits/is_base_of.hpp:16:1: error: stray '\274' in program
C:/Users/daniel/Documents/R/win-library/3.2/BH/include/boost/type_traits/is_base_of.hpp:16:1: error: stray '\241' in program
C:/Users/daniel/Documents/R/win-library/3.2/BH/include/boost/type_traits/is_base_of.hpp:16:1: error: stray '\24' in program
C:/Users/daniel/Documents/R/win-library/3.2/BH/include/boost/type_traits/is_base_of.hpp:16:1: error: stray '\346' in program
C:/Users/daniel/Documents/R/win-library/3.2/BH/include/boost/type_traits/is_base_of.hpp:16:1: error: stray '\16' in program
C:/Users/daniel/Documents/R/win-library/3.2/BH/include/boost/type_traits/is_base_of.hpp:16:1: error: stray '\200' in program
C:/Users/daniel/Documents/R/win-library/3.2/BH/include/boost/type_traits/is_base_of.hpp:16:1: error: stray '`' in program
C:/Users/daniel/Documents/R/win-library/3.2/BH/include/boost/type_traits/is_base_of.hpp:16:1: error: stray '\5' in program
C:/Users/daniel/Documents/R/win-library/3.2/BH/include/boost/type_traits/is_base_of.hpp:16:1: error: stray '\215' in program
C:/Users/daniel/Documents/R/win-library/3.2/BH/include/boost/type_traits/is_base_of.hpp:16:1: error: stray '\325' in program
C:/Users/daniel/Documents/R/win-library/3.2/BH/include/boost/type_traits/is_base_of.hpp:16:1: error: stray '\265' in program
C:/Users/daniel/Documents/R/win-library/3.2/BH/include/boost/type_traits/is_base_of.hpp:16:1: error: stray '\261' in program
C:/Users/daniel/Documents/R/win-library/3.2/BH/include/boost/type_traits/is_base_of.hpp:16:1: error: stray '\300' in program
C:/Users/daniel/Documents/R/win-library/3.2/BH/include/boost/type_traits/is_base_of.hpp:16:1: error: stray '\323' in program
C:/Users/daniel/Documents/R/win-library/3.2/BH/include/boost/type_traits/is_base_of.hpp:16:1: error: stray '\344' in program
C:/Users/daniel/Documents/R/win-library/3.2/BH/include/boost/type_traits/is_base_of.hpp:16:1: error: stray '\365' in program
C:/Users/daniel/Documents/R/win-library/3.2/BH/include/boost/type_traits/is_base_of.hpp:16:1: error: stray '\274' in program
C:/Users/daniel/Documents/R/win-library/3.2/BH/include/boost/type_traits/is_base_of.hpp:16:1: error: stray '\215' in program
C:/Users/daniel/Documents/R/win-library/3.2/BH/include/boost/type_traits/is_base_of.hpp:16:1: error: stray '\317' in program
C:/Users/daniel/Documents/R/win-library/3.2/BH/include/boost/type_traits/is_base_of.hpp:16:1: error: stray '\227' in program
C:/Users/daniel/Documents/R/win-library/3.2/BH/include/boost/type_traits/is_base_of.hpp:16:1: error: stray '\234' in program
C:/Users/daniel/Documents/R/win-library/3.2/BH/include/boost/type_traits/is_base_of.hpp:16:1: error: stray '\226' in program
C:/Users/daniel/Documents/R/win-library/3.2/BH/include/boost/type_traits/is_base_of.hpp:16:1: error: stray '\317' in program
C:/Users/daniel/Documents/R/win-library/3.2/BH/include/boost/type_traits/is_base_of.hpp:16:1: error: stray '\234' in program
C:/Users/daniel/Documents/R/win-library/3.2/BH/include/boost/type_traits/is_base_of.hpp:16:1: error: stray '\223' in program
C:/Users/daniel/Documents/R/win-library/3.2/BH/include/boost/type_traits/is_base_of.hpp:16:1: error: stray '\370' in program
C:/Users/daniel/Documents/R/win-library/3.2/BH/include/boost/type_traits/is_base_of.hpp:16:1: error: stray '\235' in program
C:/Users/daniel/Documents/R/win-library/3.2/BH/include/boost/type_traits/is_base_of.hpp:16:1: error: stray '\16' in program
C:/Users/daniel/Documents/R/win-library/3.2/BH/include/boost/type_traits/is_base_of.hpp:16:1: error: stray '\251' in program
C:/Users/daniel/Documents/R/win-library/3.2/BH/include/boost/type_traits/is_base_of.hpp:16:1: error: stray '\306' in program
C:/Users/daniel/Documents/R/win-library/3.2/BH/include/boost/type_traits/is_base_of.hpp:16:1: error: stray '\360' in program
C:/Users/daniel/Documents/R/win-library/3.2/BH/include/boost/type_traits/is_base_of.hpp:16:1: error: stray '\374' in program
C:/Users/daniel/Documents/R/win-library/3.2/BH/include/boost/type_traits/is_base_of.hpp:16:1: error: stray '\376' in program
C:/Users/daniel/Documents/R/win-library/3.2/BH/include/boost/type_traits/is_base_of.hpp:16:1: error: stray '\365' in program
C:/Users/daniel/Documents/R/win-library/3.2/BH/include/boost/type_traits/is_base_of.hpp:16:1: error: stray '\226' in program
C:/Users/daniel/Documents/R/win-library/3.2/BH/include/boost/type_traits/is_base_of.hpp:16:1: error: stray '\345' in program
C:/Users/daniel/Documents/R/win-library/3.2/BH/include/boost/type_traits/is_base_of.hpp:16:1: error: stray '\334' in program
C:/Users/daniel/Documents/R/win-library/3.2/BH/include/boost/type_traits/is_base_of.hpp:16:1: error: stray '@' in program
C:/Users/daniel/Documents/R/win-library/3.2/BH/include/boost/type_traits/is_base_of.hpp:16:1: error: stray '\23' in program
C:/Users/daniel/Documents/R/win-library/3.2/BH/include/boost/type_traits/is_base_of.hpp:16:1: error: stray '\177' in program
C:/Users/daniel/Documents/R/win-library/3.2/BH/include/boost/type_traits/is_base_of.hpp:16:1: error: stray '\250' in program
C:/Users/daniel/Documents/R/win-library/3.2/BH/include/boost/type_traits/is_base_of.hpp:16:1: error: stray '\323' in program
C:/Users/daniel/Documents/R/win-library/3.2/BH/include/boost/type_traits/is_base_of.hpp:16:1: error: stray '\10' in program
C:/Users/daniel/Documents/R/win-library/3.2/BH/include/boost/type_traits/is_base_of.hpp:16:1: error: stray '\7' in program
C:/Users/daniel/Documents/R/win-library/3.2/BH/include/boost/type_traits/is_base_of.hpp:16:1: error: stray '\32' in program
C:/Users/daniel/Documents/R/win-library/3.2/BH/include/boost/type_traits/is_base_of.hpp:16:1: error: stray '\224' in program
C:/Users/daniel/Documents/R/win-library/3.2/BH/include/boost/type_traits/is_base_of.hpp:16:1: error: stray '\225' in program
C:/Users/daniel/Documents/R/win-library/3.2/BH/include/boost/type_traits/is_base_of.hpp:16:1: error: stray '\326' in program
C:/Users/daniel/Documents/R/win-library/3.2/BH/include/boost/type_traits/is_base_of.hpp:16:1: error: stray '\5' in program
C:/Users/daniel/Documents/R/win-library/3.2/BH/include/boost/type_traits/is_base_of.hpp:16:1: error: stray '\300' in program
C:/Users/daniel/Documents/R/win-library/3.2/BH/include/boost/type_traits/is_base_of.hpp:16:1: error: stray '\234' in program
C:/Users/daniel/Documents/R/win-library/3.2/BH/include/boost/type_traits/is_base_of.hpp:16:1: error: stray '\25' in program
C:/Users/daniel/Documents/R/win-library/3.2/BH/include/boost/type_traits/is_base_of.hpp:16:1: error: stray '\30' in program
C:/Users/daniel/Documents/R/win-library/3.2/BH/include/boost/type_traits/is_base_of.hpp:16:1: error: stray '\24' in program
C:/Users/daniel/Documents/R/win-library/3.2/BH/include/boost/type_traits/is_base_of.hpp:16:1: error: stray '\245' in program
C:/Users/daniel/Documents/R/win-library/3.2/BH/include/boost/type_traits/is_base_of.hpp:16:1: error: stray '\207' in program
C:/Users/daniel/Documents/R/win-library/3.2/BH/include/boost/type_traits/is_base_of.hpp:16:1: error: stray '\332' in program
C:/Users/daniel/Documents/R/win-library/3.2/BH/include/boost/type_traits/is_base_of.hpp:16:1: error: stray '\10' in program
C:/Users/daniel/Documents/R/win-library/3.2/BH/include/boost/type_traits/is_base_of.hpp:16:1: error: stray '\25' in program
C:/Users/daniel/Documents/R/win-library/3.2/BH/include/boost/type_traits/is_base_of.hpp:16:1: error: stray '\267' in program
C:/Users/daniel/Documents/R/win-library/3.2/BH/include/boost/type_traits/is_base_of.hpp:16:1: error: stray '\306' in program
C:/Users/daniel/Documents/R/win-library/3.2/BH/include/boost/type_traits/is_base_of.hpp:16:1: error: stray '\200' in program
C:/Users/daniel/Documents/R/win-library/3.2/BH/include/boost/type_traits/is_base_of.hpp:16:1: error: stray '\200' in program
C:/Users/daniel/Documents/R/win-library/3.2/BH/include/boost/type_traits/is_base_of.hpp:16:1: error: stray '\323' in program
C:/Users/daniel/Documents/R/win-library/3.2/BH/include/boost/type_traits/is_base_of.hpp:16:1: error: stray '\344' in program
C:/Users/daniel/Documents/R/win-library/3.2/BH/include/boost/type_traits/is_base_of.hpp:16:1: error: stray '\311' in program
C:/Users/daniel/Documents/R/win-library/3.2/BH/include/boost/type_traits/is_base_of.hpp:16:1: error: stray '\233' in program
C:/Users/daniel/Documents/R/win-library/3.2/BH/include/boost/type_traits/is_base_of.hpp:16:1: error: stray '\301' in program
C:/Users/daniel/Documents/R/win-library/3.2/BH/include/boost/type_traits/is_base_of.hpp:16:1: error: stray '\210' in program
C:/Users/daniel/Documents/R/win-library/3.2/BH/include/boost/type_traits/is_base_of.hpp:16:1: error: stray '\206' in program
C:/Users/daniel/Documents/R/win-library/3.2/BH/include/boost/type_traits/is_base_of.hpp:16:1: error: stray '\27' in program
C:/Users/daniel/Documents/R/win-library/3.2/BH/include/boost/type_traits/is_base_of.hpp:16:1: error: stray '\231' in program
C:/Users/daniel/Documents/R/win-library/3.2/BH/include/boost/type_traits/is_base_of.hpp:16:1: error: stray '@' in program
C:/Users/daniel/Documents/R/win-library/3.2/BH/include/boost/type_traits/is_base_of.hpp:16:1: error: stray '\365' in program
C:/Users/daniel/Documents/R/win-library/3.2/BH/include/boost/type_traits/is_base_of.hpp:16:1: error: stray '\233' in program
C:/Users/daniel/Documents/R/win-library/3.2/BH/include/boost/type_traits/is_base_of.hpp:16:1: error: stray '\307' in program
C:/Users/daniel/Documents/R/win-library/3.2/BH/include/boost/type_traits/is_base_of.hpp:16:1: error: stray '\270' in program
C:/Users/daniel/Documents/R/win-library/3.2/BH/include/boost/type_traits/is_base_of.hpp:16:1: error: stray '\321' in program
C:/Users/daniel/Documents/R/win-library/3.2/BH/include/boost/type_traits/is_base_of.hpp:16:1: error: stray '\216' in program
C:/Users/daniel/Documents/R/win-library/3.2/BH/include/boost/type_traits/is_base_of.hpp:16:1: error: stray '\240' in program
C:/Users/daniel/Documents/R/win-library/3.2/BH/include/boost/type_traits/is_base_of.hpp:16:1: error: stray '\350' in program
C:/Users/daniel/Documents/R/win-library/3.2/BH/include/boost/type_traits/is_base_of.hpp:16:1: error: stray '\373' in program
C:/Users/daniel/Documents/R/win-library/3.2/BH/include/boost/type_traits/is_base_of.hpp:16:156: error: invalid suffix "M" on integer constant
C:/Users/daniel/Documents/R/win-library/3.2/BH/include/boost/type_traits/is_base_of.hpp:16:1: error: stray '\237' in program
C:/Users/daniel/Documents/R/win-library/3.2/BH/include/boost/type_traits/is_base_of.hpp:16:1: error: stray '\325' in program
C:/Users/daniel/Documents/R/win-library/3.2/BH/include/boost/type_traits/is_base_of.hpp:16:1: error: stray '\315' in program
C:/Users/daniel/Documents/R/win-library/3.2/BH/include/boost/type_traits/is_base_of.hpp:16:1: error: stray '\324' in program
C:/Users/daniel/Documents/R/win-library/3.2/BH/include/boost/type_traits/is_base_of.hpp:16:1: error: stray '\374' in program
C:/Users/daniel/Documents/R/win-library/3.2/BH/include/boost/type_traits/is_base_of.hpp:16:1: error: stray '\343' in program
C:/Users/daniel/Documents/R/win-library/3.2/BH/include/boost/type_traits/is_base_of.hpp:16:1: error: stray '\16' in program
C:/Users/daniel/Documents/R/win-library/3.2/BH/include/boost/type_traits/is_base_of.hpp:16:167: error: invalid suffix "o" on integer constant
C:/Users/daniel/Documents/R/win-library/3.2/BH/include/boost/type_traits/is_base_of.hpp:16:1: error: stray '\320' in program
C:/Users/daniel/Documents/R/win-library/3.2/BH/include/boost/type_traits/is_base_of.hpp:16:1: error: stray '\232' in program
C:/Users/daniel/Documents/R/win-library/3.2/BH/include/boost/type_traits/is_base_of.hpp:16:1: error: stray '\241' in program
C:/Users/daniel/Documents/R/win-library/3.2/BH/include/boost/type_traits/is_base_of.hpp:16:1: error: stray '\267' in program
C:/Users/daniel/Documents/R/win-library/3.2/BH/include/boost/type_traits/is_base_of.hpp:16:1: error: stray '\324' in program
C:/Users/daniel/Documents/R/win-library/3.2/BH/include/boost/type_traits/is_base_of.hpp:16:1: error: stray '\341' in program
C:/Users/daniel/Documents/R/win-library/3.2/BH/include/boost/type_traits/is_base_of.hpp:16:1: error: stray '\231' in program
C:/Users/daniel/Documents/R/win-library/3.2/BH/include/boost/type_traits/is_base_of.hpp:16:1: error: stray '\361' in program
C:/Users/daniel/Documents/R/win-library/3.2/BH/include/boost/type_traits/is_base_of.hpp:16:1: error: stray '\333' in program
C:/Users/daniel/Documents/R/win-library/3.2/BH/include/boost/type_traits/is_base_of.hpp:16:1: error: stray '\234' in program
C:/Users/daniel/Documents/R/win-library/3.2/BH/include/boost/type_traits/is_base_of.hpp:16:1: error: stray '\373' in program
C:/Users/daniel/Documents/R/win-library/3.2/BH/include/boost/type_traits/is_base_of.hpp:16:1: error: stray '\260' in program
C:/Users/daniel/Documents/R/win-library/3.2/BH/include/boost/type_traits/is_base_of.hpp:16:1: error: stray '\230' in program
C:/Users/daniel/Documents/R/win-library/3.2/BH/include/boost/type_traits/is_base_of.hpp:16:1: error: stray '\376' in program
C:/Users/daniel/Documents/R/win-library/3.2/BH/include/boost/type_traits/is_base_of.hpp:16:1: error: stray '\340' in program
C:/Users/daniel/Documents/R/win-library/3.2/BH/include/boost/type_traits/is_base_of.hpp:16:1: error: stray '\236' in program
C:/Users/daniel/Documents/R/win-library/3.2/BH/include/boost/type_traits/is_base_of.hpp:16:1: error: stray '\215' in program
C:/Users/daniel/Documents/R/win-library/3.2/BH/include/boost/type_traits/is_base_of.hpp:16:1: error: stray '\242' in program
C:/Users/daniel/Documents/R/win-library/3.2/BH/include/boost/type_traits/is_base_of.hpp:16:1: error: stray '\301' in program
C:/Users/daniel/Documents/R/win-library/3.2/BH/include/boost/type_traits/is_base_of.hpp:16:1: error: stray '\316' in program
C:/Users/daniel/Documents/R/win-library/3.2/BH/include/boost/type_traits/is_base_of.hpp:16:1: error: stray '\217' in program
C:/Users/daniel/Documents/R/win-library/3.2/BH/include/boost/type_traits/is_base_of.hpp:16:1: error: stray '\374' in program
C:/Users/daniel/Documents/R/win-library/3.2/BH/include/boost/type_traits/is_base_of.hpp:16:1: error: stray '\243' in program
C:/Users/daniel/Documents/R/win-library/3.2/BH/include/boost/type_traits/is_base_of.hpp:16:1: error: stray '\342' in program
C:/Users/daniel/Documents/R/win-library/3.2/BH/include/boost/type_traits/is_base_of.hpp:16:1: error: stray '\333' in program
C:/Users/daniel/Documents/R/win-library/3.2/BH/include/boost/type_traits/is_base_of.hpp:16:1: error: stray '\327' in program
C:/Users/daniel/Documents/R/win-library/3.2/BH/include/boost/type_traits/is_base_of.hpp:16:1: error: stray '\241' in program
C:/Users/daniel/Documents/R/win-library/3.2/BH/include/boost/type_traits/is_base_of.hpp:16:1: error: stray '\34' in program
C:/Users/daniel/Documents/R/win-library/3.2/BH/include/boost/type_traits/is_base_of.hpp:16:1: error: stray '\340' in program
C:/Users/daniel/Documents/R/win-library/3.2/BH/include/boost/type_traits/is_base_of.hpp:16:205: error: invalid suffix "a9" on integer constant
C:/Users/daniel/Documents/R/win-library/3.2/BH/include/boost/type_traits/is_base_of.hpp:16:1: error: stray '\367' in program
C:/Users/daniel/Documents/R/win-library/3.2/BH/include/boost/type_traits/is_base_of.hpp:16:1: error: stray '\253' in program
C:/Users/daniel/Documents/R/win-library/3.2/BH/include/boost/type_traits/is_base_of.hpp:16:1: error: stray '\206' in program
C:/Users/daniel/Documents/R/win-library/3.2/BH/include/boost/type_traits/is_base_of.hpp:16:1: error: stray '\355' in program
C:/Users/daniel/Documents/R/win-library/3.2/BH/include/boost/type_traits/is_base_of.hpp:16:1: error: stray '\222' in program
C:/Users/daniel/Documents/R/win-library/3.2/BH/include/boost/type_traits/is_base_of.hpp:16:1: error: stray '\332' in program
C:/Users/daniel/Documents/R/win-library/3.2/BH/include/boost/type_traits/is_base_of.hpp:16:1: error: stray '\322' in program
C:/Users/daniel/Documents/R/win-library/3.2/BH/include/boost/type_traits/is_base_of.hpp:16:1: error: stray '\320' in program
C:/Users/daniel/Documents/R/win-library/3.2/BH/include/boost/type_traits/is_base_of.hpp:16:1: error: stray '\20' in program
C:/Users/daniel/Documents/R/win-library/3.2/BH/include/boost/type_traits/is_base_of.hpp:16:1: error: stray '\232' in program
C:/Users/daniel/Documents/R/win-library/3.2/BH/include/boost/type_traits/is_base_of.hpp:16:1: error: stray '\376' in program
C:/Users/daniel/Documents/R/win-library/3.2/BH/include/boost/type_traits/is_base_of.hpp:16:1: error: stray '\32' in program
C:/Users/daniel/Documents/R/win-library/3.2/BH/include/boost/type_traits/is_base_of.hpp:16:1: error: stray '\301' in program
C:/Users/daniel/Documents/R/win-library/3.2/BH/include/boost/type_traits/is_base_of.hpp:16:1: error: stray '\230' in program
C:/Users/daniel/Documents/R/win-library/3.2/BH/include/boost/type_traits/is_base_of.hpp:16:1: error: stray '\311' in program
C:/Users/daniel/Documents/R/win-library/3.2/BH/include/boost/type_traits/is_base_of.hpp:16:1: error: stray '\251' in program
C:/Users/daniel/Documents/R/win-library/3.2/BH/include/boost/type_traits/is_base_of.hpp:16:1: error: stray '\355' in program
C:/Users/daniel/Documents/R/win-library/3.2/BH/include/boost/type_traits/is_base_of.hpp:16:1: error: stray '\353' in program
C:/Users/daniel/Documents/R/win-library/3.2/BH/include/boost/type_traits/is_base_of.hpp:16:1: error: stray '\241' in program
C:/Users/daniel/Documents/R/win-library/3.2/BH/include/boost/type_traits/is_base_of.hpp:16:1: error: stray '\6' in program
C:/Users/daniel/Documents/R/win-library/3.2/BH/include/boost/type_traits/is_base_of.hpp:16:1: error: stray '\34' in program
C:/Users/daniel/Documents/R/win-library/3.2/BH/include/boost/type_traits/is_base_of.hpp:16:1: error: stray '\341' in program
C:/Users/daniel/Documents/R/win-library/3.2/BH/include/boost/type_traits/is_base_of.hpp:16:1: error: stray '\32' in program
C:/Users/daniel/Documents/R/win-library/3.2/BH/include/boost/type_traits/is_base_of.hpp:16:1: error: stray '\32' in program
C:/Users/daniel/Documents/R/win-library/3.2/BH/include/boost/type_traits/is_base_of.hpp:16:1: error: stray '\307' in program
C:/Users/daniel/Documents/R/win-library/3.2/BH/include/boost/type_traits/is_base_of.hpp:16:1: error: stray '\371' in program
C:/Users/daniel/Documents/R/win-library/3.2/BH/include/boost/type_traits/is_base_of.hpp:16:1: error: stray '\340' in program
C:/Users/daniel/Documents/R/win-library/3.2/BH/include/boost/type_traits/is_base_of.hpp:16:1: error: stray '\367' in program
C:/Users/daniel/Documents/R/win-library/3.2/BH/include/boost/type_traits/is_base_of.hpp:16:1: error: stray '@' in program
C:/Users/daniel/Documents/R/win-library/3.2/BH/include/boost/type_traits/is_base_of.hpp:16:1: error: missing terminating " character
C:/Users/daniel/Documents/R/win-library/3.2/BH/include/boost/type_traits/is_base_of.hpp:17:1: error: stray '\1' in program
C:/Users/daniel/Documents/R/win-library/3.2/BH/include/boost/type_traits/is_base_of.hpp:17:1: error: stray '\6' in program
C:/Users/daniel/Documents/R/win-library/3.2/BH/include/boost/type_traits/is_base_of.hpp:17:1: error: stray '\213' in program
C:/Users/daniel/Documents/R/win-library/3.2/BH/include/boost/type_traits/is_base_of.hpp:17:1: error: stray '\373' in program
C:/Users/daniel/Documents/R/win-library/3.2/BH/include/boost/type_traits/is_base_of.hpp:17:1: error: stray '\242' in program
C:/Users/daniel/Documents/R/win-library/3.2/BH/include/boost/type_traits/is_base_of.hpp:17:1: error: stray '\' in program
C:/Users/daniel/Documents/R/win-library/3.2/BH/include/boost/type_traits/is_base_of.hpp:17:1: error: stray '\177' in program
C:/Users/daniel/Documents/R/win-library/3.2/BH/include/boost/type_traits/is_base_of.hpp:17:1: error: stray '\1' in program
C:/Users/daniel/Documents/R/win-library/3.2/BH/include/boost/type_traits/is_base_of.hpp:17:1: error: stray '#' in program
C:/Users/daniel/Documents/R/win-library/3.2/BH/include/boost/type_traits/is_base_of.hpp:17:1: error: stray '\3' in program
C:/Users/daniel/Documents/R/win-library/3.2/BH/include/boost/type_traits/is_base_of.hpp:17:1: error: stray '\314' in program
C:/Users/daniel/Documents/R/win-library/3.2/BH/include/boost/type_traits/is_base_of.hpp:17:1: error: stray '\30' in program
C:/Users/daniel/Documents/R/win-library/3.2/BH/include/boost/type_traits/is_base_of.hpp:17:1: error: stray '\5' in program
C:/Users/daniel/Documents/R/win-library/3.2/BH/include/boost/type_traits/is_base_of.hpp:17:1: error: stray '\217' in program
C:/Users/daniel/Documents/R/win-library/3.2/BH/include/boost/type_traits/is_base_of.hpp:17:1: error: stray '\214' in program
C:/Users/daniel/Documents/R/win-library/3.2/BH/include/boost/type_traits/is_base_of.hpp:17:1: error: stray '\323' in program
C:/Users/daniel/Documents/R/win-library/3.2/BH/include/boost/type_traits/is_base_of.hpp:17:1: error: stray '\5' in program
C:/Users/daniel/Documents/R/win-library/3.2/BH/include/boost/type_traits/is_base_of.hpp:17:1: error: stray '\32' in program
In file included from C:/Users/daniel/Documents/R/win-library/3.2/BH/include/boost/fusion/view/reverse_view/reverse_view.hpp:23:0,
from C:/Users/daniel/Documents/R/win-library/3.2/BH/include/boost/fusion/algorithm/transformation/reverse.hpp:11,
from C:/Users/daniel/Documents/R/win-library/3.2/BH/include/boost/fusion/algorithm/transformation.hpp:27,
from C:/Users/daniel/Documents/R/win-library/3.2/BH/include/boost/fusion/algorithm.hpp:13,
from C:/Users/daniel/Documents/R/win-library/3.2/BH/include/boost/numeric/odeint/stepper/detail/generic_rk_algorithm.hpp:31,
from C:/Users/daniel/Documents/R/win-library/3.2/BH/include/boost/numeric/odeint/stepper/explicit_generic_rk.hpp:31,
from C:/Users/daniel/Documents/R/win-library/3.2/BH/include/boost/numeric/odeint/stepper/runge_kutta4.hpp:27,
from C:/Users/daniel/Documents/R/win-library/3.2/BH/include/boost/numeric/odeint.hpp:29,
from C:/Users/daniel/Documents/R/win-library/3.2/StanHeaders/include/stan/math/prim/arr/functor/integrate_ode.hpp:12,
from C:/Users/daniel/Documents/R/win-library/3.2/StanHeaders/include/stan/math.hpp:65,
from C:/Users/daniel/Documents/R/win-library/3.2/StanHeaders/include/src/stan/model/model_header.hpp:4,
from file230c3e17a18.cpp:8:
C:/Users/daniel/Documents/R/win-library/3.2/BH/include/boost/type_traits/is_base_of.hpp:1:1: error: stray '\321' in program
C:/Users/daniel/Documents/R/win-library/3.2/BH/include/boost/type_traits/is_base_of.hpp:1:1: error: stray '\371' in program
C:/Users/daniel/Documents/R/win-library/3.2/BH/include/boost/type_traits/is_base_of.hpp:1:1: error: stray '\36' in program
C:/Users/daniel/Documents/R/win-library/3.2/BH/include/boost/type_traits/is_base_of.hpp:1:1: error: stray '\273' in program
C:/Users/daniel/Documents/R/win-library/3.2/BH/include/boost/type_traits/is_base_of.hpp:1:1: error: stray '\35' in program
C:/Users/daniel/Documents/R/win-library/3.2/BH/include/boost/type_traits/is_base_of.hpp:1:1: error: stray '`' in program
C:/Users/daniel/Documents/R/win-library/3.2/BH/include/boost/type_traits/is_base_of.hpp:1:1: error: stray '\243' in program
C:/Users/daniel/Documents/R/win-library/3.2/BH/include/boost/type_traits/is_base_of.hpp:1:1: error: stray '\36' in program
C:/Users/daniel/Documents/R/win-library/3.2/BH/include/boost/type_traits/is_base_of.hpp:1:1: error: stray '\346' in program
C:/Users/daniel/Documents/R/win-library/3.2/BH/include/boost/type_traits/is_base_of.hpp:1:1: error: stray '\35' in program
C:/Users/daniel/Documents/R/win-library/3.2/BH/include/boost/type_traits/is_base_of.hpp:1:1: error: stray '\234' in program
C:/Users/daniel/Documents/R/win-library/3.2/BH/include/boost/type_traits/is_base_of.hpp:1:1: error: stray '\37' in program
C:/Users/daniel/Documents/R/win-library/3.2/BH/include/boost/type_traits/is_base_of.hpp:1:1: error: stray '\24' in program
C:/Users/daniel/Documents/R/win-library/3.2/BH/include/boost/type_traits/is_base_of.hpp:1:1: error: stray '\222' in program
C:/Users/daniel/Documents/R/win-library/3.2/BH/include/boost/type_traits/is_base_of.hpp:1:1: error: stray '\360' in program
C:/Users/daniel/Documents/R/win-library/3.2/BH/include/boost/type_traits/is_base_of.hpp:1:1: error: stray '\304' in program
C:/Users/daniel/Documents/R/win-library/3.2/BH/include/boost/type_traits/is_base_of.hpp:1:1: error: stray '\301' in program
C:/Users/daniel/Documents/R/win-library/3.2/BH/include/boost/type_traits/is_base_of.hpp:1:1: error: stray '\317' in program
C:/Users/daniel/Documents/R/win-library/3.2/BH/include/boost/type_traits/is_base_of.hpp:1:1: error: stray '\264' in program
C:/Users/daniel/Documents/R/win-library/3.2/BH/include/boost/type_traits/is_base_of.hpp:1:1: error: stray '\304' in program
C:/Users/daniel/Documents/R/win-library/3.2/BH/include/boost/type_traits/is_base_of.hpp:1:1: error: stray '\200' in program
C:/Users/daniel/Documents/R/win-library/3.2/BH/include/boost/type_traits/is_base_of.hpp:2:1: error: stray '\30' in program
C:/Users/daniel/Documents/R/win-library/3.2/BH/include/boost/type_traits/is_base_of.hpp:2:1: error: stray '\333' in program
C:/Users/daniel/Documents/R/win-library/3.2/BH/include/boost/type_traits/is_base_of.hpp:2:1: error: stray '\355' in program
C:/Users/daniel/Documents/R/win-library/3.2/BH/include/boost/type_traits/is_base_of.hpp:2:1: error: stray '\362' in program
C:/Users/daniel/Documents/R/win-library/3.2/BH/include/boost/type_traits/is_base_of.hpp:2:1: error: stray '\6' in program
C:/Users/daniel/Documents/R/win-library/3.2/BH/include/boost/type_traits/is_base_of.hpp:2:1: error: stray '\236' in program
C:/Users/daniel/Documents/R/win-library/3.2/BH/include/boost/type_traits/is_base_of.hpp:2:1: error: stray '\246' in program
C:/Users/daniel/Documents/R/win-library/3.2/BH/include/boost/type_traits/is_base_of.hpp:2:1: error: stray '@' in program
C:/Users/daniel/Documents/R/win-library/3.2/BH/include/boost/type_traits/is_base_of.hpp:2:1: error: stray '\273' in program
C:/Users/daniel/Documents/R/win-library/3.2/BH/include/boost/type_traits/is_base_of.hpp:2:1: error: stray '\234' in program
C:/Users/daniel/Documents/R/win-library/3.2/BH/include/boost/type_traits/is_base_of.hpp:2:1: error: stray '\34' in program
C:/Users/daniel/Documents/R/win-library/3.2/BH/include/boost/type_traits/is_base_of.hpp:2:1: error: stray '\10' in program
C:/Users/daniel/Documents/R/win-library/3.2/BH/include/boost/type_traits/is_base_of.hpp:2:1: error: stray '\206' in program
C:/Users/daniel/Documents/R/win-library/3.2/BH/include/boost/type_traits/is_base_of.hpp:2:1: error: stray '\272' in program
C:/Users/daniel/Documents/R/win-library/3.2/BH/include/boost/type_traits/is_base_of.hpp:2:1: error: stray '\231' in program
C:/Users/daniel/Documents/R/win-library/3.2/BH/include/boost/type_traits/is_base_of.hpp:2:1: error: stray '\244' in program
C:/Users/daniel/Documents/R/win-library/3.2/BH/include/boost/type_traits/is_base_of.hpp:2:1: error: stray '\213' in program
C:/Users/daniel/Documents/R/win-library/3.2/BH/include/boost/type_traits/is_base_of.hpp:2:1: error: stray '\333' in program
C:/Users/daniel/Documents/R/win-library/3.2/BH/include/boost/type_traits/is_base_of.hpp:2:1: error: stray '\332' in program
C:/Users/daniel/Documents/R/win-library/3.2/BH/include/boost/type_traits/is_base_of.hpp:2:1: error: stray '\257' in program
C:/Users/daniel/Documents/R/win-library/3.2/BH/include/boost/type_traits/is_base_of.hpp:2:1: error: stray '\347' in program
C:/Users/daniel/Documents/R/win-library/3.2/BH/include/boost/type_traits/is_base_of.hpp:2:1: error: stray '\34' in program
C:/Users/daniel/Documents/R/win-library/3.2/BH/include/boost/type_traits/is_base_of.hpp:2:1: error: stray '\203' in program
C:/Users/daniel/Documents/R/win-library/3.2/BH/include/boost/type_traits/is_base_of.hpp:2:1: error: stray '\265' in program
C:/Users/daniel/Documents/R/win-library/3.2/BH/include/boost/type_traits/is_base_of.hpp:2:1: error: stray '\262' in program
C:/Users/daniel/Documents/R/win-library/3.2/BH/include/boost/type_traits/is_base_of.hpp:2:1: error: stray '\314' in program
C:/Users/daniel/Documents/R/win-library/3.2/BH/include/boost/type_traits/is_base_of.hpp:2:1: error: stray '\257' in program
C:/Users/daniel/Documents/R/win-library/3.2/BH/include/boost/type_traits/is_base_of.hpp:2:1: error: stray '\301' in program
C:/Users/daniel/Documents/R/win-library/3.2/BH/include/boost/type_traits/is_base_of.hpp:2:1: error: stray '\371' in program
C:/Users/daniel/Documents/R/win-library/3.2/BH/include/boost/type_traits/is_base_of.hpp:2:1: error: stray '\377' in program
C:/Users/daniel/Documents/R/win-library/3.2/BH/include/boost/type_traits/is_base_of.hpp:2:1: error: stray '\225' in program
C:/Users/daniel/Documents/R/win-library/3.2/BH/include/boost/type_traits/is_base_of.hpp:2:1: error: stray '\350' in program
C:/Users/daniel/Documents/R/win-library/3.2/BH/include/boost/type_traits/is_base_of.hpp:2:1: error: stray '\303' in program
C:/Users/daniel/Documents/R/win-library/3.2/BH/include/boost/type_traits/is_base_of.hpp:2:1: error: stray '\232' in program
C:/Users/daniel/Documents/R/win-library/3.2/BH/include/boost/type_traits/is_base_of.hpp:3:1: error: missing terminating ' character
C:/Users/daniel/Documents/R/win-library/3.2/BH/include/boost/type_traits/is_base_of.hpp:4:1: error: stray '\177' in program
C:/Users/daniel/Documents/R/win-library/3.2/BH/include/boost/type_traits/is_base_of.hpp:4:1: error: stray '\337' in program
C:/Users/daniel/Documents/R/win-library/3.2/BH/include/boost/type_traits/is_base_of.hpp:4:1: error: stray '\317' in program
C:/Users/daniel/Documents/R/win-library/3.2/BH/include/boost/type_traits/is_base_of.hpp:4:1: error: stray '\32' in program
C:/Users/daniel/Documents/R/win-library/3.2/BH/include/boost/type_traits/is_base_of.hpp:4:1: error: stray '\250' in program
C:/Users/daniel/Documents/R/win-library/3.2/BH/include/boost/type_traits/is_base_of.hpp:4:1: error: stray '\351' in program
C:/Users/daniel/Documents/R/win-library/3.2/BH/include/boost/type_traits/is_base_of.hpp:4:1: error: stray '\325' in program
C:/Users/daniel/Documents/R/win-library/3.2/BH/include/boost/type_traits/is_base_of.hpp:4:1: error: stray '\300' in program
C:/Users/daniel/Documents/R/win-library/3.2/BH/include/boost/type_traits/is_base_of.hpp:4:1: error: stray '\300' in program
C:/Users/daniel/Documents/R/win-library/3.2/BH/include/boost/type_traits/is_base_of.hpp:4:1: error: stray '`' in program
C:/Users/daniel/Documents/R/win-library/3.2/BH/include/boost/type_traits/is_base_of.hpp:4:1: error: stray '\10' in program
C:/Users/daniel/Documents/R/win-library/3.2/BH/include/boost/type_traits/is_base_of.hpp:4:1: error: stray '\231' in program
C:/Users/daniel/Documents/R/win-library/3.2/BH/include/boost/type_traits/is_base_of.hpp:4:1: error: stray '\261' in program
C:/Users/daniel/Documents/R/win-library/3.2/BH/include/boost/type_traits/is_base_of.hpp:4:1: error: stray '\214' in program
C:/Users/daniel/Documents/R/win-library/3.2/BH/include/boost/type_traits/is_base_of.hpp:4:1: error: stray '\263' in program
C:/Users/daniel/Documents/R/win-library/3.2/BH/include/boost/type_traits/is_base_of.hpp:4:1: error: stray '\273' in program
C:/Users/daniel/Documents/R/win-library/3.2/BH/include/boost/type_traits/is_base_of.hpp:4:1: error: stray '\237' in program
C:/Users/daniel/Documents/R/win-library/3.2/BH/include/boost/type_traits/is_base_of.hpp:4:1: error: stray '\243' in program
C:/Users/daniel/Documents/R/win-library/3.2/BH/include/boost/type_traits/is_base_of.hpp:4:1: error: stray '\325' in program
C:/Users/daniel/Documents/R/win-library/3.2/BH/include/boost/type_traits/is_base_of.hpp:4:1: error: stray '\353' in program
C:/Users/daniel/Documents/R/win-library/3.2/BH/include/boost/type_traits/is_base_of.hpp:4:1: error: stray '\372' in program
C:/Users/daniel/Documents/R/win-library/3.2/BH/include/boost/type_traits/is_base_of.hpp:4:1: error: stray '\3' in program
C:/Users/daniel/Documents/R/win-library/3.2/BH/include/boost/type_traits/is_base_of.hpp:4:1: error: stray '\276' in program
C:/Users/daniel/Documents/R/win-library/3.2/BH/include/boost/type_traits/is_base_of.hpp:4:1: error: stray '\244' in program
C:/Users/daniel/Documents/R/win-library/3.2/BH/include/boost/type_traits/is_base_of.hpp:4:1: error: stray '\353' in program
C:/Users/daniel/Documents/R/win-library/3.2/BH/include/boost/type_traits/is_base_of.hpp:4:1: error: stray '\304' in program
C:/Users/daniel/Documents/R/win-library/3.2/BH/include/boost/type_traits/is_base_of.hpp:4:1: error: stray '\17' in program
C:/Users/daniel/Documents/R/win-library/3.2/BH/include/boost/type_traits/is_base_of.hpp:4:1: error: stray '\277' in program
C:/Users/daniel/Documents/R/win-library/3.2/BH/include/boost/type_traits/is_base_of.hpp:4:1: error: stray '\370' in program
C:/Users/daniel/Documents/R/win-library/3.2/BH/include/boost/type_traits/is_base_of.hpp:4:1: error: stray '\360' in program
C:/Users/daniel/Documents/R/win-library/3.2/BH/include/boost/type_traits/is_base_of.hpp:4:1: error: stray '\370' in program
C:/Users/daniel/Documents/R/win-library/3.2/BH/include/boost/type_traits/is_base_of.hpp:4:1: error: stray '\362' in program
C:/Users/daniel/Documents/R/win-library/3.2/BH/include/boost/type_traits/is_base_of.hpp:4:1: error: stray '\321' in program
C:/Users/daniel/Documents/R/win-library/3.2/BH/include/boost/type_traits/is_base_of.hpp:4:1: error: stray '\177' in program
C:/Users/daniel/Documents/R/win-library/3.2/BH/include/boost/type_traits/is_base_of.hpp:4:1: error: stray '\3' in program
C:/Users/daniel/Documents/R/win-library/3.2/BH/include/boost/type_traits/is_base_of.hpp:4:1: error: stray '\277' in program
C:/Users/daniel/Documents/R/win-library/3.2/BH/include/boost/type_traits/is_base_of.hpp:4:1: error: stray '\227' in program
C:/Users/daniel/Documents/R/win-library/3.2/BH/include/boost/type_traits/is_base_of.hpp:4:1: error: stray '\247' in program
C:/Users/daniel/Documents/R/win-library/3.2/BH/include/boost/type_traits/is_base_of.hpp:4:1: error: stray '\245' in program
C:/Users/daniel/Documents/R/win-library/3.2/BH/include/boost/type_traits/is_base_of.hpp:4:1: error: stray '\252' in program
C:/Users/daniel/Documents/R/win-library/3.2/BH/include/boost/type_traits/is_base_of.hpp:4:1: error: stray '\330' in program
C:/Users/daniel/Documents/R/win-library/3.2/BH/include/boost/type_traits/is_base_of.hpp:4:1: error: stray '\237' in program
C:/Users/daniel/Documents/R/win-library/3.2/BH/include/boost/type_traits/is_base_of.hpp:4:1: error: stray '\32' in program
C:/Users/daniel/Documents/R/win-library/3.2/BH/include/boost/type_traits/is_base_of.hpp:4:1: error: stray '\224' in program
C:/Users/daniel/Documents/R/win-library/3.2/BH/include/boost/type_traits/is_base_of.hpp:4:1: error: stray '\315' in program
C:/Users/daniel/Documents/R/win-library/3.2/BH/include/boost/type_traits/is_base_of.hpp:4:1: error: stray '\232' in program
C:/Users/daniel/Documents/R/win-library/3.2/BH/include/boost/type_traits/is_base_of.hpp:4:1: error: stray '\234' in program
C:/Users/daniel/Documents/R/win-library/3.2/BH/include/boost/type_traits/is_base_of.hpp:4:1: error: stray '\202' in program
C:/Users/daniel/Documents/R/win-library/3.2/BH/include/boost/type_traits/is_base_of.hpp:4:1: error: stray '\340' in program
C:/Users/daniel/Documents/R/win-library/3.2/BH/include/boost/type_traits/is_base_of.hpp:4:1: error: stray '\212' in program
C:/Users/daniel/Documents/R/win-library/3.2/BH/include/boost/type_traits/is_base_of.hpp:4:1: error: stray '\267' in program
C:/Users/daniel/Documents/R/win-library/3.2/BH/include/boost/type_traits/is_base_of.hpp:4:1: error: stray '\35' in program
C:/Users/daniel/Documents/R/win-library/3.2/BH/include/boost/type_traits/is_base_of.hpp:4:1: error: stray '\351' in program
C:/Users/daniel/Documents/R/win-library/3.2/BH/include/boost/type_traits/is_base_of.hpp:4:1: error: stray '\276' in program
C:/Users/daniel/Documents/R/win-library/3.2/BH/include/boost/type_traits/is_base_of.hpp:4:1: error: stray '\340' in program
C:/Users/daniel/Documents/R/win-library/3.2/BH/include/boost/type_traits/is_base_of.hpp:4:1: error: stray '\2' in program
C:/Users/daniel/Documents/R/win-library/3.2/BH/include/boost/type_traits/is_base_of.hpp:4:1: error: stray '\200' in program
C:/Users/daniel/Documents/R/win-library/3.2/BH/include/boost/type_traits/is_base_of.hpp:4:1: error: stray '\263' in program
C:/Users/daniel/Documents/R/win-library/3.2/BH/include/boost/type_traits/is_base_of.hpp:4:1: error: stray '\256' in program
C:/Users/daniel/Documents/R/win-library/3.2/BH/include/boost/type_traits/is_base_of.hpp:4:1: error: stray '\342' in program
C:/Users/daniel/Documents/R/win-library/3.2/BH/include/boost/type_traits/is_base_of.hpp:4:1: error: stray '\313' in program
C:/Users/daniel/Documents/R/win-library/3.2/BH/include/boost/type_traits/is_base_of.hpp:4:1: error: missing terminating " character
C:/Users/daniel/Documents/R/win-library/3.2/BH/include/boost/type_traits/is_base_of.hpp:5:1: error: stray '\245' in program
C:/Users/daniel/Documents/R/win-library/3.2/BH/include/boost/type_traits/is_base_of.hpp:5:1: error: stray '\250' in program
C:/Users/daniel/Documents/R/win-library/3.2/BH/include/boost/type_traits/is_base_of.hpp:5:1: error: stray '\237' in program
C:/Users/daniel/Documents/R/win-library/3.2/BH/include/boost/type_traits/is_base_of.hpp:5:1: error: stray '\331' in program
C:/Users/daniel/Documents/R/win-library/3.2/BH/include/boost/type_traits/is_base_of.hpp:5:1: error: stray '\354' in program
C:/Users/daniel/Documents/R/win-library/3.2/BH/include/boost/type_traits/is_base_of.hpp:5:1: error: stray '\245' in program
C:/Users/daniel/Documents/R/win-library/3.2/BH/include/boost/type_traits/is_base_of.hpp:5:1: error: stray '\365' in program
C:/Users/daniel/Documents/R/win-library/3.2/BH/include/boost/type_traits/is_base_of.hpp:5:1: error: stray '\333' in program
C:/Users/daniel/Documents/R/win-library/3.2/BH/include/boost/type_traits/is_base_of.hpp:5:1: error: stray '\342' in program
C:/Users/daniel/Documents/R/win-library/3.2/BH/include/boost/type_traits/is_base_of.hpp:5:1: error: stray '\314' in program
C:/Users/daniel/Documents/R/win-library/3.2/BH/include/boost/type_traits/is_base_of.hpp:5:1: error: stray '\21' in program
C:/Users/daniel/Documents/R/win-library/3.2/BH/include/boost/type_traits/is_base_of.hpp:5:1: error: stray '\245' in program
C:/Users/daniel/Documents/R/win-library/3.2/BH/include/boost/type_traits/is_base_of.hpp:5:1: error: stray '\202' in program
C:/Users/daniel/Documents/R/win-library/3.2/BH/include/boost/type_traits/is_base_of.hpp:5:1: error: stray '\273' in program
C:/Users/daniel/Documents/R/win-library/3.2/BH/include/boost/type_traits/is_base_of.hpp:5:1: error: stray '\1' in program
C:/Users/daniel/Documents/R/win-library/3.2/BH/include/boost/type_traits/is_base_of.hpp:5:1: error: stray '\262' in program
C:/Users/daniel/Documents/R/win-library/3.2/BH/include/boost/type_traits/is_base_of.hpp:5:1: error: stray '\240' in program
C:/Users/daniel/Documents/R/win-library/3.2/BH/include/boost/type_traits/is_base_of.hpp:5:1: error: stray '\215' in program
C:/Users/daniel/Documents/R/win-library/3.2/BH/include/boost/type_traits/is_base_of.hpp:5:1: error: stray '`' in program
C:/Users/daniel/Documents/R/win-library/3.2/BH/include/boost/type_traits/is_base_of.hpp:5:1: error: stray '\367' in program
C:/Users/daniel/Documents/R/win-library/3.2/BH/include/boost/type_traits/is_base_of.hpp:5:1: error: stray '\17' in program
C:/Users/daniel/Documents/R/win-library/3.2/BH/include/boost/type_traits/is_base_of.hpp:5:1: error: stray '\255' in program
C:/Users/daniel/Documents/R/win-library/3.2/BH/include/boost/type_traits/is_base_of.hpp:5:1: error: stray '\36' in program
C:/Users/daniel/Documents/R/win-library/3.2/BH/include/boost/type_traits/is_base_of.hpp:5:1: error: stray '\317' in program
C:/Users/daniel/Documents/R/win-library/3.2/BH/include/boost/type_traits/is_base_of.hpp:6:1: error: stray '\375' in program
C:/Users/daniel/Documents/R/win-library/3.2/BH/include/boost/type_traits/is_base_of.hpp:6:1: error: stray '\304' in program
C:/Users/daniel/Documents/R/win-library/3.2/BH/include/boost/type_traits/is_base_of.hpp:6:1: error: stray '\241' in program
C:/Users/daniel/Documents/R/win-library/3.2/BH/include/boost/type_traits/is_base_of.hpp:6:1: error: stray '\216' in program
C:/Users/daniel/Documents/R/win-library/3.2/BH/include/boost/type_traits/is_base_of.hpp:6:1: error: stray '\337' in program
C:/Users/daniel/Documents/R/win-library/3.2/BH/include/boost/type_traits/is_base_of.hpp:6:1: error: stray '\363' in program
C:/Users/daniel/Documents/R/win-library/3.2/BH/include/boost/type_traits/is_base_of.hpp:6:1: error: stray '\34' in program
C:/Users/daniel/Documents/R/win-library/3.2/BH/include/boost/type_traits/is_base_of.hpp:6:1: error: stray '\360' in program
C:/Users/daniel/Documents/R/win-library/3.2/BH/include/boost/type_traits/is_base_of.hpp:6:1: error: stray '\35' in program
C:/Users/daniel/Documents/R/win-library/3.2/BH/include/boost/type_traits/is_base_of.hpp:6:1: error: stray '\342' in program
C:/Users/daniel/Documents/R/win-library/3.2/BH/include/boost/type_traits/is_base_of.hpp:6:1: error: stray '\315' in program
C:/Users/daniel/Documents/R/win-library/3.2/BH/include/boost/type_traits/is_base_of.hpp:6:1: error: stray '\226' in program
C:/Users/daniel/Documents/R/win-library/3.2/BH/include/boost/type_traits/is_base_of.hpp:6:1: error: stray '\341' in program
C:/Users/daniel/Documents/R/win-library/3.2/BH/include/boost/type_traits/is_base_of.hpp:6:1: error: stray '\1' in program
C:/Users/daniel/Documents/R/win-library/3.2/BH/include/boost/type_traits/is_base_of.hpp:6:1: error: stray '\334' in program
C:/Users/daniel/Documents/R/win-library/3.2/BH/include/boost/type_traits/is_base_of.hpp:6:1: error: stray '\277' in program
C:/Users/daniel/Documents/R/win-library/3.2/BH/include/boost/type_traits/is_base_of.hpp:6:1: error: stray '\344' in program
C:/Users/daniel/Documents/R/win-library/3.2/BH/include/boost/type_traits/is_base_of.hpp:6:1: error: stray '\343' in program
C:/Users/daniel/Documents/R/win-library/3.2/BH/include/boost/type_traits/is_base_of.hpp:6:1: error: stray '\224' in program
C:/Users/daniel/Documents/R/win-library/3.2/BH/include/boost/type_traits/is_base_of.hpp:6:1: error: stray '\340' in program
C:/Users/daniel/Documents/R/win-library/3.2/BH/include/boost/type_traits/is_base_of.hpp:6:1: error: stray '\253' in program
C:/Users/daniel/Documents/R/win-library/3.2/BH/include/boost/type_traits/is_base_of.hpp:6:1: error: stray '\274' in program
C:/Users/daniel/Documents/R/win-library/3.2/BH/include/boost/type_traits/is_base_of.hpp:6:1: error: stray '\26' in program
C:/Users/daniel/Documents/R/win-library/3.2/BH/include/boost/type_traits/is_base_of.hpp:6:1: error: stray '\225' in program
C:/Users/daniel/Documents/R/win-library/3.2/BH/include/boost/type_traits/is_base_of.hpp:6:1: error: stray '\254' in program
C:/Users/daniel/Documents/R/win-library/3.2/BH/include/boost/type_traits/is_base_of.hpp:6:1: error: stray '\221' in program
C:/Users/daniel/Documents/R/win-library/3.2/BH/include/boost/type_traits/is_base_of.hpp:6:1: error: stray '\266' in program
C:/Users/daniel/Documents/R/win-library/3.2/BH/include/boost/type_traits/is_base_of.hpp:6:1: error: stray '\363' in program
C:/Users/daniel/Documents/R/win-library/3.2/BH/include/boost/type_traits/is_base_of.hpp:6:1: error: stray '\273' in program
C:/Users/daniel/Documents/R/win-library/3.2/BH/include/boost/type_traits/is_base_of.hpp:6:1: error: stray '\211' in program
C:/Users/daniel/Documents/R/win-library/3.2/BH/include/boost/type_traits/is_base_of.hpp:6:1: error: stray '\326' in program
C:/Users/daniel/Documents/R/win-library/3.2/BH/include/boost/type_traits/is_base_of.hpp:6:1: error: stray '\355' in program
C:/Users/daniel/Documents/R/win-library/3.2/BH/include/boost/type_traits/is_base_of.hpp:6:1: error: stray '\264' in program
C:/Users/daniel/Documents/R/win-library/3.2/BH/include/boost/type_traits/is_base_of.hpp:6:1: error: stray '\261' in program
C:/Users/daniel/Documents/R/win-library/3.2/BH/include/boost/type_traits/is_base_of.hpp:6:1: error: stray '#' in program
C:/Users/daniel/Documents/R/win-library/3.2/BH/include/boost/type_traits/is_base_of.hpp:6:1: error: stray '\277' in program
C:/Users/daniel/Documents/R/win-library/3.2/BH/include/boost/type_traits/is_base_of.hpp:6:1: error: stray '\325' in program
C:/Users/daniel/Documents/R/win-library/3.2/BH/include/boost/type_traits/is_base_of.hpp:6:1: error: stray '\343' in program
C:/Users/daniel/Documents/R/win-library/3.2/BH/include/boost/type_traits/is_base_of.hpp:6:1: error: stray '\35' in program
C:/Users/daniel/Documents/R/win-library/3.2/BH/include/boost/type_traits/is_base_of.hpp:6:1: error: stray '\235' in program
C:/Users/daniel/Documents/R/win-library/3.2/BH/include/boost/type_traits/is_base_of.hpp:6:1: error: stray '\357' in program
C:/Users/daniel/Documents/R/win-library/3.2/BH/include/boost/type_traits/is_base_of.hpp:6:1: error: stray '\317' in program
C:/Users/daniel/Documents/R/win-library/3.2/BH/include/boost/type_traits/is_base_of.hpp:6:1: error: stray '\20' in program
C:/Users/daniel/Documents/R/win-library/3.2/BH/include/boost/type_traits/is_base_of.hpp:6:1: error: stray '\217' in program
C:/Users/daniel/Documents/R/win-library/3.2/BH/include/boost/type_traits/is_base_of.hpp:6:1: error: missing terminating " character
In file included from C:/Users/daniel/Documents/R/win-library/3.2/BH/include/boost/fusion/view/reverse_view/reverse_view.hpp:23:0,
from C:/Users/daniel/Documents/R/win-library/3.2/BH/include/boost/fusion/algorithm/transformation/reverse.hpp:11,
from C:/Users/daniel/Documents/R/win-library/3.2/BH/include/boost/fusion/algorithm/transformation.hpp:27,
from C:/Users/daniel/Documents/R/win-library/3.2/BH/include/boost/fusion/algorithm.hpp:13,
from C:/Users/daniel/Documents/R/win-library/3.2/BH/include/boost/numeric/odeint/stepper/detail/generic_rk_algorithm.hpp:31,
from C:/Users/daniel/Documents/R/win-library/3.2/BH/include/boost/numeric/odeint/stepper/explicit_generic_rk.hpp:31,
from C:/Users/daniel/Documents/R/win-library/3.2/BH/include/boost/numeric/odeint/stepper/runge_kutta4.hpp:27,
from C:/Users/daniel/Documents/R/win-library/3.2/BH/include/boost/numeric/odeint.hpp:29,
from C:/Users/daniel/Documents/R/win-library/3.2/StanHeaders/include/stan/math/prim/arr/functor/integrate_ode.hpp:12,
from C:/Users/daniel/Documents/R/win-library/3.2/StanHeaders/include/stan/math.hpp:65,
from C:/Users/daniel/Documents/R/win-library/3.2/StanHeaders/include/src/stan/model/model_header.hpp:4,
from file230c3e17a18.cpp:8:
C:/Users/daniel/Documents/R/win-library/3.2/BH/include/boost/type_traits/is_base_of.hpp:7:1: error: stray '\220' in program
C:/Users/daniel/Documents/R/win-library/3.2/BH/include/boost/type_traits/is_base_of.hpp:7:1: error: stray '\16' in program
C:/Users/daniel/Documents/R/win-library/3.2/BH/include/boost/type_traits/is_base_of.hpp:7:1: error: stray '\262' in program
C:/Users/daniel/Documents/R/win-library/3.2/BH/include/boost/type_traits/is_base_of.hpp:7:1: error: stray '\324' in program
C:/Users/daniel/Documents/R/win-library/3.2/BH/include/boost/type_traits/is_base_of.hpp:7:1: error: stray '\254' in program
C:/Users/daniel/Documents/R/win-library/3.2/BH/include/boost/type_traits/is_base_of.hpp:7:1: error: stray '\275' in program
C:/Users/daniel/Documents/R/win-library/3.2/BH/include/boost/type_traits/is_base_of.hpp:7:1: error: stray '\275' in program
C:/Users/daniel/Documents/R/win-library/3.2/BH/include/boost/type_traits/is_base_of.hpp:7:1: error: stray '\345' in program
C:/Users/daniel/Documents/R/win-library/3.2/BH/include/boost/type_traits/is_base_of.hpp:7:1: error: stray '\267' in program
C:/Users/daniel/Documents/R/win-library/3.2/BH/include/boost/type_traits/is_base_of.hpp:7:1: error: stray '\233' in program
C:/Users/daniel/Documents/R/win-library/3.2/BH/include/boost/type_traits/is_base_of.hpp:7:1: error: stray '\224' in program
C:/Users/daniel/Documents/R/win-library/3.2/BH/include/boost/type_traits/is_base_of.hpp:7:1: error: stray '\220' in program
C:/Users/daniel/Documents/R/win-library/3.2/BH/include/boost/type_traits/is_base_of.hpp:7:1: error: stray '\314' in program
C:/Users/daniel/Documents/R/win-library/3.2/BH/include/boost/type_traits/is_base_of.hpp:7:1: error: stray '\323' in program
C:/Users/daniel/Documents/R/win-library/3.2/BH/include/boost/type_traits/is_base_of.hpp:7:1: error: stray '\350' in program
C:/Users/daniel/Documents/R/win-library/3.2/BH/include/boost/type_traits/is_base_of.hpp:7:1: error: stray '\360' in program
C:/Users/daniel/Documents/R/win-library/3.2/BH/include/boost/type_traits/is_base_of.hpp:7:1: error: stray '\24' in program
C:/Users/daniel/Documents/R/win-library/3.2/BH/include/boost/type_traits/is_base_of.hpp:7:1: error: stray '\333' in program
C:/Users/daniel/Documents/R/win-library/3.2/BH/include/boost/type_traits/is_base_of.hpp:7:1: error: stray '\245' in program
C:/Users/daniel/Documents/R/win-library/3.2/BH/include/boost/type_traits/is_base_of.hpp:7:1: error: stray '\235' in program
C:/Users/daniel/Documents/R/win-library/3.2/BH/include/boost/type_traits/is_base_of.hpp:7:1: error: stray '\367' in program
C:/Users/daniel/Documents/R/win-library/3.2/BH/include/boost/type_traits/is_base_of.hpp:7:1: error: stray '\177' in program
C:/Users/daniel/Documents/R/win-library/3.2/BH/include/boost/type_traits/is_base_of.hpp:7:1: error: stray '@' in program
C:/Users/daniel/Documents/R/win-library/3.2/BH/include/boost/type_traits/is_base_of.hpp:7:1: error: stray '\203' in program
C:/Users/daniel/Documents/R/win-library/3.2/BH/include/boost/type_traits/is_base_of.hpp:7:1: error: stray '\303' in program
C:/Users/daniel/Documents/R/win-library/3.2/BH/include/boost/type_traits/is_base_of.hpp:7:1: error: stray '`' in program
C:/Users/daniel/Documents/R/win-library/3.2/BH/include/boost/type_traits/is_base_of.hpp:7:1: error: stray '\252' in program
C:/Users/daniel/Documents/R/win-library/3.2/BH/include/boost/type_traits/is_base_of.hpp:7:1: error: stray '\7' in program
C:/Users/daniel/Documents/R/win-library/3.2/BH/include/boost/type_traits/is_base_of.hpp:7:1: error: stray '\21' in program
C:/Users/daniel/Documents/R/win-library/3.2/BH/include/boost/type_traits/is_base_of.hpp:7:1: error: stray '\36' in program
C:/Users/daniel/Documents/R/win-library/3.2/BH/include/boost/type_traits/is_base_of.hpp:7:1: error: stray '\26' in program
C:/Users/daniel/Documents/R/win-library/3.2/BH/include/boost/type_traits/is_base_of.hpp:7:1: error: stray '\374' in program
C:/Users/daniel/Documents/R/win-library/3.2/BH/include/boost/type_traits/is_base_of.hpp:7:1: error: missing terminating ' character
C:/Users/daniel/Documents/R/win-library/3.2/BH/include/boost/type_traits/is_base_of.hpp:8:1: error: stray '\323' in program
C:/Users/daniel/Documents/R/win-library/3.2/BH/include/boost/type_traits/is_base_of.hpp:8:1: error: stray '\250' in program
C:/Users/daniel/Documents/R/win-library/3.2/BH/include/boost/type_traits/is_base_of.hpp:8:1: error: stray '\6' in program
C:/Users/daniel/Documents/R/win-library/3.2/BH/include/boost/type_traits/is_base_of.hpp:8:1: error: missing terminating " character
C:/Users/daniel/Documents/R/win-library/3.2/BH/include/boost/type_traits/is_base_of.hpp:9:1: error: stray '\227' in program
C:/Users/daniel/Documents/R/win-library/3.2/BH/include/boost/type_traits/is_base_of.hpp:9:1: error: stray '\351' in program
C:/Users/daniel/Documents/R/win-library/3.2/BH/include/boost/type_traits/is_base_of.hpp:9:1: error: stray '#' in program
C:/Users/daniel/Documents/R/win-library/3.2/BH/include/boost/type_traits/is_base_of.hpp:9:1: error: stray '\363' in program
C:/Users/daniel/Documents/R/win-library/3.2/BH/include/boost/type_traits/is_base_of.hpp:9:1: error: stray '#' in program
C:/Users/daniel/Documents/R/win-library/3.2/BH/include/boost/type_traits/is_base_of.hpp:9:1: error: stray '\257' in program
C:/Users/daniel/Documents/R/win-library/3.2/BH/include/boost/type_traits/is_base_of.hpp:9:1: error: stray '\376' in program
C:/Users/daniel/Documents/R/win-library/3.2/BH/include/boost/type_traits/is_base_of.hpp:9:1: error: stray '\337' in program
C:/Users/daniel/Documents/R/win-library/3.2/BH/include/boost/type_traits/is_base_of.hpp:9:1: error: stray '\350' in program
C:/Users/daniel/Documents/R/win-library/3.2/BH/include/boost/type_traits/is_base_of.hpp:9:1: error: stray '\25' in program
C:/Users/daniel/Documents/R/win-library/3.2/BH/include/boost/type_traits/is_base_of.hpp:9:1: error: stray '\210' in program
C:/Users/daniel/Documents/R/win-library/3.2/BH/include/boost/type_traits/is_base_of.hpp:9:1: error: stray '\177' in program
C:/Users/daniel/Documents/R/win-library/3.2/BH/include/boost/type_traits/is_base_of.hpp:9:1: error: stray '\311' in program
C:/Users/daniel/Documents/R/win-library/3.2/BH/include/boost/type_traits/is_base_of.hpp:9:1: error: stray '\374' in program
C:/Users/daniel/Documents/R/win-library/3.2/BH/include/boost/type_traits/is_base_of.hpp:9:1: error: stray '\264' in program
C:/Users/daniel/Documents/R/win-library/3.2/BH/include/boost/type_traits/is_base_of.hpp:9:1: error: stray '\20' in program
C:/Users/daniel/Documents/R/win-library/3.2/BH/include/boost/type_traits/is_base_of.hpp:9:1: error: stray '\327' in program
C:/Users/daniel/Documents/R/win-library/3.2/BH/include/boost/type_traits/is_base_of.hpp:9:1: error: stray '\351' in program
C:/Users/daniel/Documents/R/win-library/3.2/BH/include/boost/type_traits/is_base_of.hpp:9:1: error: stray '\27' in program
C:/Users/daniel/Documents/R/win-library/3.2/BH/include/boost/type_traits/is_base_of.hpp:9:1: error: stray '\204' in program
C:/Users/daniel/Documents/R/win-library/3.2/BH/include/boost/type_traits/is_base_of.hpp:9:1: error: stray '\32' in program
C:/Users/daniel/Documents/R/win-library/3.2/BH/include/boost/type_traits/is_base_of.hpp:9:1: error: stray '\232' in program
C:/Users/daniel/Documents/R/win-library/3.2/BH/include/boost/type_traits/is_base_of.hpp:10:2: error: stray '\344' in program
C:/Users/daniel/Documents/R/win-library/3.2/BH/include/boost/type_traits/is_base_of.hpp:10:2: error: stray '\240' in program
C:/Users/daniel/Documents/R/win-library/3.2/BH/include/boost/type_traits/is_base_of.hpp:10:2: error: stray '\225' in program
C:/Users/daniel/Documents/R/win-library/3.2/BH/include/boost/type_traits/is_base_of.hpp:10:2: error: stray '\266' in program
C:/Users/daniel/Documents/R/win-library/3.2/BH/include/boost/type_traits/is_base_of.hpp:10:2: error: stray '\355' in program
C:/Users/daniel/Documents/R/win-library/3.2/BH/include/boost/type_traits/is_base_of.hpp:10:2: error: stray '\343' in program
C:/Users/daniel/Documents/R/win-library/3.2/BH/include/boost/type_traits/is_base_of.hpp:10:2: error: stray '\1' in program
C:/Users/daniel/Documents/R/win-library/3.2/BH/include/boost/type_traits/is_base_of.hpp:10:2: error: stray '\307' in program
C:/Users/daniel/Documents/R/win-library/3.2/BH/include/boost/type_traits/is_base_of.hpp:10:2: error: stray '\217' in program
C:/Users/daniel/Documents/R/win-library/3.2/BH/include/boost/type_traits/is_base_of.hpp:10:2: error: stray '\371' in program
C:/Users/daniel/Documents/R/win-library/3.2/BH/include/boost/type_traits/is_base_of.hpp:10:2: error: stray '\355' in program
C:/Users/daniel/Documents/R/win-library/3.2/BH/include/boost/type_traits/is_base_of.hpp:10:2: error: stray '\307' in program
C:/Users/daniel/Documents/R/win-library/3.2/BH/include/boost/type_traits/is_base_of.hpp:10:2: error: stray '\247' in program
C:/Users/daniel/Documents/R/win-library/3.2/BH/include/boost/type_traits/is_base_of.hpp:10:2: error: stray '\317' in program
C:/Users/daniel/Documents/R/win-library/3.2/BH/include/boost/type_traits/is_base_of.hpp:10:2: error: stray '\376' in program
C:/Users/daniel/Documents/R/win-library/3.2/BH/include/boost/type_traits/is_base_of.hpp:10:2: error: stray '\316' in program
C:/Users/daniel/Documents/R/win-library/3.2/BH/include/boost/type_traits/is_base_of.hpp:10:2: error: stray '\330' in program
C:/Users/daniel/Documents/R/win-library/3.2/BH/include/boost/type_traits/is_base_of.hpp:10:2: error: stray '\25' in program
C:/Users/daniel/Documents/R/win-library/3.2/BH/include/boost/type_traits/is_base_of.hpp:10:2: error: stray '\267' in program
C:/Users/daniel/Documents/R/win-library/3.2/BH/include/boost/type_traits/is_base_of.hpp:10:2: error: stray '\337' in program
C:/Users/daniel/Documents/R/win-library/3.2/BH/include/boost/type_traits/is_base_of.hpp:10:2: error: stray '\376' in program
C:/Users/daniel/Documents/R/win-library/3.2/BH/include/boost/type_traits/is_base_of.hpp:10:2: error: stray '\33' in program
C:/Users/daniel/Documents/R/win-library/3.2/BH/include/boost/type_traits/is_base_of.hpp:10:2: error: stray '\266' in program
C:/Users/daniel/Documents/R/win-library/3.2/BH/include/boost/type_traits/is_base_of.hpp:10:2: error: stray '\254' in program
C:/Users/daniel/Documents/R/win-library/3.2/BH/include/boost/type_traits/is_base_of.hpp:10:2: error: stray '\333' in program
C:/Users/daniel/Documents/R/win-library/3.2/BH/include/boost/type_traits/is_base_of.hpp:10:2: error: stray '\227' in program
C:/Users/daniel/Documents/R/win-library/3.2/BH/include/boost/type_traits/is_base_of.hpp:10:2: error: stray '\224' in program
C:/Users/daniel/Documents/R/win-library/3.2/BH/include/boost/type_traits/is_base_of.hpp:10:2: error: stray '\372' in program
C:/Users/daniel/Documents/R/win-library/3.2/BH/include/boost/type_traits/is_base_of.hpp:10:2: error: stray '\266' in program
C:/Users/daniel/Documents/R/win-library/3.2/BH/include/boost/type_traits/is_base_of.hpp:10:2: error: stray '\333' in program
C:/Users/daniel/Documents/R/win-library/3.2/BH/include/boost/type_traits/is_base_of.hpp:10:2: error: stray '\373' in program
C:/Users/daniel/Documents/R/win-library/3.2/BH/include/boost/type_traits/is_base_of.hpp:10:2: error: stray '\' in program
C:/Users/daniel/Documents/R/win-library/3.2/BH/include/boost/type_traits/is_base_of.hpp:10:2: error: stray '\220' in program
C:/Users/daniel/Documents/R/win-library/3.2/BH/include/boost/type_traits/is_base_of.hpp:10:2: error: stray '\332' in program
C:/Users/daniel/Documents/R/win-library/3.2/BH/include/boost/type_traits/is_base_of.hpp:10:2: error: stray '\232' in program
C:/Users/daniel/Documents/R/win-library/3.2/BH/include/boost/type_traits/is_base_of.hpp:10:2: error: stray '\' in program
C:/Users/daniel/Documents/R/win-library/3.2/BH/include/boost/type_traits/is_base_of.hpp:10:2: error: stray '\217' in program
C:/Users/daniel/Documents/R/win-library/3.2/BH/include/boost/type_traits/is_base_of.hpp:10:2: error: stray '\262' in program
C:/Users/daniel/Documents/R/win-library/3.2/BH/include/boost/type_traits/is_base_of.hpp:10:2: error: stray '\217' in program
C:/Users/daniel/Documents/R/win-library/3.2/BH/include/boost/type_traits/is_base_of.hpp:10:2: error: stray '\33' in program
C:/Users/daniel/Documents/R/win-library/3.2/BH/include/boost/type_traits/is_base_of.hpp:10:2: error: stray '\211' in program
C:/Users/daniel/Documents/R/win-library/3.2/BH/include/boost/type_traits/is_base_of.hpp:10:2: error: stray '\362' in program
C:/Users/daniel/Documents/R/win-library/3.2/BH/include/boost/type_traits/is_base_of.hpp:10:2: error: stray '\246' in program
C:/Users/daniel/Documents/R/win-library/3.2/BH/include/boost/type_traits/is_base_of.hpp:11:1: error: stray '\374' in program
C:/Users/daniel/Documents/R/win-library/3.2/BH/include/boost/type_traits/is_base_of.hpp:11:1: error: stray '\230' in program
C:/Users/daniel/Documents/R/win-library/3.2/BH/include/boost/type_traits/is_base_of.hpp:11:1: error: stray '\317' in program
C:/Users/daniel/Documents/R/win-library/3.2/BH/include/boost/type_traits/is_base_of.hpp:11:1: error: stray '\225' in program
C:/Users/daniel/Documents/R/win-library/3.2/BH/include/boost/type_traits/is_base_of.hpp:11:1: error: stray '\362' in program
C:/Users/daniel/Documents/R/win-library/3.2/BH/include/boost/type_traits/is_base_of.hpp:11:1: error: stray '\251' in program
C:/Users/daniel/Documents/R/win-library/3.2/BH/include/boost/type_traits/is_base_of.hpp:11:1: error: stray '\330' in program
C:/Users/daniel/Documents/R/win-library/3.2/BH/include/boost/type_traits/is_base_of.hpp:11:1: error: stray '\333' in program
C:/Users/daniel/Documents/R/win-library/3.2/BH/include/boost/type_traits/is_base_of.hpp:11:1: error: stray '\225' in program
C:/Users/daniel/Documents/R/win-library/3.2/BH/include/boost/type_traits/is_base_of.hpp:11:1: error: stray '\6' in program
C:/Users/daniel/Documents/R/win-library/3.2/BH/include/boost/type_traits/is_base_of.hpp:11:1: error: stray '\201' in program
C:/Users/daniel/Documents/R/win-library/3.2/BH/include/boost/type_traits/is_base_of.hpp:11:1: error: stray '\336' in program
C:/Users/daniel/Documents/R/win-library/3.2/BH/include/boost/type_traits/is_base_of.hpp:11:1: error: stray '#' in program
C:/Users/daniel/Documents/R/win-library/3.2/BH/include/boost/type_traits/is_base_of.hpp:11:1: error: stray '\216' in program
C:/Users/daniel/Documents/R/win-library/3.2/BH/include/boost/type_traits/is_base_of.hpp:11:1: error: stray '\270' in program
C:/Users/daniel/Documents/R/win-library/3.2/BH/include/boost/type_traits/is_base_of.hpp:11:1: error: stray '\242' in program
C:/Users/daniel/Documents/R/win-library/3.2/BH/include/boost/type_traits/is_base_of.hpp:11:1: error: stray '\215' in program
C:/Users/daniel/Documents/R/win-library/3.2/BH/include/boost/type_traits/is_base_of.hpp:11:1: error: stray '\2' in program
C:/Users/daniel/Documents/R/win-library/3.2/BH/include/boost/type_traits/is_base_of.hpp:11:1: error: stray '\312' in program
C:/Users/daniel/Documents/R/win-library/3.2/BH/include/boost/type_traits/is_base_of.hpp:11:1: error: stray '\305' in program
C:/Users/daniel/Documents/R/win-library/3.2/BH/include/boost/type_traits/is_base_of.hpp:11:1: error: stray '\7' in program
C:/Users/daniel/Documents/R/win-library/3.2/BH/include/boost/type_traits/is_base_of.hpp:11:1: error: stray '\270' in program
C:/Users/daniel/Documents/R/win-library/3.2/BH/include/boost/type_traits/is_base_of.hpp:11:1: error: stray '@' in program
C:/Users/daniel/Documents/R/win-library/3.2/BH/include/boost/type_traits/is_base_of.hpp:11:1: error: stray '\211' in program
C:/Users/daniel/Documents/R/win-library/3.2/BH/include/boost/type_traits/is_base_of.hpp:11:1: error: stray '\323' in program
C:/Users/daniel/Documents/R/win-library/3.2/BH/include/boost/type_traits/is_base_of.hpp:11:1: error: stray '\16' in program
C:/Users/daniel/Documents/R/win-library/3.2/BH/include/boost/type_traits/is_base_of.hpp:11:1: error: missing terminating " character
C:/Users/daniel/Documents/R/win-library/3.2/BH/include/boost/type_traits/is_base_of.hpp:12:1: error: stray '\33' in program
C:/Users/daniel/Documents/R/win-library/3.2/BH/include/boost/type_traits/is_base_of.hpp:12:1: error: stray '\340' in program
C:/Users/daniel/Documents/R/win-library/3.2/BH/include/boost/type_traits/is_base_of.hpp:12:1: error: stray '\215' in program
C:/Users/daniel/Documents/R/win-library/3.2/BH/include/boost/type_traits/is_base_of.hpp:12:1: error: stray '\6' in program
C:/Users/daniel/Documents/R/win-library/3.2/BH/include/boost/type_traits/is_base_of.hpp:12:1: error: stray '\210' in program
C:/Users/daniel/Documents/R/win-library/3.2/BH/include/boost/type_traits/is_base_of.hpp:12:1: error: stray '\224' in program
C:/Users/daniel/Documents/R/win-library/3.2/BH/include/boost/type_traits/is_base_of.hpp:12:1: error: stray '\344' in program
C:/Users/daniel/Documents/R/win-library/3.2/BH/include/boost/type_traits/is_base_of.hpp:12:1: error: stray '\361' in program
C:/Users/daniel/Documents/R/win-library/3.2/BH/include/boost/type_traits/is_base_of.hpp:12:1: error: stray '\313' in program
C:/Users/daniel/Documents/R/win-library/3.2/BH/include/boost/type_traits/is_base_of.hpp:12:1: error: stray '\310' in program
C:/Users/daniel/Documents/R/win-library/3.2/BH/include/boost/type_traits/is_base_of.hpp:12:1: error: stray '\2' in program
C:/Users/daniel/Documents/R/win-library/3.2/BH/include/boost/type_traits/is_base_of.hpp:12:1: error: stray '\264' in program
C:/Users/daniel/Documents/R/win-library/3.2/BH/include/boost/type_traits/is_base_of.hpp:12:1: error: stray '\306' in program
C:/Users/daniel/Documents/R/win-library/3.2/BH/include/boost/type_traits/is_base_of.hpp:12:1: error: stray '@' in program
C:/Users/daniel/Documents/R/win-library/3.2/BH/include/boost/type_traits/is_base_of.hpp:12:1: error: stray '\266' in program
C:/Users/daniel/Documents/R/win-library/3.2/BH/include/boost/type_traits/is_base_of.hpp:12:1: error: stray '\311' in program
C:/Users/daniel/Documents/R/win-library/3.2/BH/include/boost/type_traits/is_base_of.hpp:12:1: error: stray '\221' in program
C:/Users/daniel/Documents/R/win-library/3.2/BH/include/boost/type_traits/is_base_of.hpp:12:1: error: stray '\25' in program
C:/Users/daniel/Documents/R/win-library/3.2/BH/include/boost/type_traits/is_base_of.hpp:12:1: error: stray '\200' in program
C:/Users/daniel/Documents/R/win-library/3.2/BH/include/boost/type_traits/is_base_of.hpp:12:1: error: stray '\272' in program
C:/Users/daniel/Documents/R/win-library/3.2/BH/include/boost/type_traits/is_base_of.hpp:12:1: error: stray '\245' in program
C:/Users/daniel/Documents/R/win-library/3.2/BH/include/boost/type_traits/is_base_of.hpp:12:1: error: stray '\301' in program
C:/Users/daniel/Documents/R/win-library/3.2/BH/include/boost/type_traits/is_base_of.hpp:12:1: error: stray '\303' in program
C:/Users/daniel/Documents/R/win-library/3.2/BH/include/boost/type_traits/is_base_of.hpp:12:1: error: stray '\325' in program
C:/Users/daniel/Documents/R/win-library/3.2/BH/include/boost/type_traits/is_base_of.hpp:12:1: error: stray '\221' in program
C:/Users/daniel/Documents/R/win-library/3.2/BH/include/boost/type_traits/is_base_of.hpp:12:1: error: stray '\215' in program
C:/Users/daniel/Documents/R/win-library/3.2/BH/include/boost/type_traits/is_base_of.hpp:12:1: error: stray '\200' in program
C:/Users/daniel/Documents/R/win-library/3.2/BH/include/boost/type_traits/is_base_of.hpp:12:1: error: stray '\202' in program
C:/Users/daniel/Documents/R/win-library/3.2/BH/include/boost/type_traits/is_base_of.hpp:12:1: error: stray '\24' in program
C:/Users/daniel/Documents/R/win-library/3.2/BH/include/boost/type_traits/is_base_of.hpp:12:1: error: stray '\326' in program
C:/Users/daniel/Documents/R/win-library/3.2/BH/include/boost/type_traits/is_base_of.hpp:12:1: error: stray '\225' in program
C:/Users/daniel/Documents/R/win-library/3.2/BH/include/boost/type_traits/is_base_of.hpp:12:1: error: stray '\244' in program
C:/Users/daniel/Documents/R/win-library/3.2/BH/include/boost/type_traits/is_base_of.hpp:12:1: error: stray '\302' in program
C:/Users/daniel/Documents/R/win-library/3.2/BH/include/boost/type_traits/is_base_of.hpp:12:1: error: stray '\277' in program
C:/Users/daniel/Documents/R/win-library/3.2/BH/include/boost/type_traits/is_base_of.hpp:12:1: error: stray '\4' in program
C:/Users/daniel/Documents/R/win-library/3.2/BH/include/boost/type_traits/is_base_of.hpp:12:1: error: stray '\10' in program
C:/Users/daniel/Documents/R/win-library/3.2/BH/include/boost/type_traits/is_base_of.hpp:12:1: error: stray '\247' in program
C:/Users/daniel/Documents/R/win-library/3.2/BH/include/boost/type_traits/is_base_of.hpp:12:1: error: stray '\35' in program
C:/Users/daniel/Documents/R/win-library/3.2/BH/include/boost/type_traits/is_base_of.hpp:12:1: error: stray '\250' in program
C:/Users/daniel/Documents/R/win-library/3.2/BH/include/boost/type_traits/is_base_of.hpp:12:1: error: stray '\275' in program
C:/Users/daniel/Documents/R/win-library/3.2/BH/include/boost/type_traits/is_base_of.hpp:12:1: error: stray '\372' in program
C:/Users/daniel/Documents/R/win-library/3.2/BH/include/boost/type_traits/is_base_of.hpp:13:1: error: stray '\313' in program
C:/Users/daniel/Documents/R/win-library/3.2/BH/include/boost/type_traits/is_base_of.hpp:13:1: error: stray '\255' in program
C:/Users/daniel/Documents/R/win-library/3.2/BH/include/boost/type_traits/is_base_of.hpp:13:1: error: stray '\325' in program
C:/Users/daniel/Documents/R/win-library/3.2/BH/include/boost/type_traits/is_base_of.hpp:13:1: error: stray '\341' in program
C:/Users/daniel/Documents/R/win-library/3.2/BH/include/boost/type_traits/is_base_of.hpp:13:1: error: stray '\360' in program
C:/Users/daniel/Documents/R/win-library/3.2/BH/include/boost/type_traits/is_base_of.hpp:13:1: error: stray '\232' in program
C:/Users/daniel/Documents/R/win-library/3.2/BH/include/boost/type_traits/is_base_of.hpp:13:1: error: stray '\276' in program
C:/Users/daniel/Documents/R/win-library/3.2/BH/include/boost/type_traits/is_base_of.hpp:13:1: error: stray '\5' in program
C:/Users/daniel/Documents/R/win-library/3.2/BH/include/boost/type_traits/is_base_of.hpp:13:1: error: stray '\263' in program
C:/Users/daniel/Documents/R/win-library/3.2/BH/include/boost/type_traits/is_base_of.hpp:13:1: error: stray '\315' in program
C:/Users/daniel/Documents/R/win-library/3.2/BH/include/boost/type_traits/is_base_of.hpp:13:1: error: stray '\253' in program
C:/Users/daniel/Documents/R/win-library/3.2/BH/include/boost/type_traits/is_base_of.hpp:13:1: error: stray '\31' in program
C:/Users/daniel/Documents/R/win-library/3.2/BH/include/boost/type_traits/is_base_of.hpp:13:1: error: stray '\271' in program
C:/Users/daniel/Documents/R/win-library/3.2/BH/include/boost/type_traits/is_base_of.hpp:13:1: error: stray '\222' in program
C:/Users/daniel/Documents/R/win-library/3.2/BH/include/boost/type_traits/is_base_of.hpp:13:1: error: stray '\254' in program
C:/Users/daniel/Documents/R/win-library/3.2/BH/include/boost/type_traits/is_base_of.hpp:13:1: error: stray '\307' in program
C:/Users/daniel/Documents/R/win-library/3.2/BH/include/boost/type_traits/is_base_of.hpp:13:1: error: stray '\33' in program
C:/Users/daniel/Documents/R/win-library/3.2/BH/include/boost/type_traits/is_base_of.hpp:13:1: error: stray '\235' in program
C:/Users/daniel/Documents/R/win-library/3.2/BH/include/boost/type_traits/is_base_of.hpp:13:1: error: stray '\202' in program
C:/Users/daniel/Documents/R/win-library/3.2/BH/include/boost/type_traits/is_base_of.hpp:13:1: error: stray '\263' in program
C:/Users/daniel/Documents/R/win-library/3.2/BH/include/boost/type_traits/is_base_of.hpp:13:1: error: stray '\20' in program
C:/Users/daniel/Documents/R/win-library/3.2/BH/include/boost/type_traits/is_base_of.hpp:14:1: error: stray '\261' in program
C:/Users/daniel/Documents/R/win-library/3.2/BH/include/boost/type_traits/is_base_of.hpp:14:1: error: stray '\320' in program
C:/Users/daniel/Documents/R/win-library/3.2/BH/include/boost/type_traits/is_base_of.hpp:14:1: error: stray '\20' in program
C:/Users/daniel/Documents/R/win-library/3.2/BH/include/boost/type_traits/is_base_of.hpp:14:1: error: stray '\17' in program
C:/Users/daniel/Documents/R/win-library/3.2/BH/include/boost/type_traits/is_base_of.hpp:14:1: error: stray '\212' in program
C:/Users/daniel/Documents/R/win-library/3.2/BH/include/boost/type_traits/is_base_of.hpp:14:1: error: stray '\346' in program
C:/Users/daniel/Documents/R/win-library/3.2/BH/include/boost/type_traits/is_base_of.hpp:14:1: error: stray '\231' in program
C:/Users/daniel/Documents/R/win-library/3.2/BH/include/boost/type_traits/is_base_of.hpp:14:1: error: stray '\27' in program
C:/Users/daniel/Documents/R/win-library/3.2/BH/include/boost/type_traits/is_base_of.hpp:14:1: error: stray '\311' in program
C:/Users/daniel/Documents/R/win-library/3.2/BH/include/boost/type_traits/is_base_of.hpp:14:1: error: stray '\346' in program
C:/Users/daniel/Documents/R/win-library/3.2/BH/include/boost/type_traits/is_base_of.hpp:14:1: error: stray '\17' in program
C:/Users/daniel/Documents/R/win-library/3.2/BH/include/boost/type_traits/is_base_of.hpp:14:1: error: stray '\370' in program
C:/Users/daniel/Documents/R/win-library/3.2/BH/include/boost/type_traits/is_base_of.hpp:14:1: error: stray '\177' in program
C:/Users/daniel/Documents/R/win-library/3.2/BH/include/boost/type_traits/is_base_of.hpp:14:1: error: stray '\361' in program
C:/Users/daniel/Documents/R/win-library/3.2/BH/include/boost/type_traits/is_base_of.hpp:14:1: error: stray '\336' in program
C:/Users/daniel/Documents/R/win-library/3.2/BH/include/boost/type_traits/is_base_of.hpp:14:1: error: stray '\216' in program
C:/Users/daniel/Documents/R/win-library/3.2/BH/include/boost/type_traits/is_base_of.hpp:14:1: error: stray '\220' in program
C:/Users/daniel/Documents/R/win-library/3.2/BH/include/boost/type_traits/is_base_of.hpp:14:1: error: missing terminating " character
C:/Users/daniel/Documents/R/win-library/3.2/BH/include/boost/type_traits/is_base_of.hpp:15:1: error: stray '\233' in program
C:/Users/daniel/Documents/R/win-library/3.2/BH/include/boost/type_traits/is_base_of.hpp:15:1: error: stray '\224' in program
C:/Users/daniel/Documents/R/win-library/3.2/BH/include/boost/type_traits/is_base_of.hpp:15:1: error: stray '\35' in program
C:/Users/daniel/Documents/R/win-library/3.2/BH/include/boost/type_traits/is_base_of.hpp:15:1: error: stray '`' in program
C:/Users/daniel/Documents/R/win-library/3.2/BH/include/boost/type_traits/is_base_of.hpp:15:1: error: stray '\360' in program
C:/Users/daniel/Documents/R/win-library/3.2/BH/include/boost/type_traits/is_base_of.hpp:15:1: error: stray '\331' in program
C:/Users/daniel/Documents/R/win-library/3.2/BH/include/boost/type_traits/is_base_of.hpp:15:1: error: stray '\260' in program
C:/Users/daniel/Documents/R/win-library/3.2/BH/include/boost/type_traits/is_base_of.hpp:15:1: error: stray '\34' in program
C:/Users/daniel/Documents/R/win-library/3.2/BH/include/boost/type_traits/is_base_of.hpp:15:1: error: stray '\312' in program
C:/Users/daniel/Documents/R/win-library/3.2/BH/include/boost/type_traits/is_base_of.hpp:15:1: error: stray '\204' in program
C:/Users/daniel/Documents/R/win-library/3.2/BH/include/boost/type_traits/is_base_of.hpp:15:1: error: stray '\4' in program
C:/Users/daniel/Documents/R/win-library/3.2/BH/include/boost/type_traits/is_base_of.hpp:15:1: error: stray '\356' in program
C:/Users/daniel/Documents/R/win-library/3.2/BH/include/boost/type_traits/is_base_of.hpp:15:1: error: stray '\337' in program
C:/Users/daniel/Documents/R/win-library/3.2/BH/include/boost/type_traits/is_base_of.hpp:15:1: error: stray '\5' in program
C:/Users/daniel/Documents/R/win-library/3.2/BH/include/boost/type_traits/is_base_of.hpp:15:20: error: invalid suffix "t" on integer constant
C:/Users/daniel/Documents/R/win-library/3.2/BH/include/boost/type_traits/is_base_of.hpp:15:1: error: stray '\335' in program
C:/Users/daniel/Documents/R/win-library/3.2/BH/include/boost/type_traits/is_base_of.hpp:15:1: error: stray '\277' in program
C:/Users/daniel/Documents/R/win-library/3.2/BH/include/boost/type_traits/is_base_of.hpp:15:1: error: stray '\217' in program
C:/Users/daniel/Documents/R/win-library/3.2/BH/include/boost/type_traits/is_base_of.hpp:15:1: error: stray '\21' in program
C:/Users/daniel/Documents/R/win-library/3.2/BH/include/boost/type_traits/is_base_of.hpp:15:1: error: stray '\270' in program
C:/Users/daniel/Documents/R/win-library/3.2/BH/include/boost/type_traits/is_base_of.hpp:15:1: error: stray '\356' in program
C:/Users/daniel/Documents/R/win-library/3.2/BH/include/boost/type_traits/is_base_of.hpp:15:33: error: invalid suffix "USyNH" on integer constant
C:/Users/daniel/Documents/R/win-library/3.2/BH/include/boost/type_traits/is_base_of.hpp:15:1: error: stray '\307' in program
C:/Users/daniel/Documents/R/win-library/3.2/BH/include/boost/type_traits/is_base_of.hpp:15:1: error: stray '\302' in program
C:/Users/daniel/Documents/R/win-library/3.2/BH/include/boost/type_traits/is_base_of.hpp:15:1: error: stray '\371' in program
C:/Users/daniel/Documents/R/win-library/3.2/BH/include/boost/type_traits/is_base_of.hpp:15:1: error: stray '\360' in program
C:/Users/daniel/Documents/R/win-library/3.2/BH/include/boost/type_traits/is_base_of.hpp:15:1: error: stray '\322' in program
C:/Users/daniel/Documents/R/win-library/3.2/BH/include/boost/type_traits/is_base_of.hpp:15:1: error: stray '\316' in program
C:/Users/daniel/Documents/R/win-library/3.2/BH/include/boost/type_traits/is_base_of.hpp:15:1: error: stray '\356' in program
C:/Users/daniel/Documents/R/win-library/3.2/BH/include/boost/type_traits/is_base_of.hpp:15:1: error: stray '\27' in program
C:/Users/daniel/Documents/R/win-library/3.2/BH/include/boost/type_traits/is_base_of.hpp:15:1: error: stray '\244' in program
C:/Users/daniel/Documents/R/win-library/3.2/BH/include/boost/type_traits/is_base_of.hpp:15:1: error: stray '\276' in program
C:/Users/daniel/Documents/R/win-library/3.2/BH/include/boost/type_traits/is_base_of.hpp:15:1: error: stray '\247' in program
C:/Users/daniel/Documents/R/win-library/3.2/BH/include/boost/type_traits/is_base_of.hpp:15:1: error: stray '\236' in program
C:/Users/daniel/Documents/R/win-library/3.2/BH/include/boost/type_traits/is_base_of.hpp:15:1: error: stray '\341' in program
C:/Users/daniel/Documents/R/win-library/3.2/BH/include/boost/type_traits/is_base_of.hpp:15:1: error: stray '\306' in program
C:/Users/daniel/Documents/R/win-library/3.2/BH/include/boost/type_traits/is_base_of.hpp:15:1: error: stray '\254' in program
C:/Users/daniel/Documents/R/win-library/3.2/BH/include/boost/type_traits/is_base_of.hpp:15:1: error: stray '\27' in program
C:/Users/daniel/Documents/R/win-library/3.2/BH/include/boost/type_traits/is_base_of.hpp:15:1: error: stray '\253' in program
C:/Users/daniel/Documents/R/win-library/3.2/BH/include/boost/type_traits/is_base_of.hpp:15:1: error: stray '\243' in program
C:/Users/daniel/Documents/R/win-library/3.2/BH/include/boost/type_traits/is_base_of.hpp:15:1: error: stray '\24' in program
C:/Users/daniel/Documents/R/win-library/3.2/BH/include/boost/type_traits/is_base_of.hpp:15:1: error: missing terminating " character
C:/Users/daniel/Documents/R/win-library/3.2/BH/include/boost/type_traits/is_base_of.hpp:16:1: error: stray '\20' in program
C:/Users/daniel/Documents/R/win-library/3.2/BH/include/boost/type_traits/is_base_of.hpp:16:1: error: stray '\246' in program
C:/Users/daniel/Documents/R/win-library/3.2/BH/include/boost/type_traits/is_base_of.hpp:16:1: error: stray '\35' in program
C:/Users/daniel/Documents/R/win-library/3.2/BH/include/boost/type_traits/is_base_of.hpp:16:1: error: stray '\236' in program
C:/Users/daniel/Documents/R/win-library/3.2/BH/include/boost/type_traits/is_base_of.hpp:16:1: error: stray '\344' in program
C:/Users/daniel/Documents/R/win-library/3.2/BH/include/boost/type_traits/is_base_of.hpp:16:1: error: stray '\331' in program
C:/Users/daniel/Documents/R/win-library/3.2/BH/include/boost/type_traits/is_base_of.hpp:16:1: error: stray '\35' in program
C:/Users/daniel/Documents/R/win-library/3.2/BH/include/boost/type_traits/is_base_of.hpp:16:1: error: stray '\36' in program
C:/Users/daniel/Documents/R/win-library/3.2/BH/include/boost/type_traits/is_base_of.hpp:16:1: error: stray '\252' in program
C:/Users/daniel/Documents/R/win-library/3.2/BH/include/boost/type_traits/is_base_of.hpp:16:1: error: stray '\255' in program
C:/Users/daniel/Documents/R/win-library/3.2/BH/include/boost/type_traits/is_base_of.hpp:16:1: error: stray '\3' in program
C:/Users/daniel/Documents/R/win-library/3.2/BH/include/boost/type_traits/is_base_of.hpp:16:1: error: stray '\7' in program
C:/Users/daniel/Documents/R/win-library/3.2/BH/include/boost/type_traits/is_base_of.hpp:16:1: error: stray '\304' in program
C:/Users/daniel/Documents/R/win-library/3.2/BH/include/boost/type_traits/is_base_of.hpp:16:1: error: stray '\356' in program
C:/Users/daniel/Documents/R/win-library/3.2/BH/include/boost/type_traits/is_base_of.hpp:16:1: error: stray '\16' in program
C:/Users/daniel/Documents/R/win-library/3.2/BH/include/boost/type_traits/is_base_of.hpp:16:1: error: stray '\6' in program
C:/Users/daniel/Documents/R/win-library/3.2/BH/include/boost/type_traits/is_base_of.hpp:16:1: error: stray '\31' in program
C:/Users/daniel/Documents/R/win-library/3.2/BH/include/boost/type_traits/is_base_of.hpp:16:1: error: stray '\274' in program
C:/Users/daniel/Documents/R/win-library/3.2/BH/include/boost/type_traits/is_base_of.hpp:16:1: error: stray '\241' in program
C:/Users/daniel/Documents/R/win-library/3.2/BH/include/boost/type_traits/is_base_of.hpp:16:1: error: stray '\24' in program
C:/Users/daniel/Documents/R/win-library/3.2/BH/include/boost/type_traits/is_base_of.hpp:16:1: error: stray '\346' in program
C:/Users/daniel/Documents/R/win-library/3.2/BH/include/boost/type_traits/is_base_of.hpp:16:1: error: stray '\16' in program
C:/Users/daniel/Documents/R/win-library/3.2/BH/include/boost/type_traits/is_base_of.hpp:16:1: error: stray '\200' in program
C:/Users/daniel/Documents/R/win-library/3.2/BH/include/boost/type_traits/is_base_of.hpp:16:1: error: stray '`' in program
C:/Users/daniel/Documents/R/win-library/3.2/BH/include/boost/type_traits/is_base_of.hpp:16:1: error: stray '\5' in program
C:/Users/daniel/Documents/R/win-library/3.2/BH/include/boost/type_traits/is_base_of.hpp:16:1: error: stray '\215' in program
C:/Users/daniel/Documents/R/win-library/3.2/BH/include/boost/type_traits/is_base_of.hpp:16:1: error: stray '\325' in program
C:/Users/daniel/Documents/R/win-library/3.2/BH/include/boost/type_traits/is_base_of.hpp:16:1: error: stray '\265' in program
C:/Users/daniel/Documents/R/win-library/3.2/BH/include/boost/type_traits/is_base_of.hpp:16:1: error: stray '\261' in program
C:/Users/daniel/Documents/R/win-library/3.2/BH/include/boost/type_traits/is_base_of.hpp:16:1: error: stray '\300' in program
C:/Users/daniel/Documents/R/win-library/3.2/BH/include/boost/type_traits/is_base_of.hpp:16:1: error: stray '\323' in program
C:/Users/daniel/Documents/R/win-library/3.2/BH/include/boost/type_traits/is_base_of.hpp:16:1: error: stray '\344' in program
C:/Users/daniel/Documents/R/win-library/3.2/BH/include/boost/type_traits/is_base_of.hpp:16:1: error: stray '\365' in program
C:/Users/daniel/Documents/R/win-library/3.2/BH/include/boost/type_traits/is_base_of.hpp:16:1: error: stray '\274' in program
C:/Users/daniel/Documents/R/win-library/3.2/BH/include/boost/type_traits/is_base_of.hpp:16:1: error: stray '\215' in program
C:/Users/daniel/Documents/R/win-library/3.2/BH/include/boost/type_traits/is_base_of.hpp:16:1: error: stray '\317' in program
C:/Users/daniel/Documents/R/win-library/3.2/BH/include/boost/type_traits/is_base_of.hpp:16:1: error: stray '\227' in program
C:/Users/daniel/Documents/R/win-library/3.2/BH/include/boost/type_traits/is_base_of.hpp:16:1: error: stray '\234' in program
C:/Users/daniel/Documents/R/win-library/3.2/BH/include/boost/type_traits/is_base_of.hpp:16:1: error: stray '\226' in program
C:/Users/daniel/Documents/R/win-library/3.2/BH/include/boost/type_traits/is_base_of.hpp:16:1: error: stray '\317' in program
C:/Users/daniel/Documents/R/win-library/3.2/BH/include/boost/type_traits/is_base_of.hpp:16:1: error: stray '\234' in program
C:/Users/daniel/Documents/R/win-library/3.2/BH/include/boost/type_traits/is_base_of.hpp:16:1: error: stray '\223' in program
C:/Users/daniel/Documents/R/win-library/3.2/BH/include/boost/type_traits/is_base_of.hpp:16:1: error: stray '\370' in program
C:/Users/daniel/Documents/R/win-library/3.2/BH/include/boost/type_traits/is_base_of.hpp:16:1: error: stray '\235' in program
C:/Users/daniel/Documents/R/win-library/3.2/BH/include/boost/type_traits/is_base_of.hpp:16:1: error: stray '\16' in program
C:/Users/daniel/Documents/R/win-library/3.2/BH/include/boost/type_traits/is_base_of.hpp:16:1: error: stray '\251' in program
C:/Users/daniel/Documents/R/win-library/3.2/BH/include/boost/type_traits/is_base_of.hpp:16:1: error: stray '\306' in program
C:/Users/daniel/Documents/R/win-library/3.2/BH/include/boost/type_traits/is_base_of.hpp:16:1: error: stray '\360' in program
C:/Users/daniel/Documents/R/win-library/3.2/BH/include/boost/type_traits/is_base_of.hpp:16:1: error: stray '\374' in program
C:/Users/daniel/Documents/R/win-library/3.2/BH/include/boost/type_traits/is_base_of.hpp:16:1: error: stray '\376' in program
C:/Users/daniel/Documents/R/win-library/3.2/BH/include/boost/type_traits/is_base_of.hpp:16:1: error: stray '\365' in program
C:/Users/daniel/Documents/R/win-library/3.2/BH/include/boost/type_traits/is_base_of.hpp:16:1: error: stray '\226' in program
C:/Users/daniel/Documents/R/win-library/3.2/BH/include/boost/type_traits/is_base_of.hpp:16:1: error: stray '\345' in program
C:/Users/daniel/Documents/R/win-library/3.2/BH/include/boost/type_traits/is_base_of.hpp:16:1: error: stray '\334' in program
C:/Users/daniel/Documents/R/win-library/3.2/BH/include/boost/type_traits/is_base_of.hpp:16:1: error: stray '@' in program
C:/Users/daniel/Documents/R/win-library/3.2/BH/include/boost/type_traits/is_base_of.hpp:16:1: error: stray '\23' in program
C:/Users/daniel/Documents/R/win-library/3.2/BH/include/boost/type_traits/is_base_of.hpp:16:1: error: stray '\177' in program
C:/Users/daniel/Documents/R/win-library/3.2/BH/include/boost/type_traits/is_base_of.hpp:16:1: error: stray '\250' in program
C:/Users/daniel/Documents/R/win-library/3.2/BH/include/boost/type_traits/is_base_of.hpp:16:1: error: stray '\323' in program
C:/Users/daniel/Documents/R/win-library/3.2/BH/include/boost/type_traits/is_base_of.hpp:16:1: error: stray '\10' in program
C:/Users/daniel/Documents/R/win-library/3.2/BH/include/boost/type_traits/is_base_of.hpp:16:1: error: stray '\7' in program
C:/Users/daniel/Documents/R/win-library/3.2/BH/include/boost/type_traits/is_base_of.hpp:16:1: error: stray '\32' in program
C:/Users/daniel/Documents/R/win-library/3.2/BH/include/boost/type_traits/is_base_of.hpp:16:1: error: stray '\224' in program
C:/Users/daniel/Documents/R/win-library/3.2/BH/include/boost/type_traits/is_base_of.hpp:16:1: error: stray '\225' in program
C:/Users/daniel/Documents/R/win-library/3.2/BH/include/boost/type_traits/is_base_of.hpp:16:1: error: stray '\326' in program
C:/Users/daniel/Documents/R/win-library/3.2/BH/include/boost/type_traits/is_base_of.hpp:16:1: error: stray '\5' in program
C:/Users/daniel/Documents/R/win-library/3.2/BH/include/boost/type_traits/is_base_of.hpp:16:1: error: stray '\300' in program
C:/Users/daniel/Documents/R/win-library/3.2/BH/include/boost/type_traits/is_base_of.hpp:16:1: error: stray '\234' in program
C:/Users/daniel/Documents/R/win-library/3.2/BH/include/boost/type_traits/is_base_of.hpp:16:1: error: stray '\25' in program
C:/Users/daniel/Documents/R/win-library/3.2/BH/include/boost/type_traits/is_base_of.hpp:16:1: error: stray '\30' in program
C:/Users/daniel/Documents/R/win-library/3.2/BH/include/boost/type_traits/is_base_of.hpp:16:1: error: stray '\24' in program
C:/Users/daniel/Documents/R/win-library/3.2/BH/include/boost/type_traits/is_base_of.hpp:16:1: error: stray '\245' in program
C:/Users/daniel/Documents/R/win-library/3.2/BH/include/boost/type_traits/is_base_of.hpp:16:1: error: stray '\207' in program
C:/Users/daniel/Documents/R/win-library/3.2/BH/include/boost/type_traits/is_base_of.hpp:16:1: error: stray '\332' in program
C:/Users/daniel/Documents/R/win-library/3.2/BH/include/boost/type_traits/is_base_of.hpp:16:1: error: stray '\10' in program
C:/Users/daniel/Documents/R/win-library/3.2/BH/include/boost/type_traits/is_base_of.hpp:16:1: error: stray '\25' in program
C:/Users/daniel/Documents/R/win-library/3.2/BH/include/boost/type_traits/is_base_of.hpp:16:1: error: stray '\267' in program
C:/Users/daniel/Documents/R/win-library/3.2/BH/include/boost/type_traits/is_base_of.hpp:16:1: error: stray '\306' in program
C:/Users/daniel/Documents/R/win-library/3.2/BH/include/boost/type_traits/is_base_of.hpp:16:1: error: stray '\200' in program
C:/Users/daniel/Documents/R/win-library/3.2/BH/include/boost/type_traits/is_base_of.hpp:16:1: error: stray '\200' in program
C:/Users/daniel/Documents/R/win-library/3.2/BH/include/boost/type_traits/is_base_of.hpp:16:1: error: stray '\323' in program
C:/Users/daniel/Documents/R/win-library/3.2/BH/include/boost/type_traits/is_base_of.hpp:16:1: error: stray '\344' in program
C:/Users/daniel/Documents/R/win-library/3.2/BH/include/boost/type_traits/is_base_of.hpp:16:1: error: stray '\311' in program
C:/Users/daniel/Documents/R/win-library/3.2/BH/include/boost/type_traits/is_base_of.hpp:16:1: error: stray '\233' in program
C:/Users/daniel/Documents/R/win-library/3.2/BH/include/boost/type_traits/is_base_of.hpp:16:1: error: stray '\301' in program
C:/Users/daniel/Documents/R/win-library/3.2/BH/include/boost/type_traits/is_base_of.hpp:16:1: error: stray '\210' in program
C:/Users/daniel/Documents/R/win-library/3.2/BH/include/boost/type_traits/is_base_of.hpp:16:1: error: stray '\206' in program
C:/Users/daniel/Documents/R/win-library/3.2/BH/include/boost/type_traits/is_base_of.hpp:16:1: error: stray '\27' in program
C:/Users/daniel/Documents/R/win-library/3.2/BH/include/boost/type_traits/is_base_of.hpp:16:1: error: stray '\231' in program
C:/Users/daniel/Documents/R/win-library/3.2/BH/include/boost/type_traits/is_base_of.hpp:16:1: error: stray '@' in program
C:/Users/daniel/Documents/R/win-library/3.2/BH/include/boost/type_traits/is_base_of.hpp:16:1: error: stray '\365' in program
C:/Users/daniel/Documents/R/win-library/3.2/BH/include/boost/type_traits/is_base_of.hpp:16:1: error: stray '\233' in program
C:/Users/daniel/Documents/R/win-library/3.2/BH/include/boost/type_traits/is_base_of.hpp:16:1: error: stray '\307' in program
C:/Users/daniel/Documents/R/win-library/3.2/BH/include/boost/type_traits/is_base_of.hpp:16:1: error: stray '\270' in program
C:/Users/daniel/Documents/R/win-library/3.2/BH/include/boost/type_traits/is_base_of.hpp:16:1: error: stray '\321' in program
C:/Users/daniel/Documents/R/win-library/3.2/BH/include/boost/type_traits/is_base_of.hpp:16:1: error: stray '\216' in program
C:/Users/daniel/Documents/R/win-library/3.2/BH/include/boost/type_traits/is_base_of.hpp:16:1: error: stray '\240' in program
C:/Users/daniel/Documents/R/win-library/3.2/BH/include/boost/type_traits/is_base_of.hpp:16:1: error: stray '\350' in program
C:/Users/daniel/Documents/R/win-library/3.2/BH/include/boost/type_traits/is_base_of.hpp:16:1: error: stray '\373' in program
C:/Users/daniel/Documents/R/win-library/3.2/BH/include/boost/type_traits/is_base_of.hpp:16:156: error: invalid suffix "M" on integer constant
C:/Users/daniel/Documents/R/win-library/3.2/BH/include/boost/type_traits/is_base_of.hpp:16:1: error: stray '\237' in program
C:/Users/daniel/Documents/R/win-library/3.2/BH/include/boost/type_traits/is_base_of.hpp:16:1: error: stray '\325' in program
C:/Users/daniel/Documents/R/win-library/3.2/BH/include/boost/type_traits/is_base_of.hpp:16:1: error: stray '\315' in program
C:/Users/daniel/Documents/R/win-library/3.2/BH/include/boost/type_traits/is_base_of.hpp:16:1: error: stray '\324' in program
C:/Users/daniel/Documents/R/win-library/3.2/BH/include/boost/type_traits/is_base_of.hpp:16:1: error: stray '\374' in program
C:/Users/daniel/Documents/R/win-library/3.2/BH/include/boost/type_traits/is_base_of.hpp:16:1: error: stray '\343' in program
C:/Users/daniel/Documents/R/win-library/3.2/BH/include/boost/type_traits/is_base_of.hpp:16:1: error: stray '\16' in program
C:/Users/daniel/Documents/R/win-library/3.2/BH/include/boost/type_traits/is_base_of.hpp:16:167: error: invalid suffix "o" on integer constant
C:/Users/daniel/Documents/R/win-library/3.2/BH/include/boost/type_traits/is_base_of.hpp:16:1: error: stray '\320' in program
C:/Users/daniel/Documents/R/win-library/3.2/BH/include/boost/type_traits/is_base_of.hpp:16:1: error: stray '\232' in program
C:/Users/daniel/Documents/R/win-library/3.2/BH/include/boost/type_traits/is_base_of.hpp:16:1: error: stray '\241' in program
C:/Users/daniel/Documents/R/win-library/3.2/BH/include/boost/type_traits/is_base_of.hpp:16:1: error: stray '\267' in program
C:/Users/daniel/Documents/R/win-library/3.2/BH/include/boost/type_traits/is_base_of.hpp:16:1: error: stray '\324' in program
C:/Users/daniel/Documents/R/win-library/3.2/BH/include/boost/type_traits/is_base_of.hpp:16:1: error: stray '\341' in program
C:/Users/daniel/Documents/R/win-library/3.2/BH/include/boost/type_traits/is_base_of.hpp:16:1: error: stray '\231' in program
C:/Users/daniel/Documents/R/win-library/3.2/BH/include/boost/type_traits/is_base_of.hpp:16:1: error: stray '\361' in program
C:/Users/daniel/Documents/R/win-library/3.2/BH/include/boost/type_traits/is_base_of.hpp:16:1: error: stray '\333' in program
C:/Users/daniel/Documents/R/win-library/3.2/BH/include/boost/type_traits/is_base_of.hpp:16:1: error: stray '\234' in program
C:/Users/daniel/Documents/R/win-library/3.2/BH/include/boost/type_traits/is_base_of.hpp:16:1: error: stray '\373' in program
C:/Users/daniel/Documents/R/win-library/3.2/BH/include/boost/type_traits/is_base_of.hpp:16:1: error: stray '\260' in program
C:/Users/daniel/Documents/R/win-library/3.2/BH/include/boost/type_traits/is_base_of.hpp:16:1: error: stray '\230' in program
C:/Users/daniel/Documents/R/win-library/3.2/BH/include/boost/type_traits/is_base_of.hpp:16:1: error: stray '\376' in program
C:/Users/daniel/Documents/R/win-library/3.2/BH/include/boost/type_traits/is_base_of.hpp:16:1: error: stray '\340' in program
C:/Users/daniel/Documents/R/win-library/3.2/BH/include/boost/type_traits/is_base_of.hpp:16:1: error: stray '\236' in program
C:/Users/daniel/Documents/R/win-library/3.2/BH/include/boost/type_traits/is_base_of.hpp:16:1: error: stray '\215' in program
C:/Users/daniel/Documents/R/win-library/3.2/BH/include/boost/type_traits/is_base_of.hpp:16:1: error: stray '\242' in program
C:/Users/daniel/Documents/R/win-library/3.2/BH/include/boost/type_traits/is_base_of.hpp:16:1: error: stray '\301' in program
C:/Users/daniel/Documents/R/win-library/3.2/BH/include/boost/type_traits/is_base_of.hpp:16:1: error: stray '\316' in program
C:/Users/daniel/Documents/R/win-library/3.2/BH/include/boost/type_traits/is_base_of.hpp:16:1: error: stray '\217' in program
C:/Users/daniel/Documents/R/win-library/3.2/BH/include/boost/type_traits/is_base_of.hpp:16:1: error: stray '\374' in program
C:/Users/daniel/Documents/R/win-library/3.2/BH/include/boost/type_traits/is_base_of.hpp:16:1: error: stray '\243' in program
C:/Users/daniel/Documents/R/win-library/3.2/BH/include/boost/type_traits/is_base_of.hpp:16:1: error: stray '\342' in program
C:/Users/daniel/Documents/R/win-library/3.2/BH/include/boost/type_traits/is_base_of.hpp:16:1: error: stray '\333' in program
C:/Users/daniel/Documents/R/win-library/3.2/BH/include/boost/type_traits/is_base_of.hpp:16:1: error: stray '\327' in program
C:/Users/daniel/Documents/R/win-library/3.2/BH/include/boost/type_traits/is_base_of.hpp:16:1: error: stray '\241' in program
C:/Users/daniel/Documents/R/win-library/3.2/BH/include/boost/type_traits/is_base_of.hpp:16:1: error: stray '\34' in program
C:/Users/daniel/Documents/R/win-library/3.2/BH/include/boost/type_traits/is_base_of.hpp:16:1: error: stray '\340' in program
C:/Users/daniel/Documents/R/win-library/3.2/BH/include/boost/type_traits/is_base_of.hpp:16:205: error: invalid suffix "a9" on integer constant
C:/Users/daniel/Documents/R/win-library/3.2/BH/include/boost/type_traits/is_base_of.hpp:16:1: error: stray '\367' in program
C:/Users/daniel/Documents/R/win-library/3.2/BH/include/boost/type_traits/is_base_of.hpp:16:1: error: stray '\253' in program
C:/Users/daniel/Documents/R/win-library/3.2/BH/include/boost/type_traits/is_base_of.hpp:16:1: error: stray '\206' in program
C:/Users/daniel/Documents/R/win-library/3.2/BH/include/boost/type_traits/is_base_of.hpp:16:1: error: stray '\355' in program
C:/Users/daniel/Documents/R/win-library/3.2/BH/include/boost/type_traits/is_base_of.hpp:16:1: error: stray '\222' in program
C:/Users/daniel/Documents/R/win-library/3.2/BH/include/boost/type_traits/is_base_of.hpp:16:1: error: stray '\332' in program
C:/Users/daniel/Documents/R/win-library/3.2/BH/include/boost/type_traits/is_base_of.hpp:16:1: error: stray '\322' in program
C:/Users/daniel/Documents/R/win-library/3.2/BH/include/boost/type_traits/is_base_of.hpp:16:1: error: stray '\320' in program
C:/Users/daniel/Documents/R/win-library/3.2/BH/include/boost/type_traits/is_base_of.hpp:16:1: error: stray '\20' in program
C:/Users/daniel/Documents/R/win-library/3.2/BH/include/boost/type_traits/is_base_of.hpp:16:1: error: stray '\232' in program
C:/Users/daniel/Documents/R/win-library/3.2/BH/include/boost/type_traits/is_base_of.hpp:16:1: error: stray '\376' in program
C:/Users/daniel/Documents/R/win-library/3.2/BH/include/boost/type_traits/is_base_of.hpp:16:1: error: stray '\32' in program
C:/Users/daniel/Documents/R/win-library/3.2/BH/include/boost/type_traits/is_base_of.hpp:16:1: error: stray '\301' in program
C:/Users/daniel/Documents/R/win-library/3.2/BH/include/boost/type_traits/is_base_of.hpp:16:1: error: stray '\230' in program
C:/Users/daniel/Documents/R/win-library/3.2/BH/include/boost/type_traits/is_base_of.hpp:16:1: error: stray '\311' in program
C:/Users/daniel/Documents/R/win-library/3.2/BH/include/boost/type_traits/is_base_of.hpp:16:1: error: stray '\251' in program
C:/Users/daniel/Documents/R/win-library/3.2/BH/include/boost/type_traits/is_base_of.hpp:16:1: error: stray '\355' in program
C:/Users/daniel/Documents/R/win-library/3.2/BH/include/boost/type_traits/is_base_of.hpp:16:1: error: stray '\353' in program
C:/Users/daniel/Documents/R/win-library/3.2/BH/include/boost/type_traits/is_base_of.hpp:16:1: error: stray '\241' in program
C:/Users/daniel/Documents/R/win-library/3.2/BH/include/boost/type_traits/is_base_of.hpp:16:1: error: stray '\6' in program
C:/Users/daniel/Documents/R/win-library/3.2/BH/include/boost/type_traits/is_base_of.hpp:16:1: error: stray '\34' in program
C:/Users/daniel/Documents/R/win-library/3.2/BH/include/boost/type_traits/is_base_of.hpp:16:1: error: stray '\341' in program
C:/Users/daniel/Documents/R/win-library/3.2/BH/include/boost/type_traits/is_base_of.hpp:16:1: error: stray '\32' in program
C:/Users/daniel/Documents/R/win-library/3.2/BH/include/boost/type_traits/is_base_of.hpp:16:1: error: stray '\32' in program
C:/Users/daniel/Documents/R/win-library/3.2/BH/include/boost/type_traits/is_base_of.hpp:16:1: error: stray '\307' in program
C:/Users/daniel/Documents/R/win-library/3.2/BH/include/boost/type_traits/is_base_of.hpp:16:1: error: stray '\371' in program
C:/Users/daniel/Documents/R/win-library/3.2/BH/include/boost/type_traits/is_base_of.hpp:16:1: error: stray '\340' in program
C:/Users/daniel/Documents/R/win-library/3.2/BH/include/boost/type_traits/is_base_of.hpp:16:1: error: stray '\367' in program
C:/Users/daniel/Documents/R/win-library/3.2/BH/include/boost/type_traits/is_base_of.hpp:16:1: error: stray '@' in program
C:/Users/daniel/Documents/R/win-library/3.2/BH/include/boost/type_traits/is_base_of.hpp:16:1: error: missing terminating " character
C:/Users/daniel/Documents/R/win-library/3.2/BH/include/boost/type_traits/is_base_of.hpp:17:1: error: stray '\1' in program
C:/Users/daniel/Documents/R/win-library/3.2/BH/include/boost/type_traits/is_base_of.hpp:17:1: error: stray '\6' in program
C:/Users/daniel/Documents/R/win-library/3.2/BH/include/boost/type_traits/is_base_of.hpp:17:1: error: stray '\213' in program
C:/Users/daniel/Documents/R/win-library/3.2/BH/include/boost/type_traits/is_base_of.hpp:17:1: error: stray '\373' in program
C:/Users/daniel/Documents/R/win-library/3.2/BH/include/boost/type_traits/is_base_of.hpp:17:1: error: stray '\242' in program
C:/Users/daniel/Documents/R/win-library/3.2/BH/include/boost/type_traits/is_base_of.hpp:17:1: error: stray '\' in program
C:/Users/daniel/Documents/R/win-library/3.2/BH/include/boost/type_traits/is_base_of.hpp:17:1: error: stray '\177' in program
C:/Users/daniel/Documents/R/win-library/3.2/BH/include/boost/type_traits/is_base_of.hpp:17:1: error: stray '\1' in program
C:/Users/daniel/Documents/R/win-library/3.2/BH/include/boost/type_traits/is_base_of.hpp:17:1: error: stray '#' in program
C:/Users/daniel/Documents/R/win-library/3.2/BH/include/boost/type_traits/is_base_of.hpp:17:1: error: stray '\3' in program
C:/Users/daniel/Documents/R/win-library/3.2/BH/include/boost/type_traits/is_base_of.hpp:17:1: error: stray '\314' in program
C:/Users/daniel/Documents/R/win-library/3.2/BH/include/boost/type_traits/is_base_of.hpp:17:1: error: stray '\30' in program
C:/Users/daniel/Documents/R/win-library/3.2/BH/include/boost/type_traits/is_base_of.hpp:17:1: error: stray '\5' in program
C:/Users/daniel/Documents/R/win-library/3.2/BH/include/boost/type_traits/is_base_of.hpp:17:1: error: stray '\217' in program
C:/Users/daniel/Documents/R/win-library/3.2/BH/include/boost/type_traits/is_base_of.hpp:17:1: error: stray '\214' in program
C:/Users/daniel/Documents/R/win-library/3.2/BH/include/boost/type_traits/is_base_of.hpp:17:1: error: stray '\323' in program
C:/Users/daniel/Documents/R/win-library/3.2/BH/include/boost/type_traits/is_base_of.hpp:17:1: error: stray '\5' in program
C:/Users/daniel/Documents/R/win-library/3.2/BH/include/boost/type_traits/is_base_of.hpp:17:1: error: stray '\32' in program
In file included from C:/Users/daniel/Documents/R/win-library/3.2/BH/include/boost/date_time/constrained_value.hpp:17:0,
from C:/Users/daniel/Documents/R/win-library/3.2/BH/include/boost/date_time/gregorian/greg_weekday.hpp:12,
from C:/Users/daniel/Documents/R/win-library/3.2/BH/include/boost/date_time/gregorian/greg_calendar.hpp:13,
from C:/Users/daniel/Documents/R/win-library/3.2/BH/include/boost/date_time/gregorian/gregorian_types.hpp:19,
from C:/Users/daniel/Documents/R/win-library/3.2/BH/include/boost/date_time/posix_time/posix_time_config.hpp:18,
from C:/Users/daniel/Documents/R/win-library/3.2/BH/include/boost/date_time/posix_time/posix_time_system.hpp:13,
from C:/Users/daniel/Documents/R/win-library/3.2/BH/include/boost/date_time/posix_time/ptime.hpp:12,
from C:/Users/daniel/Documents/R/win-library/3.2/BH/include/boost/date_time/posix_time/posix_time_types.hpp:12,
from C:/Users/daniel/Documents/R/win-library/3.2/rstan/include/rstan/stan_fit.hpp:13,
from C:/Users/daniel/Documents/R/win-library/3.2/rstan/include/rstan/rstaninc.hpp:3,
from file230c3e17a18.cpp:444:
C:/Users/daniel/Documents/R/win-library/3.2/BH/include/boost/type_traits/is_base_of.hpp:1:1: error: stray '\321' in program
C:/Users/daniel/Documents/R/win-library/3.2/BH/include/boost/type_traits/is_base_of.hpp:1:1: error: stray '\371' in program
C:/Users/daniel/Documents/R/win-library/3.2/BH/include/boost/type_traits/is_base_of.hpp:1:1: error: stray '\36' in program
C:/Users/daniel/Documents/R/win-library/3.2/BH/include/boost/type_traits/is_base_of.hpp:1:1: error: stray '\273' in program
C:/Users/daniel/Documents/R/win-library/3.2/BH/include/boost/type_traits/is_base_of.hpp:1:1: error: stray '\35' in program
C:/Users/daniel/Documents/R/win-library/3.2/BH/include/boost/type_traits/is_base_of.hpp:1:1: error: stray '`' in program
C:/Users/daniel/Documents/R/win-library/3.2/BH/include/boost/type_traits/is_base_of.hpp:1:1: error: stray '\243' in program
C:/Users/daniel/Documents/R/win-library/3.2/BH/include/boost/type_traits/is_base_of.hpp:1:1: error: stray '\36' in program
C:/Users/daniel/Documents/R/win-library/3.2/BH/include/boost/type_traits/is_base_of.hpp:1:1: error: stray '\346' in program
C:/Users/daniel/Documents/R/win-library/3.2/BH/include/boost/type_traits/is_base_of.hpp:1:1: error: stray '\35' in program
C:/Users/daniel/Documents/R/win-library/3.2/BH/include/boost/type_traits/is_base_of.hpp:1:1: error: stray '\234' in program
C:/Users/daniel/Documents/R/win-library/3.2/BH/include/boost/type_traits/is_base_of.hpp:1:1: error: stray '\37' in program
C:/Users/daniel/Documents/R/win-library/3.2/BH/include/boost/type_traits/is_base_of.hpp:1:1: error: stray '\24' in program
C:/Users/daniel/Documents/R/win-library/3.2/BH/include/boost/type_traits/is_base_of.hpp:1:1: error: stray '\222' in program
C:/Users/daniel/Documents/R/win-library/3.2/BH/include/boost/type_traits/is_base_of.hpp:1:1: error: stray '\360' in program
C:/Users/daniel/Documents/R/win-library/3.2/BH/include/boost/type_traits/is_base_of.hpp:1:1: error: stray '\304' in program
C:/Users/daniel/Documents/R/win-library/3.2/BH/include/boost/type_traits/is_base_of.hpp:1:1: error: stray '\301' in program
C:/Users/daniel/Documents/R/win-library/3.2/BH/include/boost/type_traits/is_base_of.hpp:1:1: error: stray '\317' in program
C:/Users/daniel/Documents/R/win-library/3.2/BH/include/boost/type_traits/is_base_of.hpp:1:1: error: stray '\264' in program
C:/Users/daniel/Documents/R/win-library/3.2/BH/include/boost/type_traits/is_base_of.hpp:1:1: error: stray '\304' in program
C:/Users/daniel/Documents/R/win-library/3.2/BH/include/boost/type_traits/is_base_of.hpp:1:1: error: stray '\200' in program
C:/Users/daniel/Documents/R/win-library/3.2/BH/include/boost/type_traits/is_base_of.hpp:2:1: error: stray '\30' in program
C:/Users/daniel/Documents/R/win-library/3.2/BH/include/boost/type_traits/is_base_of.hpp:2:1: error: stray '\333' in program
C:/Users/daniel/Documents/R/win-library/3.2/BH/include/boost/type_traits/is_base_of.hpp:2:1: error: stray '\355' in program
C:/Users/daniel/Documents/R/win-library/3.2/BH/include/boost/type_traits/is_base_of.hpp:2:1: error: stray '\362' in program
C:/Users/daniel/Documents/R/win-library/3.2/BH/include/boost/type_traits/is_base_of.hpp:2:1: error: stray '\6' in program
C:/Users/daniel/Documents/R/win-library/3.2/BH/include/boost/type_traits/is_base_of.hpp:2:1: error: stray '\236' in program
C:/Users/daniel/Documents/R/win-library/3.2/BH/include/boost/type_traits/is_base_of.hpp:2:1: error: stray '\246' in program
C:/Users/daniel/Documents/R/win-library/3.2/BH/include/boost/type_traits/is_base_of.hpp:2:1: error: stray '@' in program
C:/Users/daniel/Documents/R/win-library/3.2/BH/include/boost/type_traits/is_base_of.hpp:2:1: error: stray '\273' in program
C:/Users/daniel/Documents/R/win-library/3.2/BH/include/boost/type_traits/is_base_of.hpp:2:1: error: stray '\234' in program
C:/Users/daniel/Documents/R/win-library/3.2/BH/include/boost/type_traits/is_base_of.hpp:2:1: error: stray '\34' in program
C:/Users/daniel/Documents/R/win-library/3.2/BH/include/boost/type_traits/is_base_of.hpp:2:1: error: stray '\10' in program
C:/Users/daniel/Documents/R/win-library/3.2/BH/include/boost/type_traits/is_base_of.hpp:2:1: error: stray '\206' in program
C:/Users/daniel/Documents/R/win-library/3.2/BH/include/boost/type_traits/is_base_of.hpp:2:1: error: stray '\272' in program
C:/Users/daniel/Documents/R/win-library/3.2/BH/include/boost/type_traits/is_base_of.hpp:2:1: error: stray '\231' in program
C:/Users/daniel/Documents/R/win-library/3.2/BH/include/boost/type_traits/is_base_of.hpp:2:1: error: stray '\244' in program
C:/Users/daniel/Documents/R/win-library/3.2/BH/include/boost/type_traits/is_base_of.hpp:2:1: error: stray '\213' in program
C:/Users/daniel/Documents/R/win-library/3.2/BH/include/boost/type_traits/is_base_of.hpp:2:1: error: stray '\333' in program
C:/Users/daniel/Documents/R/win-library/3.2/BH/include/boost/type_traits/is_base_of.hpp:2:1: error: stray '\332' in program
C:/Users/daniel/Documents/R/win-library/3.2/BH/include/boost/type_traits/is_base_of.hpp:2:1: error: stray '\257' in program
C:/Users/daniel/Documents/R/win-library/3.2/BH/include/boost/type_traits/is_base_of.hpp:2:1: error: stray '\347' in program
C:/Users/daniel/Documents/R/win-library/3.2/BH/include/boost/type_traits/is_base_of.hpp:2:1: error: stray '\34' in program
C:/Users/daniel/Documents/R/win-library/3.2/BH/include/boost/type_traits/is_base_of.hpp:2:1: error: stray '\203' in program
C:/Users/daniel/Documents/R/win-library/3.2/BH/include/boost/type_traits/is_base_of.hpp:2:1: error: stray '\265' in program
C:/Users/daniel/Documents/R/win-library/3.2/BH/include/boost/type_traits/is_base_of.hpp:2:1: error: stray '\262' in program
C:/Users/daniel/Documents/R/win-library/3.2/BH/include/boost/type_traits/is_base_of.hpp:2:1: error: stray '\314' in program
C:/Users/daniel/Documents/R/win-library/3.2/BH/include/boost/type_traits/is_base_of.hpp:2:1: error: stray '\257' in program
C:/Users/daniel/Documents/R/win-library/3.2/BH/include/boost/type_traits/is_base_of.hpp:2:1: error: stray '\301' in program
C:/Users/daniel/Documents/R/win-library/3.2/BH/include/boost/type_traits/is_base_of.hpp:2:1: error: stray '\371' in program
C:/Users/daniel/Documents/R/win-library/3.2/BH/include/boost/type_traits/is_base_of.hpp:2:1: error: stray '\377' in program
C:/Users/daniel/Documents/R/win-library/3.2/BH/include/boost/type_traits/is_base_of.hpp:2:1: error: stray '\225' in program
C:/Users/daniel/Documents/R/win-library/3.2/BH/include/boost/type_traits/is_base_of.hpp:2:1: error: stray '\350' in program
C:/Users/daniel/Documents/R/win-library/3.2/BH/include/boost/type_traits/is_base_of.hpp:2:1: error: stray '\303' in program
C:/Users/daniel/Documents/R/win-library/3.2/BH/include/boost/type_traits/is_base_of.hpp:2:1: error: stray '\232' in program
C:/Users/daniel/Documents/R/win-library/3.2/BH/include/boost/type_traits/is_base_of.hpp:3:1: error: missing terminating ' character
C:/Users/daniel/Documents/R/win-library/3.2/BH/include/boost/type_traits/is_base_of.hpp:4:1: error: stray '\177' in program
C:/Users/daniel/Documents/R/win-library/3.2/BH/include/boost/type_traits/is_base_of.hpp:4:1: error: stray '\337' in program
C:/Users/daniel/Documents/R/win-library/3.2/BH/include/boost/type_traits/is_base_of.hpp:4:1: error: stray '\317' in program
C:/Users/daniel/Documents/R/win-library/3.2/BH/include/boost/type_traits/is_base_of.hpp:4:1: error: stray '\32' in program
C:/Users/daniel/Documents/R/win-library/3.2/BH/include/boost/type_traits/is_base_of.hpp:4:1: error: stray '\250' in program
C:/Users/daniel/Documents/R/win-library/3.2/BH/include/boost/type_traits/is_base_of.hpp:4:1: error: stray '\351' in program
C:/Users/daniel/Documents/R/win-library/3.2/BH/include/boost/type_traits/is_base_of.hpp:4:1: error: stray '\325' in program
C:/Users/daniel/Documents/R/win-library/3.2/BH/include/boost/type_traits/is_base_of.hpp:4:1: error: stray '\300' in program
C:/Users/daniel/Documents/R/win-library/3.2/BH/include/boost/type_traits/is_base_of.hpp:4:1: error: stray '\300' in program
C:/Users/daniel/Documents/R/win-library/3.2/BH/include/boost/type_traits/is_base_of.hpp:4:1: error: stray '`' in program
C:/Users/daniel/Documents/R/win-library/3.2/BH/include/boost/type_traits/is_base_of.hpp:4:1: error: stray '\10' in program
C:/Users/daniel/Documents/R/win-library/3.2/BH/include/boost/type_traits/is_base_of.hpp:4:1: error: stray '\231' in program
C:/Users/daniel/Documents/R/win-library/3.2/BH/include/boost/type_traits/is_base_of.hpp:4:1: error: stray '\261' in program
C:/Users/daniel/Documents/R/win-library/3.2/BH/include/boost/type_traits/is_base_of.hpp:4:1: error: stray '\214' in program
C:/Users/daniel/Documents/R/win-library/3.2/BH/include/boost/type_traits/is_base_of.hpp:4:1: error: stray '\263' in program
C:/Users/daniel/Documents/R/win-library/3.2/BH/include/boost/type_traits/is_base_of.hpp:4:1: error: stray '\273' in program
C:/Users/daniel/Documents/R/win-library/3.2/BH/include/boost/type_traits/is_base_of.hpp:4:1: error: stray '\237' in program
C:/Users/daniel/Documents/R/win-library/3.2/BH/include/boost/type_traits/is_base_of.hpp:4:1: error: stray '\243' in program
C:/Users/daniel/Documents/R/win-library/3.2/BH/include/boost/type_traits/is_base_of.hpp:4:1: error: stray '\325' in program
C:/Users/daniel/Documents/R/win-library/3.2/BH/include/boost/type_traits/is_base_of.hpp:4:1: error: stray '\353' in program
C:/Users/daniel/Documents/R/win-library/3.2/BH/include/boost/type_traits/is_base_of.hpp:4:1: error: stray '\372' in program
C:/Users/daniel/Documents/R/win-library/3.2/BH/include/boost/type_traits/is_base_of.hpp:4:1: error: stray '\3' in program
C:/Users/daniel/Documents/R/win-library/3.2/BH/include/boost/type_traits/is_base_of.hpp:4:1: error: stray '\276' in program
C:/Users/daniel/Documents/R/win-library/3.2/BH/include/boost/type_traits/is_base_of.hpp:4:1: error: stray '\244' in program
C:/Users/daniel/Documents/R/win-library/3.2/BH/include/boost/type_traits/is_base_of.hpp:4:1: error: stray '\353' in program
C:/Users/daniel/Documents/R/win-library/3.2/BH/include/boost/type_traits/is_base_of.hpp:4:1: error: stray '\304' in program
C:/Users/daniel/Documents/R/win-library/3.2/BH/include/boost/type_traits/is_base_of.hpp:4:1: error: stray '\17' in program
C:/Users/daniel/Documents/R/win-library/3.2/BH/include/boost/type_traits/is_base_of.hpp:4:1: error: stray '\277' in program
C:/Users/daniel/Documents/R/win-library/3.2/BH/include/boost/type_traits/is_base_of.hpp:4:1: error: stray '\370' in program
C:/Users/daniel/Documents/R/win-library/3.2/BH/include/boost/type_traits/is_base_of.hpp:4:1: error: stray '\360' in program
C:/Users/daniel/Documents/R/win-library/3.2/BH/include/boost/type_traits/is_base_of.hpp:4:1: error: stray '\370' in program
C:/Users/daniel/Documents/R/win-library/3.2/BH/include/boost/type_traits/is_base_of.hpp:4:1: error: stray '\362' in program
C:/Users/daniel/Documents/R/win-library/3.2/BH/include/boost/type_traits/is_base_of.hpp:4:1: error: stray '\321' in program
C:/Users/daniel/Documents/R/win-library/3.2/BH/include/boost/type_traits/is_base_of.hpp:4:1: error: stray '\177' in program
C:/Users/daniel/Documents/R/win-library/3.2/BH/include/boost/type_traits/is_base_of.hpp:4:1: error: stray '\3' in program
C:/Users/daniel/Documents/R/win-library/3.2/BH/include/boost/type_traits/is_base_of.hpp:4:1: error: stray '\277' in program
C:/Users/daniel/Documents/R/win-library/3.2/BH/include/boost/type_traits/is_base_of.hpp:4:1: error: stray '\227' in program
C:/Users/daniel/Documents/R/win-library/3.2/BH/include/boost/type_traits/is_base_of.hpp:4:1: error: stray '\247' in program
C:/Users/daniel/Documents/R/win-library/3.2/BH/include/boost/type_traits/is_base_of.hpp:4:1: error: stray '\245' in program
C:/Users/daniel/Documents/R/win-library/3.2/BH/include/boost/type_traits/is_base_of.hpp:4:1: error: stray '\252' in program
C:/Users/daniel/Documents/R/win-library/3.2/BH/include/boost/type_traits/is_base_of.hpp:4:1: error: stray '\330' in program
C:/Users/daniel/Documents/R/win-library/3.2/BH/include/boost/type_traits/is_base_of.hpp:4:1: error: stray '\237' in program
C:/Users/daniel/Documents/R/win-library/3.2/BH/include/boost/type_traits/is_base_of.hpp:4:1: error: stray '\32' in program
C:/Users/daniel/Documents/R/win-library/3.2/BH/include/boost/type_traits/is_base_of.hpp:4:1: error: stray '\224' in program
C:/Users/daniel/Documents/R/win-library/3.2/BH/include/boost/type_traits/is_base_of.hpp:4:1: error: stray '\315' in program
C:/Users/daniel/Documents/R/win-library/3.2/BH/include/boost/type_traits/is_base_of.hpp:4:1: error: stray '\232' in program
C:/Users/daniel/Documents/R/win-library/3.2/BH/include/boost/type_traits/is_base_of.hpp:4:1: error: stray '\234' in program
C:/Users/daniel/Documents/R/win-library/3.2/BH/include/boost/type_traits/is_base_of.hpp:4:1: error: stray '\202' in program
C:/Users/daniel/Documents/R/win-library/3.2/BH/include/boost/type_traits/is_base_of.hpp:4:1: error: stray '\340' in program
C:/Users/daniel/Documents/R/win-library/3.2/BH/include/boost/type_traits/is_base_of.hpp:4:1: error: stray '\212' in program
C:/Users/daniel/Documents/R/win-library/3.2/BH/include/boost/type_traits/is_base_of.hpp:4:1: error: stray '\267' in program
C:/Users/daniel/Documents/R/win-library/3.2/BH/include/boost/type_traits/is_base_of.hpp:4:1: error: stray '\35' in program
C:/Users/daniel/Documents/R/win-library/3.2/BH/include/boost/type_traits/is_base_of.hpp:4:1: error: stray '\351' in program
C:/Users/daniel/Documents/R/win-library/3.2/BH/include/boost/type_traits/is_base_of.hpp:4:1: error: stray '\276' in program
C:/Users/daniel/Documents/R/win-library/3.2/BH/include/boost/type_traits/is_base_of.hpp:4:1: error: stray '\340' in program
C:/Users/daniel/Documents/R/win-library/3.2/BH/include/boost/type_traits/is_base_of.hpp:4:1: error: stray '\2' in program
C:/Users/daniel/Documents/R/win-library/3.2/BH/include/boost/type_traits/is_base_of.hpp:4:1: error: stray '\200' in program
C:/Users/daniel/Documents/R/win-library/3.2/BH/include/boost/type_traits/is_base_of.hpp:4:1: error: stray '\263' in program
C:/Users/daniel/Documents/R/win-library/3.2/BH/include/boost/type_traits/is_base_of.hpp:4:1: error: stray '\256' in program
C:/Users/daniel/Documents/R/win-library/3.2/BH/include/boost/type_traits/is_base_of.hpp:4:1: error: stray '\342' in program
C:/Users/daniel/Documents/R/win-library/3.2/BH/include/boost/type_traits/is_base_of.hpp:4:1: error: stray '\313' in program
C:/Users/daniel/Documents/R/win-library/3.2/BH/include/boost/type_traits/is_base_of.hpp:4:1: error: missing terminating " character
C:/Users/daniel/Documents/R/win-library/3.2/BH/include/boost/type_traits/is_base_of.hpp:5:1: error: stray '\245' in program
C:/Users/daniel/Documents/R/win-library/3.2/BH/include/boost/type_traits/is_base_of.hpp:5:1: error: stray '\250' in program
C:/Users/daniel/Documents/R/win-library/3.2/BH/include/boost/type_traits/is_base_of.hpp:5:1: error: stray '\237' in program
C:/Users/daniel/Documents/R/win-library/3.2/BH/include/boost/type_traits/is_base_of.hpp:5:1: error: stray '\331' in program
C:/Users/daniel/Documents/R/win-library/3.2/BH/include/boost/type_traits/is_base_of.hpp:5:1: error: stray '\354' in program
C:/Users/daniel/Documents/R/win-library/3.2/BH/include/boost/type_traits/is_base_of.hpp:5:1: error: stray '\245' in program
C:/Users/daniel/Documents/R/win-library/3.2/BH/include/boost/type_traits/is_base_of.hpp:5:1: error: stray '\365' in program
C:/Users/daniel/Documents/R/win-library/3.2/BH/include/boost/type_traits/is_base_of.hpp:5:1: error: stray '\333' in program
C:/Users/daniel/Documents/R/win-library/3.2/BH/include/boost/type_traits/is_base_of.hpp:5:1: error: stray '\342' in program
C:/Users/daniel/Documents/R/win-library/3.2/BH/include/boost/type_traits/is_base_of.hpp:5:1: error: stray '\314' in program
C:/Users/daniel/Documents/R/win-library/3.2/BH/include/boost/type_traits/is_base_of.hpp:5:1: error: stray '\21' in program
C:/Users/daniel/Documents/R/win-library/3.2/BH/include/boost/type_traits/is_base_of.hpp:5:1: error: stray '\245' in program
C:/Users/daniel/Documents/R/win-library/3.2/BH/include/boost/type_traits/is_base_of.hpp:5:1: error: stray '\202' in program
C:/Users/daniel/Documents/R/win-library/3.2/BH/include/boost/type_traits/is_base_of.hpp:5:1: error: stray '\273' in program
C:/Users/daniel/Documents/R/win-library/3.2/BH/include/boost/type_traits/is_base_of.hpp:5:1: error: stray '\1' in program
C:/Users/daniel/Documents/R/win-library/3.2/BH/include/boost/type_traits/is_base_of.hpp:5:1: error: stray '\262' in program
C:/Users/daniel/Documents/R/win-library/3.2/BH/include/boost/type_traits/is_base_of.hpp:5:1: error: stray '\240' in program
C:/Users/daniel/Documents/R/win-library/3.2/BH/include/boost/type_traits/is_base_of.hpp:5:1: error: stray '\215' in program
C:/Users/daniel/Documents/R/win-library/3.2/BH/include/boost/type_traits/is_base_of.hpp:5:1: error: stray '`' in program
C:/Users/daniel/Documents/R/win-library/3.2/BH/include/boost/type_traits/is_base_of.hpp:5:1: error: stray '\367' in program
C:/Users/daniel/Documents/R/win-library/3.2/BH/include/boost/type_traits/is_base_of.hpp:5:1: error: stray '\17' in program
C:/Users/daniel/Documents/R/win-library/3.2/BH/include/boost/type_traits/is_base_of.hpp:5:1: error: stray '\255' in program
C:/Users/daniel/Documents/R/win-library/3.2/BH/include/boost/type_traits/is_base_of.hpp:5:1: error: stray '\36' in program
C:/Users/daniel/Documents/R/win-library/3.2/BH/include/boost/type_traits/is_base_of.hpp:5:1: error: stray '\317' in program
C:/Users/daniel/Documents/R/win-library/3.2/BH/include/boost/type_traits/is_base_of.hpp:6:1: error: stray '\375' in program
C:/Users/daniel/Documents/R/win-library/3.2/BH/include/boost/type_traits/is_base_of.hpp:6:1: error: stray '\304' in program
C:/Users/daniel/Documents/R/win-library/3.2/BH/include/boost/type_traits/is_base_of.hpp:6:1: error: stray '\241' in program
C:/Users/daniel/Documents/R/win-library/3.2/BH/include/boost/type_traits/is_base_of.hpp:6:1: error: stray '\216' in program
C:/Users/daniel/Documents/R/win-library/3.2/BH/include/boost/type_traits/is_base_of.hpp:6:1: error: stray '\337' in program
C:/Users/daniel/Documents/R/win-library/3.2/BH/include/boost/type_traits/is_base_of.hpp:6:1: error: stray '\363' in program
C:/Users/daniel/Documents/R/win-library/3.2/BH/include/boost/type_traits/is_base_of.hpp:6:1: error: stray '\34' in program
C:/Users/daniel/Documents/R/win-library/3.2/BH/include/boost/type_traits/is_base_of.hpp:6:1: error: stray '\360' in program
C:/Users/daniel/Documents/R/win-library/3.2/BH/include/boost/type_traits/is_base_of.hpp:6:1: error: stray '\35' in program
C:/Users/daniel/Documents/R/win-library/3.2/BH/include/boost/type_traits/is_base_of.hpp:6:1: error: stray '\342' in program
C:/Users/daniel/Documents/R/win-library/3.2/BH/include/boost/type_traits/is_base_of.hpp:6:1: error: stray '\315' in program
C:/Users/daniel/Documents/R/win-library/3.2/BH/include/boost/type_traits/is_base_of.hpp:6:1: error: stray '\226' in program
C:/Users/daniel/Documents/R/win-library/3.2/BH/include/boost/type_traits/is_base_of.hpp:6:1: error: stray '\341' in program
C:/Users/daniel/Documents/R/win-library/3.2/BH/include/boost/type_traits/is_base_of.hpp:6:1: error: stray '\1' in program
C:/Users/daniel/Documents/R/win-library/3.2/BH/include/boost/type_traits/is_base_of.hpp:6:1: error: stray '\334' in program
C:/Users/daniel/Documents/R/win-library/3.2/BH/include/boost/type_traits/is_base_of.hpp:6:1: error: stray '\277' in program
C:/Users/daniel/Documents/R/win-library/3.2/BH/include/boost/type_traits/is_base_of.hpp:6:1: error: stray '\344' in program
C:/Users/daniel/Documents/R/win-library/3.2/BH/include/boost/type_traits/is_base_of.hpp:6:1: error: stray '\343' in program
C:/Users/daniel/Documents/R/win-library/3.2/BH/include/boost/type_traits/is_base_of.hpp:6:1: error: stray '\224' in program
C:/Users/daniel/Documents/R/win-library/3.2/BH/include/boost/type_traits/is_base_of.hpp:6:1: error: stray '\340' in program
C:/Users/daniel/Documents/R/win-library/3.2/BH/include/boost/type_traits/is_base_of.hpp:6:1: error: stray '\253' in program
C:/Users/daniel/Documents/R/win-library/3.2/BH/include/boost/type_traits/is_base_of.hpp:6:1: error: stray '\274' in program
C:/Users/daniel/Documents/R/win-library/3.2/BH/include/boost/type_traits/is_base_of.hpp:6:1: error: stray '\26' in program
C:/Users/daniel/Documents/R/win-library/3.2/BH/include/boost/type_traits/is_base_of.hpp:6:1: error: stray '\225' in program
C:/Users/daniel/Documents/R/win-library/3.2/BH/include/boost/type_traits/is_base_of.hpp:6:1: error: stray '\254' in program
C:/Users/daniel/Documents/R/win-library/3.2/BH/include/boost/type_traits/is_base_of.hpp:6:1: error: stray '\221' in program
C:/Users/daniel/Documents/R/win-library/3.2/BH/include/boost/type_traits/is_base_of.hpp:6:1: error: stray '\266' in program
C:/Users/daniel/Documents/R/win-library/3.2/BH/include/boost/type_traits/is_base_of.hpp:6:1: error: stray '\363' in program
C:/Users/daniel/Documents/R/win-library/3.2/BH/include/boost/type_traits/is_base_of.hpp:6:1: error: stray '\273' in program
C:/Users/daniel/Documents/R/win-library/3.2/BH/include/boost/type_traits/is_base_of.hpp:6:1: error: stray '\211' in program
C:/Users/daniel/Documents/R/win-library/3.2/BH/include/boost/type_traits/is_base_of.hpp:6:1: error: stray '\326' in program
C:/Users/daniel/Documents/R/win-library/3.2/BH/include/boost/type_traits/is_base_of.hpp:6:1: error: stray '\355' in program
C:/Users/daniel/Documents/R/win-library/3.2/BH/include/boost/type_traits/is_base_of.hpp:6:1: error: stray '\264' in program
C:/Users/daniel/Documents/R/win-library/3.2/BH/include/boost/type_traits/is_base_of.hpp:6:1: error: stray '\261' in program
C:/Users/daniel/Documents/R/win-library/3.2/BH/include/boost/type_traits/is_base_of.hpp:6:1: error: stray '#' in program
C:/Users/daniel/Documents/R/win-library/3.2/BH/include/boost/type_traits/is_base_of.hpp:6:1: error: stray '\277' in program
C:/Users/daniel/Documents/R/win-library/3.2/BH/include/boost/type_traits/is_base_of.hpp:6:1: error: stray '\325' in program
C:/Users/daniel/Documents/R/win-library/3.2/BH/include/boost/type_traits/is_base_of.hpp:6:1: error: stray '\343' in program
C:/Users/daniel/Documents/R/win-library/3.2/BH/include/boost/type_traits/is_base_of.hpp:6:1: error: stray '\35' in program
C:/Users/daniel/Documents/R/win-library/3.2/BH/include/boost/type_traits/is_base_of.hpp:6:1: error: stray '\235' in program
C:/Users/daniel/Documents/R/win-library/3.2/BH/include/boost/type_traits/is_base_of.hpp:6:1: error: stray '\357' in program
C:/Users/daniel/Documents/R/win-library/3.2/BH/include/boost/type_traits/is_base_of.hpp:6:1: error: stray '\317' in program
C:/Users/daniel/Documents/R/win-library/3.2/BH/include/boost/type_traits/is_base_of.hpp:6:1: error: stray '\20' in program
C:/Users/daniel/Documents/R/win-library/3.2/BH/include/boost/type_traits/is_base_of.hpp:6:1: error: stray '\217' in program
C:/Users/daniel/Documents/R/win-library/3.2/BH/include/boost/type_traits/is_base_of.hpp:6:1: error: missing terminating " character
In file included from C:/Users/daniel/Documents/R/win-library/3.2/BH/include/boost/date_time/constrained_value.hpp:17:0,
from C:/Users/daniel/Documents/R/win-library/3.2/BH/include/boost/date_time/gregorian/greg_weekday.hpp:12,
from C:/Users/daniel/Documents/R/win-library/3.2/BH/include/boost/date_time/gregorian/greg_calendar.hpp:13,
from C:/Users/daniel/Documents/R/win-library/3.2/BH/include/boost/date_time/gregorian/gregorian_types.hpp:19,
from C:/Users/daniel/Documents/R/win-library/3.2/BH/include/boost/date_time/posix_time/posix_time_config.hpp:18,
from C:/Users/daniel/Documents/R/win-library/3.2/BH/include/boost/date_time/posix_time/posix_time_system.hpp:13,
from C:/Users/daniel/Documents/R/win-library/3.2/BH/include/boost/date_time/posix_time/ptime.hpp:12,
from C:/Users/daniel/Documents/R/win-library/3.2/BH/include/boost/date_time/posix_time/posix_time_types.hpp:12,
from C:/Users/daniel/Documents/R/win-library/3.2/rstan/include/rstan/stan_fit.hpp:13,
from C:/Users/daniel/Documents/R/win-library/3.2/rstan/include/rstan/rstaninc.hpp:3,
from file230c3e17a18.cpp:444:
C:/Users/daniel/Documents/R/win-library/3.2/BH/include/boost/type_traits/is_base_of.hpp:7:1: error: stray '\220' in program
C:/Users/daniel/Documents/R/win-library/3.2/BH/include/boost/type_traits/is_base_of.hpp:7:1: error: stray '\16' in program
C:/Users/daniel/Documents/R/win-library/3.2/BH/include/boost/type_traits/is_base_of.hpp:7:1: error: stray '\262' in program
C:/Users/daniel/Documents/R/win-library/3.2/BH/include/boost/type_traits/is_base_of.hpp:7:1: error: stray '\324' in program
C:/Users/daniel/Documents/R/win-library/3.2/BH/include/boost/type_traits/is_base_of.hpp:7:1: error: stray '\254' in program
C:/Users/daniel/Documents/R/win-library/3.2/BH/include/boost/type_traits/is_base_of.hpp:7:1: error: stray '\275' in program
C:/Users/daniel/Documents/R/win-library/3.2/BH/include/boost/type_traits/is_base_of.hpp:7:1: error: stray '\275' in program
C:/Users/daniel/Documents/R/win-library/3.2/BH/include/boost/type_traits/is_base_of.hpp:7:1: error: stray '\345' in program
C:/Users/daniel/Documents/R/win-library/3.2/BH/include/boost/type_traits/is_base_of.hpp:7:1: error: stray '\267' in program
C:/Users/daniel/Documents/R/win-library/3.2/BH/include/boost/type_traits/is_base_of.hpp:7:1: error: stray '\233' in program
C:/Users/daniel/Documents/R/win-library/3.2/BH/include/boost/type_traits/is_base_of.hpp:7:1: error: stray '\224' in program
C:/Users/daniel/Documents/R/win-library/3.2/BH/include/boost/type_traits/is_base_of.hpp:7:1: error: stray '\220' in program
C:/Users/daniel/Documents/R/win-library/3.2/BH/include/boost/type_traits/is_base_of.hpp:7:1: error: stray '\314' in program
C:/Users/daniel/Documents/R/win-library/3.2/BH/include/boost/type_traits/is_base_of.hpp:7:1: error: stray '\323' in program
C:/Users/daniel/Documents/R/win-library/3.2/BH/include/boost/type_traits/is_base_of.hpp:7:1: error: stray '\350' in program
C:/Users/daniel/Documents/R/win-library/3.2/BH/include/boost/type_traits/is_base_of.hpp:7:1: error: stray '\360' in program
C:/Users/daniel/Documents/R/win-library/3.2/BH/include/boost/type_traits/is_base_of.hpp:7:1: error: stray '\24' in program
C:/Users/daniel/Documents/R/win-library/3.2/BH/include/boost/type_traits/is_base_of.hpp:7:1: error: stray '\333' in program
C:/Users/daniel/Documents/R/win-library/3.2/BH/include/boost/type_traits/is_base_of.hpp:7:1: error: stray '\245' in program
C:/Users/daniel/Documents/R/win-library/3.2/BH/include/boost/type_traits/is_base_of.hpp:7:1: error: stray '\235' in program
C:/Users/daniel/Documents/R/win-library/3.2/BH/include/boost/type_traits/is_base_of.hpp:7:1: error: stray '\367' in program
C:/Users/daniel/Documents/R/win-library/3.2/BH/include/boost/type_traits/is_base_of.hpp:7:1: error: stray '\177' in program
C:/Users/daniel/Documents/R/win-library/3.2/BH/include/boost/type_traits/is_base_of.hpp:7:1: error: stray '@' in program
C:/Users/daniel/Documents/R/win-library/3.2/BH/include/boost/type_traits/is_base_of.hpp:7:1: error: stray '\203' in program
C:/Users/daniel/Documents/R/win-library/3.2/BH/include/boost/type_traits/is_base_of.hpp:7:1: error: stray '\303' in program
C:/Users/daniel/Documents/R/win-library/3.2/BH/include/boost/type_traits/is_base_of.hpp:7:1: error: stray '`' in program
C:/Users/daniel/Documents/R/win-library/3.2/BH/include/boost/type_traits/is_base_of.hpp:7:1: error: stray '\252' in program
C:/Users/daniel/Documents/R/win-library/3.2/BH/include/boost/type_traits/is_base_of.hpp:7:1: error: stray '\7' in program
C:/Users/daniel/Documents/R/win-library/3.2/BH/include/boost/type_traits/is_base_of.hpp:7:1: error: stray '\21' in program
C:/Users/daniel/Documents/R/win-library/3.2/BH/include/boost/type_traits/is_base_of.hpp:7:1: error: stray '\36' in program
C:/Users/daniel/Documents/R/win-library/3.2/BH/include/boost/type_traits/is_base_of.hpp:7:1: error: stray '\26' in program
C:/Users/daniel/Documents/R/win-library/3.2/BH/include/boost/type_traits/is_base_of.hpp:7:1: error: stray '\374' in program
C:/Users/daniel/Documents/R/win-library/3.2/BH/include/boost/type_traits/is_base_of.hpp:7:1: error: missing terminating ' character
C:/Users/daniel/Documents/R/win-library/3.2/BH/include/boost/type_traits/is_base_of.hpp:8:1: error: stray '\323' in program
C:/Users/daniel/Documents/R/win-library/3.2/BH/include/boost/type_traits/is_base_of.hpp:8:1: error: stray '\250' in program
C:/Users/daniel/Documents/R/win-library/3.2/BH/include/boost/type_traits/is_base_of.hpp:8:1: error: stray '\6' in program
C:/Users/daniel/Documents/R/win-library/3.2/BH/include/boost/type_traits/is_base_of.hpp:8:1: error: missing terminating " character
C:/Users/daniel/Documents/R/win-library/3.2/BH/include/boost/type_traits/is_base_of.hpp:9:1: error: stray '\227' in program
C:/Users/daniel/Documents/R/win-library/3.2/BH/include/boost/type_traits/is_base_of.hpp:9:1: error: stray '\351' in program
C:/Users/daniel/Documents/R/win-library/3.2/BH/include/boost/type_traits/is_base_of.hpp:9:1: error: stray '#' in program
C:/Users/daniel/Documents/R/win-library/3.2/BH/include/boost/type_traits/is_base_of.hpp:9:1: error: stray '\363' in program
C:/Users/daniel/Documents/R/win-library/3.2/BH/include/boost/type_traits/is_base_of.hpp:9:1: error: stray '#' in program
C:/Users/daniel/Documents/R/win-library/3.2/BH/include/boost/type_traits/is_base_of.hpp:9:1: error: stray '\257' in program
C:/Users/daniel/Documents/R/win-library/3.2/BH/include/boost/type_traits/is_base_of.hpp:9:1: error: stray '\376' in program
C:/Users/daniel/Documents/R/win-library/3.2/BH/include/boost/type_traits/is_base_of.hpp:9:1: error: stray '\337' in program
C:/Users/daniel/Documents/R/win-library/3.2/BH/include/boost/type_traits/is_base_of.hpp:9:1: error: stray '\350' in program
C:/Users/daniel/Documents/R/win-library/3.2/BH/include/boost/type_traits/is_base_of.hpp:9:1: error: stray '\25' in program
C:/Users/daniel/Documents/R/win-library/3.2/BH/include/boost/type_traits/is_base_of.hpp:9:1: error: stray '\210' in program
C:/Users/daniel/Documents/R/win-library/3.2/BH/include/boost/type_traits/is_base_of.hpp:9:1: error: stray '\177' in program
C:/Users/daniel/Documents/R/win-library/3.2/BH/include/boost/type_traits/is_base_of.hpp:9:1: error: stray '\311' in program
C:/Users/daniel/Documents/R/win-library/3.2/BH/include/boost/type_traits/is_base_of.hpp:9:1: error: stray '\374' in program
C:/Users/daniel/Documents/R/win-library/3.2/BH/include/boost/type_traits/is_base_of.hpp:9:1: error: stray '\264' in program
C:/Users/daniel/Documents/R/win-library/3.2/BH/include/boost/type_traits/is_base_of.hpp:9:1: error: stray '\20' in program
C:/Users/daniel/Documents/R/win-library/3.2/BH/include/boost/type_traits/is_base_of.hpp:9:1: error: stray '\327' in program
C:/Users/daniel/Documents/R/win-library/3.2/BH/include/boost/type_traits/is_base_of.hpp:9:1: error: stray '\351' in program
C:/Users/daniel/Documents/R/win-library/3.2/BH/include/boost/type_traits/is_base_of.hpp:9:1: error: stray '\27' in program
C:/Users/daniel/Documents/R/win-library/3.2/BH/include/boost/type_traits/is_base_of.hpp:9:1: error: stray '\204' in program
C:/Users/daniel/Documents/R/win-library/3.2/BH/include/boost/type_traits/is_base_of.hpp:9:1: error: stray '\32' in program
C:/Users/daniel/Documents/R/win-library/3.2/BH/include/boost/type_traits/is_base_of.hpp:9:1: error: stray '\232' in program
C:/Users/daniel/Documents/R/win-library/3.2/BH/include/boost/type_traits/is_base_of.hpp:10:2: error: stray '\344' in program
C:/Users/daniel/Documents/R/win-library/3.2/BH/include/boost/type_traits/is_base_of.hpp:10:2: error: stray '\240' in program
C:/Users/daniel/Documents/R/win-library/3.2/BH/include/boost/type_traits/is_base_of.hpp:10:2: error: stray '\225' in program
C:/Users/daniel/Documents/R/win-library/3.2/BH/include/boost/type_traits/is_base_of.hpp:10:2: error: stray '\266' in program
C:/Users/daniel/Documents/R/win-library/3.2/BH/include/boost/type_traits/is_base_of.hpp:10:2: error: stray '\355' in program
C:/Users/daniel/Documents/R/win-library/3.2/BH/include/boost/type_traits/is_base_of.hpp:10:2: error: stray '\343' in program
C:/Users/daniel/Documents/R/win-library/3.2/BH/include/boost/type_traits/is_base_of.hpp:10:2: error: stray '\1' in program
C:/Users/daniel/Documents/R/win-library/3.2/BH/include/boost/type_traits/is_base_of.hpp:10:2: error: stray '\307' in program
C:/Users/daniel/Documents/R/win-library/3.2/BH/include/boost/type_traits/is_base_of.hpp:10:2: error: stray '\217' in program
C:/Users/daniel/Documents/R/win-library/3.2/BH/include/boost/type_traits/is_base_of.hpp:10:2: error: stray '\371' in program
C:/Users/daniel/Documents/R/win-library/3.2/BH/include/boost/type_traits/is_base_of.hpp:10:2: error: stray '\355' in program
C:/Users/daniel/Documents/R/win-library/3.2/BH/include/boost/type_traits/is_base_of.hpp:10:2: error: stray '\307' in program
C:/Users/daniel/Documents/R/win-library/3.2/BH/include/boost/type_traits/is_base_of.hpp:10:2: error: stray '\247' in program
C:/Users/daniel/Documents/R/win-library/3.2/BH/include/boost/type_traits/is_base_of.hpp:10:2: error: stray '\317' in program
C:/Users/daniel/Documents/R/win-library/3.2/BH/include/boost/type_traits/is_base_of.hpp:10:2: error: stray '\376' in program
C:/Users/daniel/Documents/R/win-library/3.2/BH/include/boost/type_traits/is_base_of.hpp:10:2: error: stray '\316' in program
C:/Users/daniel/Documents/R/win-library/3.2/BH/include/boost/type_traits/is_base_of.hpp:10:2: error: stray '\330' in program
C:/Users/daniel/Documents/R/win-library/3.2/BH/include/boost/type_traits/is_base_of.hpp:10:2: error: stray '\25' in program
C:/Users/daniel/Documents/R/win-library/3.2/BH/include/boost/type_traits/is_base_of.hpp:10:2: error: stray '\267' in program
C:/Users/daniel/Documents/R/win-library/3.2/BH/include/boost/type_traits/is_base_of.hpp:10:2: error: stray '\337' in program
C:/Users/daniel/Documents/R/win-library/3.2/BH/include/boost/type_traits/is_base_of.hpp:10:2: error: stray '\376' in program
C:/Users/daniel/Documents/R/win-library/3.2/BH/include/boost/type_traits/is_base_of.hpp:10:2: error: stray '\33' in program
C:/Users/daniel/Documents/R/win-library/3.2/BH/include/boost/type_traits/is_base_of.hpp:10:2: error: stray '\266' in program
C:/Users/daniel/Documents/R/win-library/3.2/BH/include/boost/type_traits/is_base_of.hpp:10:2: error: stray '\254' in program
C:/Users/daniel/Documents/R/win-library/3.2/BH/include/boost/type_traits/is_base_of.hpp:10:2: error: stray '\333' in program
C:/Users/daniel/Documents/R/win-library/3.2/BH/include/boost/type_traits/is_base_of.hpp:10:2: error: stray '\227' in program
C:/Users/daniel/Documents/R/win-library/3.2/BH/include/boost/type_traits/is_base_of.hpp:10:2: error: stray '\224' in program
C:/Users/daniel/Documents/R/win-library/3.2/BH/include/boost/type_traits/is_base_of.hpp:10:2: error: stray '\372' in program
C:/Users/daniel/Documents/R/win-library/3.2/BH/include/boost/type_traits/is_base_of.hpp:10:2: error: stray '\266' in program
C:/Users/daniel/Documents/R/win-library/3.2/BH/include/boost/type_traits/is_base_of.hpp:10:2: error: stray '\333' in program
C:/Users/daniel/Documents/R/win-library/3.2/BH/include/boost/type_traits/is_base_of.hpp:10:2: error: stray '\373' in program
C:/Users/daniel/Documents/R/win-library/3.2/BH/include/boost/type_traits/is_base_of.hpp:10:2: error: stray '\' in program
C:/Users/daniel/Documents/R/win-library/3.2/BH/include/boost/type_traits/is_base_of.hpp:10:2: error: stray '\220' in program
C:/Users/daniel/Documents/R/win-library/3.2/BH/include/boost/type_traits/is_base_of.hpp:10:2: error: stray '\332' in program
C:/Users/daniel/Documents/R/win-library/3.2/BH/include/boost/type_traits/is_base_of.hpp:10:2: error: stray '\232' in program
C:/Users/daniel/Documents/R/win-library/3.2/BH/include/boost/type_traits/is_base_of.hpp:10:2: error: stray '\' in program
C:/Users/daniel/Documents/R/win-library/3.2/BH/include/boost/type_traits/is_base_of.hpp:10:2: error: stray '\217' in program
C:/Users/daniel/Documents/R/win-library/3.2/BH/include/boost/type_traits/is_base_of.hpp:10:2: error: stray '\262' in program
C:/Users/daniel/Documents/R/win-library/3.2/BH/include/boost/type_traits/is_base_of.hpp:10:2: error: stray '\217' in program
C:/Users/daniel/Documents/R/win-library/3.2/BH/include/boost/type_traits/is_base_of.hpp:10:2: error: stray '\33' in program
C:/Users/daniel/Documents/R/win-library/3.2/BH/include/boost/type_traits/is_base_of.hpp:10:2: error: stray '\211' in program
C:/Users/daniel/Documents/R/win-library/3.2/BH/include/boost/type_traits/is_base_of.hpp:10:2: error: stray '\362' in program
C:/Users/daniel/Documents/R/win-library/3.2/BH/include/boost/type_traits/is_base_of.hpp:10:2: error: stray '\246' in program
C:/Users/daniel/Documents/R/win-library/3.2/BH/include/boost/type_traits/is_base_of.hpp:11:1: error: stray '\374' in program
C:/Users/daniel/Documents/R/win-library/3.2/BH/include/boost/type_traits/is_base_of.hpp:11:1: error: stray '\230' in program
C:/Users/daniel/Documents/R/win-library/3.2/BH/include/boost/type_traits/is_base_of.hpp:11:1: error: stray '\317' in program
C:/Users/daniel/Documents/R/win-library/3.2/BH/include/boost/type_traits/is_base_of.hpp:11:1: error: stray '\225' in program
C:/Users/daniel/Documents/R/win-library/3.2/BH/include/boost/type_traits/is_base_of.hpp:11:1: error: stray '\362' in program
C:/Users/daniel/Documents/R/win-library/3.2/BH/include/boost/type_traits/is_base_of.hpp:11:1: error: stray '\251' in program
C:/Users/daniel/Documents/R/win-library/3.2/BH/include/boost/type_traits/is_base_of.hpp:11:1: error: stray '\330' in program
C:/Users/daniel/Documents/R/win-library/3.2/BH/include/boost/type_traits/is_base_of.hpp:11:1: error: stray '\333' in program
C:/Users/daniel/Documents/R/win-library/3.2/BH/include/boost/type_traits/is_base_of.hpp:11:1: error: stray '\225' in program
C:/Users/daniel/Documents/R/win-library/3.2/BH/include/boost/type_traits/is_base_of.hpp:11:1: error: stray '\6' in program
C:/Users/daniel/Documents/R/win-library/3.2/BH/include/boost/type_traits/is_base_of.hpp:11:1: error: stray '\201' in program
C:/Users/daniel/Documents/R/win-library/3.2/BH/include/boost/type_traits/is_base_of.hpp:11:1: error: stray '\336' in program
C:/Users/daniel/Documents/R/win-library/3.2/BH/include/boost/type_traits/is_base_of.hpp:11:1: error: stray '#' in program
C:/Users/daniel/Documents/R/win-library/3.2/BH/include/boost/type_traits/is_base_of.hpp:11:1: error: stray '\216' in program
C:/Users/daniel/Documents/R/win-library/3.2/BH/include/boost/type_traits/is_base_of.hpp:11:1: error: stray '\270' in program
C:/Users/daniel/Documents/R/win-library/3.2/BH/include/boost/type_traits/is_base_of.hpp:11:1: error: stray '\242' in program
C:/Users/daniel/Documents/R/win-library/3.2/BH/include/boost/type_traits/is_base_of.hpp:11:1: error: stray '\215' in program
C:/Users/daniel/Documents/R/win-library/3.2/BH/include/boost/type_traits/is_base_of.hpp:11:1: error: stray '\2' in program
C:/Users/daniel/Documents/R/win-library/3.2/BH/include/boost/type_traits/is_base_of.hpp:11:1: error: stray '\312' in program
C:/Users/daniel/Documents/R/win-library/3.2/BH/include/boost/type_traits/is_base_of.hpp:11:1: error: stray '\305' in program
C:/Users/daniel/Documents/R/win-library/3.2/BH/include/boost/type_traits/is_base_of.hpp:11:1: error: stray '\7' in program
C:/Users/daniel/Documents/R/win-library/3.2/BH/include/boost/type_traits/is_base_of.hpp:11:1: error: stray '\270' in program
C:/Users/daniel/Documents/R/win-library/3.2/BH/include/boost/type_traits/is_base_of.hpp:11:1: error: stray '@' in program
C:/Users/daniel/Documents/R/win-library/3.2/BH/include/boost/type_traits/is_base_of.hpp:11:1: error: stray '\211' in program
C:/Users/daniel/Documents/R/win-library/3.2/BH/include/boost/type_traits/is_base_of.hpp:11:1: error: stray '\323' in program
C:/Users/daniel/Documents/R/win-library/3.2/BH/include/boost/type_traits/is_base_of.hpp:11:1: error: stray '\16' in program
C:/Users/daniel/Documents/R/win-library/3.2/BH/include/boost/type_traits/is_base_of.hpp:11:1: error: missing terminating " character
C:/Users/daniel/Documents/R/win-library/3.2/BH/include/boost/type_traits/is_base_of.hpp:12:1: error: stray '\33' in program
C:/Users/daniel/Documents/R/win-library/3.2/BH/include/boost/type_traits/is_base_of.hpp:12:1: error: stray '\340' in program
C:/Users/daniel/Documents/R/win-library/3.2/BH/include/boost/type_traits/is_base_of.hpp:12:1: error: stray '\215' in program
C:/Users/daniel/Documents/R/win-library/3.2/BH/include/boost/type_traits/is_base_of.hpp:12:1: error: stray '\6' in program
C:/Users/daniel/Documents/R/win-library/3.2/BH/include/boost/type_traits/is_base_of.hpp:12:1: error: stray '\210' in program
C:/Users/daniel/Documents/R/win-library/3.2/BH/include/boost/type_traits/is_base_of.hpp:12:1: error: stray '\224' in program
C:/Users/daniel/Documents/R/win-library/3.2/BH/include/boost/type_traits/is_base_of.hpp:12:1: error: stray '\344' in program
C:/Users/daniel/Documents/R/win-library/3.2/BH/include/boost/type_traits/is_base_of.hpp:12:1: error: stray '\361' in program
C:/Users/daniel/Documents/R/win-library/3.2/BH/include/boost/type_traits/is_base_of.hpp:12:1: error: stray '\313' in program
C:/Users/daniel/Documents/R/win-library/3.2/BH/include/boost/type_traits/is_base_of.hpp:12:1: error: stray '\310' in program
C:/Users/daniel/Documents/R/win-library/3.2/BH/include/boost/type_traits/is_base_of.hpp:12:1: error: stray '\2' in program
C:/Users/daniel/Documents/R/win-library/3.2/BH/include/boost/type_traits/is_base_of.hpp:12:1: error: stray '\264' in program
C:/Users/daniel/Documents/R/win-library/3.2/BH/include/boost/type_traits/is_base_of.hpp:12:1: error: stray '\306' in program
C:/Users/daniel/Documents/R/win-library/3.2/BH/include/boost/type_traits/is_base_of.hpp:12:1: error: stray '@' in program
C:/Users/daniel/Documents/R/win-library/3.2/BH/include/boost/type_traits/is_base_of.hpp:12:1: error: stray '\266' in program
C:/Users/daniel/Documents/R/win-library/3.2/BH/include/boost/type_traits/is_base_of.hpp:12:1: error: stray '\311' in program
C:/Users/daniel/Documents/R/win-library/3.2/BH/include/boost/type_traits/is_base_of.hpp:12:1: error: stray '\221' in program
C:/Users/daniel/Documents/R/win-library/3.2/BH/include/boost/type_traits/is_base_of.hpp:12:1: error: stray '\25' in program
C:/Users/daniel/Documents/R/win-library/3.2/BH/include/boost/type_traits/is_base_of.hpp:12:1: error: stray '\200' in program
C:/Users/daniel/Documents/R/win-library/3.2/BH/include/boost/type_traits/is_base_of.hpp:12:1: error: stray '\272' in program
C:/Users/daniel/Documents/R/win-library/3.2/BH/include/boost/type_traits/is_base_of.hpp:12:1: error: stray '\245' in program
C:/Users/daniel/Documents/R/win-library/3.2/BH/include/boost/type_traits/is_base_of.hpp:12:1: error: stray '\301' in program
C:/Users/daniel/Documents/R/win-library/3.2/BH/include/boost/type_traits/is_base_of.hpp:12:1: error: stray '\303' in program
C:/Users/daniel/Documents/R/win-library/3.2/BH/include/boost/type_traits/is_base_of.hpp:12:1: error: stray '\325' in program
C:/Users/daniel/Documents/R/win-library/3.2/BH/include/boost/type_traits/is_base_of.hpp:12:1: error: stray '\221' in program
C:/Users/daniel/Documents/R/win-library/3.2/BH/include/boost/type_traits/is_base_of.hpp:12:1: error: stray '\215' in program
C:/Users/daniel/Documents/R/win-library/3.2/BH/include/boost/type_traits/is_base_of.hpp:12:1: error: stray '\200' in program
C:/Users/daniel/Documents/R/win-library/3.2/BH/include/boost/type_traits/is_base_of.hpp:12:1: error: stray '\202' in program
C:/Users/daniel/Documents/R/win-library/3.2/BH/include/boost/type_traits/is_base_of.hpp:12:1: error: stray '\24' in program
C:/Users/daniel/Documents/R/win-library/3.2/BH/include/boost/type_traits/is_base_of.hpp:12:1: error: stray '\326' in program
C:/Users/daniel/Documents/R/win-library/3.2/BH/include/boost/type_traits/is_base_of.hpp:12:1: error: stray '\225' in program
C:/Users/daniel/Documents/R/win-library/3.2/BH/include/boost/type_traits/is_base_of.hpp:12:1: error: stray '\244' in program
C:/Users/daniel/Documents/R/win-library/3.2/BH/include/boost/type_traits/is_base_of.hpp:12:1: error: stray '\302' in program
C:/Users/daniel/Documents/R/win-library/3.2/BH/include/boost/type_traits/is_base_of.hpp:12:1: error: stray '\277' in program
C:/Users/daniel/Documents/R/win-library/3.2/BH/include/boost/type_traits/is_base_of.hpp:12:1: error: stray '\4' in program
C:/Users/daniel/Documents/R/win-library/3.2/BH/include/boost/type_traits/is_base_of.hpp:12:1: error: stray '\10' in program
C:/Users/daniel/Documents/R/win-library/3.2/BH/include/boost/type_traits/is_base_of.hpp:12:1: error: stray '\247' in program
C:/Users/daniel/Documents/R/win-library/3.2/BH/include/boost/type_traits/is_base_of.hpp:12:1: error: stray '\35' in program
C:/Users/daniel/Documents/R/win-library/3.2/BH/include/boost/type_traits/is_base_of.hpp:12:1: error: stray '\250' in program
C:/Users/daniel/Documents/R/win-library/3.2/BH/include/boost/type_traits/is_base_of.hpp:12:1: error: stray '\275' in program
C:/Users/daniel/Documents/R/win-library/3.2/BH/include/boost/type_traits/is_base_of.hpp:12:1: error: stray '\372' in program
C:/Users/daniel/Documents/R/win-library/3.2/BH/include/boost/type_traits/is_base_of.hpp:13:1: error: stray '\313' in program
C:/Users/daniel/Documents/R/win-library/3.2/BH/include/boost/type_traits/is_base_of.hpp:13:1: error: stray '\255' in program
C:/Users/daniel/Documents/R/win-library/3.2/BH/include/boost/type_traits/is_base_of.hpp:13:1: error: stray '\325' in program
C:/Users/daniel/Documents/R/win-library/3.2/BH/include/boost/type_traits/is_base_of.hpp:13:1: error: stray '\341' in program
C:/Users/daniel/Documents/R/win-library/3.2/BH/include/boost/type_traits/is_base_of.hpp:13:1: error: stray '\360' in program
C:/Users/daniel/Documents/R/win-library/3.2/BH/include/boost/type_traits/is_base_of.hpp:13:1: error: stray '\232' in program
C:/Users/daniel/Documents/R/win-library/3.2/BH/include/boost/type_traits/is_base_of.hpp:13:1: error: stray '\276' in program
C:/Users/daniel/Documents/R/win-library/3.2/BH/include/boost/type_traits/is_base_of.hpp:13:1: error: stray '\5' in program
C:/Users/daniel/Documents/R/win-library/3.2/BH/include/boost/type_traits/is_base_of.hpp:13:1: error: stray '\263' in program
C:/Users/daniel/Documents/R/win-library/3.2/BH/include/boost/type_traits/is_base_of.hpp:13:1: error: stray '\315' in program
C:/Users/daniel/Documents/R/win-library/3.2/BH/include/boost/type_traits/is_base_of.hpp:13:1: error: stray '\253' in program
C:/Users/daniel/Documents/R/win-library/3.2/BH/include/boost/type_traits/is_base_of.hpp:13:1: error: stray '\31' in program
C:/Users/daniel/Documents/R/win-library/3.2/BH/include/boost/type_traits/is_base_of.hpp:13:1: error: stray '\271' in program
C:/Users/daniel/Documents/R/win-library/3.2/BH/include/boost/type_traits/is_base_of.hpp:13:1: error: stray '\222' in program
C:/Users/daniel/Documents/R/win-library/3.2/BH/include/boost/type_traits/is_base_of.hpp:13:1: error: stray '\254' in program
C:/Users/daniel/Documents/R/win-library/3.2/BH/include/boost/type_traits/is_base_of.hpp:13:1: error: stray '\307' in program
C:/Users/daniel/Documents/R/win-library/3.2/BH/include/boost/type_traits/is_base_of.hpp:13:1: error: stray '\33' in program
C:/Users/daniel/Documents/R/win-library/3.2/BH/include/boost/type_traits/is_base_of.hpp:13:1: error: stray '\235' in program
C:/Users/daniel/Documents/R/win-library/3.2/BH/include/boost/type_traits/is_base_of.hpp:13:1: error: stray '\202' in program
C:/Users/daniel/Documents/R/win-library/3.2/BH/include/boost/type_traits/is_base_of.hpp:13:1: error: stray '\263' in program
C:/Users/daniel/Documents/R/win-library/3.2/BH/include/boost/type_traits/is_base_of.hpp:13:1: error: stray '\20' in program
C:/Users/daniel/Documents/R/win-library/3.2/BH/include/boost/type_traits/is_base_of.hpp:14:1: error: stray '\261' in program
C:/Users/daniel/Documents/R/win-library/3.2/BH/include/boost/type_traits/is_base_of.hpp:14:1: error: stray '\320' in program
C:/Users/daniel/Documents/R/win-library/3.2/BH/include/boost/type_traits/is_base_of.hpp:14:1: error: stray '\20' in program
C:/Users/daniel/Documents/R/win-library/3.2/BH/include/boost/type_traits/is_base_of.hpp:14:1: error: stray '\17' in program
C:/Users/daniel/Documents/R/win-library/3.2/BH/include/boost/type_traits/is_base_of.hpp:14:1: error: stray '\212' in program
C:/Users/daniel/Documents/R/win-library/3.2/BH/include/boost/type_traits/is_base_of.hpp:14:1: error: stray '\346' in program
C:/Users/daniel/Documents/R/win-library/3.2/BH/include/boost/type_traits/is_base_of.hpp:14:1: error: stray '\231' in program
C:/Users/daniel/Documents/R/win-library/3.2/BH/include/boost/type_traits/is_base_of.hpp:14:1: error: stray '\27' in program
C:/Users/daniel/Documents/R/win-library/3.2/BH/include/boost/type_traits/is_base_of.hpp:14:1: error: stray '\311' in program
C:/Users/daniel/Documents/R/win-library/3.2/BH/include/boost/type_traits/is_base_of.hpp:14:1: error: stray '\346' in program
C:/Users/daniel/Documents/R/win-library/3.2/BH/include/boost/type_traits/is_base_of.hpp:14:1: error: stray '\17' in program
C:/Users/daniel/Documents/R/win-library/3.2/BH/include/boost/type_traits/is_base_of.hpp:14:1: error: stray '\370' in program
C:/Users/daniel/Documents/R/win-library/3.2/BH/include/boost/type_traits/is_base_of.hpp:14:1: error: stray '\177' in program
C:/Users/daniel/Documents/R/win-library/3.2/BH/include/boost/type_traits/is_base_of.hpp:14:1: error: stray '\361' in program
C:/Users/daniel/Documents/R/win-library/3.2/BH/include/boost/type_traits/is_base_of.hpp:14:1: error: stray '\336' in program
C:/Users/daniel/Documents/R/win-library/3.2/BH/include/boost/type_traits/is_base_of.hpp:14:1: error: stray '\216' in program
C:/Users/daniel/Documents/R/win-library/3.2/BH/include/boost/type_traits/is_base_of.hpp:14:1: error: stray '\220' in program
C:/Users/daniel/Documents/R/win-library/3.2/BH/include/boost/type_traits/is_base_of.hpp:14:1: error: missing terminating " character
C:/Users/daniel/Documents/R/win-library/3.2/BH/include/boost/type_traits/is_base_of.hpp:15:1: error: stray '\233' in program
C:/Users/daniel/Documents/R/win-library/3.2/BH/include/boost/type_traits/is_base_of.hpp:15:1: error: stray '\224' in program
C:/Users/daniel/Documents/R/win-library/3.2/BH/include/boost/type_traits/is_base_of.hpp:15:1: error: stray '\35' in program
C:/Users/daniel/Documents/R/win-library/3.2/BH/include/boost/type_traits/is_base_of.hpp:15:1: error: stray '`' in program
C:/Users/daniel/Documents/R/win-library/3.2/BH/include/boost/type_traits/is_base_of.hpp:15:1: error: stray '\360' in program
C:/Users/daniel/Documents/R/win-library/3.2/BH/include/boost/type_traits/is_base_of.hpp:15:1: error: stray '\331' in program
C:/Users/daniel/Documents/R/win-library/3.2/BH/include/boost/type_traits/is_base_of.hpp:15:1: error: stray '\260' in program
C:/Users/daniel/Documents/R/win-library/3.2/BH/include/boost/type_traits/is_base_of.hpp:15:1: error: stray '\34' in program
C:/Users/daniel/Documents/R/win-library/3.2/BH/include/boost/type_traits/is_base_of.hpp:15:1: error: stray '\312' in program
C:/Users/daniel/Documents/R/win-library/3.2/BH/include/boost/type_traits/is_base_of.hpp:15:1: error: stray '\204' in program
C:/Users/daniel/Documents/R/win-library/3.2/BH/include/boost/type_traits/is_base_of.hpp:15:1: error: stray '\4' in program
C:/Users/daniel/Documents/R/win-library/3.2/BH/include/boost/type_traits/is_base_of.hpp:15:1: error: stray '\356' in program
C:/Users/daniel/Documents/R/win-library/3.2/BH/include/boost/type_traits/is_base_of.hpp:15:1: error: stray '\337' in program
C:/Users/daniel/Documents/R/win-library/3.2/BH/include/boost/type_traits/is_base_of.hpp:15:1: error: stray '\5' in program
C:/Users/daniel/Documents/R/win-library/3.2/BH/include/boost/type_traits/is_base_of.hpp:15:20: error: invalid suffix "t" on integer constant
C:/Users/daniel/Documents/R/win-library/3.2/BH/include/boost/type_traits/is_base_of.hpp:15:1: error: stray '\335' in program
C:/Users/daniel/Documents/R/win-library/3.2/BH/include/boost/type_traits/is_base_of.hpp:15:1: error: stray '\277' in program
C:/Users/daniel/Documents/R/win-library/3.2/BH/include/boost/type_traits/is_base_of.hpp:15:1: error: stray '\217' in program
C:/Users/daniel/Documents/R/win-library/3.2/BH/include/boost/type_traits/is_base_of.hpp:15:1: error: stray '\21' in program
C:/Users/daniel/Documents/R/win-library/3.2/BH/include/boost/type_traits/is_base_of.hpp:15:1: error: stray '\270' in program
C:/Users/daniel/Documents/R/win-library/3.2/BH/include/boost/type_traits/is_base_of.hpp:15:1: error: stray '\356' in program
C:/Users/daniel/Documents/R/win-library/3.2/BH/include/boost/type_traits/is_base_of.hpp:15:33: error: invalid suffix "USyNH" on integer constant
C:/Users/daniel/Documents/R/win-library/3.2/BH/include/boost/type_traits/is_base_of.hpp:15:1: error: stray '\307' in program
C:/Users/daniel/Documents/R/win-library/3.2/BH/include/boost/type_traits/is_base_of.hpp:15:1: error: stray '\302' in program
C:/Users/daniel/Documents/R/win-library/3.2/BH/include/boost/type_traits/is_base_of.hpp:15:1: error: stray '\371' in program
C:/Users/daniel/Documents/R/win-library/3.2/BH/include/boost/type_traits/is_base_of.hpp:15:1: error: stray '\360' in program
C:/Users/daniel/Documents/R/win-library/3.2/BH/include/boost/type_traits/is_base_of.hpp:15:1: error: stray '\322' in program
C:/Users/daniel/Documents/R/win-library/3.2/BH/include/boost/type_traits/is_base_of.hpp:15:1: error: stray '\316' in program
C:/Users/daniel/Documents/R/win-library/3.2/BH/include/boost/type_traits/is_base_of.hpp:15:1: error: stray '\356' in program
C:/Users/daniel/Documents/R/win-library/3.2/BH/include/boost/type_traits/is_base_of.hpp:15:1: error: stray '\27' in program
C:/Users/daniel/Documents/R/win-library/3.2/BH/include/boost/type_traits/is_base_of.hpp:15:1: error: stray '\244' in program
C:/Users/daniel/Documents/R/win-library/3.2/BH/include/boost/type_traits/is_base_of.hpp:15:1: error: stray '\276' in program
C:/Users/daniel/Documents/R/win-library/3.2/BH/include/boost/type_traits/is_base_of.hpp:15:1: error: stray '\247' in program
C:/Users/daniel/Documents/R/win-library/3.2/BH/include/boost/type_traits/is_base_of.hpp:15:1: error: stray '\236' in program
C:/Users/daniel/Documents/R/win-library/3.2/BH/include/boost/type_traits/is_base_of.hpp:15:1: error: stray '\341' in program
C:/Users/daniel/Documents/R/win-library/3.2/BH/include/boost/type_traits/is_base_of.hpp:15:1: error: stray '\306' in program
C:/Users/daniel/Documents/R/win-library/3.2/BH/include/boost/type_traits/is_base_of.hpp:15:1: error: stray '\254' in program
C:/Users/daniel/Documents/R/win-library/3.2/BH/include/boost/type_traits/is_base_of.hpp:15:1: error: stray '\27' in program
C:/Users/daniel/Documents/R/win-library/3.2/BH/include/boost/type_traits/is_base_of.hpp:15:1: error: stray '\253' in program
C:/Users/daniel/Documents/R/win-library/3.2/BH/include/boost/type_traits/is_base_of.hpp:15:1: error: stray '\243' in program
C:/Users/daniel/Documents/R/win-library/3.2/BH/include/boost/type_traits/is_base_of.hpp:15:1: error: stray '\24' in program
C:/Users/daniel/Documents/R/win-library/3.2/BH/include/boost/type_traits/is_base_of.hpp:15:1: error: missing terminating " character
C:/Users/daniel/Documents/R/win-library/3.2/BH/include/boost/type_traits/is_base_of.hpp:16:1: error: stray '\20' in program
C:/Users/daniel/Documents/R/win-library/3.2/BH/include/boost/type_traits/is_base_of.hpp:16:1: error: stray '\246' in program
C:/Users/daniel/Documents/R/win-library/3.2/BH/include/boost/type_traits/is_base_of.hpp:16:1: error: stray '\35' in program
C:/Users/daniel/Documents/R/win-library/3.2/BH/include/boost/type_traits/is_base_of.hpp:16:1: error: stray '\236' in program
C:/Users/daniel/Documents/R/win-library/3.2/BH/include/boost/type_traits/is_base_of.hpp:16:1: error: stray '\344' in program
C:/Users/daniel/Documents/R/win-library/3.2/BH/include/boost/type_traits/is_base_of.hpp:16:1: error: stray '\331' in program
C:/Users/daniel/Documents/R/win-library/3.2/BH/include/boost/type_traits/is_base_of.hpp:16:1: error: stray '\35' in program
C:/Users/daniel/Documents/R/win-library/3.2/BH/include/boost/type_traits/is_base_of.hpp:16:1: error: stray '\36' in program
C:/Users/daniel/Documents/R/win-library/3.2/BH/include/boost/type_traits/is_base_of.hpp:16:1: error: stray '\252' in program
C:/Users/daniel/Documents/R/win-library/3.2/BH/include/boost/type_traits/is_base_of.hpp:16:1: error: stray '\255' in program
C:/Users/daniel/Documents/R/win-library/3.2/BH/include/boost/type_traits/is_base_of.hpp:16:1: error: stray '\3' in program
C:/Users/daniel/Documents/R/win-library/3.2/BH/include/boost/type_traits/is_base_of.hpp:16:1: error: stray '\7' in program
C:/Users/daniel/Documents/R/win-library/3.2/BH/include/boost/type_traits/is_base_of.hpp:16:1: error: stray '\304' in program
C:/Users/daniel/Documents/R/win-library/3.2/BH/include/boost/type_traits/is_base_of.hpp:16:1: error: stray '\356' in program
C:/Users/daniel/Documents/R/win-library/3.2/BH/include/boost/type_traits/is_base_of.hpp:16:1: error: stray '\16' in program
C:/Users/daniel/Documents/R/win-library/3.2/BH/include/boost/type_traits/is_base_of.hpp:16:1: error: stray '\6' in program
C:/Users/daniel/Documents/R/win-library/3.2/BH/include/boost/type_traits/is_base_of.hpp:16:1: error: stray '\31' in program
C:/Users/daniel/Documents/R/win-library/3.2/BH/include/boost/type_traits/is_base_of.hpp:16:1: error: stray '\274' in program
C:/Users/daniel/Documents/R/win-library/3.2/BH/include/boost/type_traits/is_base_of.hpp:16:1: error: stray '\241' in program
C:/Users/daniel/Documents/R/win-library/3.2/BH/include/boost/type_traits/is_base_of.hpp:16:1: error: stray '\24' in program
C:/Users/daniel/Documents/R/win-library/3.2/BH/include/boost/type_traits/is_base_of.hpp:16:1: error: stray '\346' in program
C:/Users/daniel/Documents/R/win-library/3.2/BH/include/boost/type_traits/is_base_of.hpp:16:1: error: stray '\16' in program
C:/Users/daniel/Documents/R/win-library/3.2/BH/include/boost/type_traits/is_base_of.hpp:16:1: error: stray '\200' in program
C:/Users/daniel/Documents/R/win-library/3.2/BH/include/boost/type_traits/is_base_of.hpp:16:1: error: stray '`' in program
C:/Users/daniel/Documents/R/win-library/3.2/BH/include/boost/type_traits/is_base_of.hpp:16:1: error: stray '\5' in program
C:/Users/daniel/Documents/R/win-library/3.2/BH/include/boost/type_traits/is_base_of.hpp:16:1: error: stray '\215' in program
C:/Users/daniel/Documents/R/win-library/3.2/BH/include/boost/type_traits/is_base_of.hpp:16:1: error: stray '\325' in program
C:/Users/daniel/Documents/R/win-library/3.2/BH/include/boost/type_traits/is_base_of.hpp:16:1: error: stray '\265' in program
C:/Users/daniel/Documents/R/win-library/3.2/BH/include/boost/type_traits/is_base_of.hpp:16:1: error: stray '\261' in program
C:/Users/daniel/Documents/R/win-library/3.2/BH/include/boost/type_traits/is_base_of.hpp:16:1: error: stray '\300' in program
C:/Users/daniel/Documents/R/win-library/3.2/BH/include/boost/type_traits/is_base_of.hpp:16:1: error: stray '\323' in program
C:/Users/daniel/Documents/R/win-library/3.2/BH/include/boost/type_traits/is_base_of.hpp:16:1: error: stray '\344' in program
C:/Users/daniel/Documents/R/win-library/3.2/BH/include/boost/type_traits/is_base_of.hpp:16:1: error: stray '\365' in program
C:/Users/daniel/Documents/R/win-library/3.2/BH/include/boost/type_traits/is_base_of.hpp:16:1: error: stray '\274' in program
C:/Users/daniel/Documents/R/win-library/3.2/BH/include/boost/type_traits/is_base_of.hpp:16:1: error: stray '\215' in program
C:/Users/daniel/Documents/R/win-library/3.2/BH/include/boost/type_traits/is_base_of.hpp:16:1: error: stray '\317' in program
C:/Users/daniel/Documents/R/win-library/3.2/BH/include/boost/type_traits/is_base_of.hpp:16:1: error: stray '\227' in program
C:/Users/daniel/Documents/R/win-library/3.2/BH/include/boost/type_traits/is_base_of.hpp:16:1: error: stray '\234' in program
C:/Users/daniel/Documents/R/win-library/3.2/BH/include/boost/type_traits/is_base_of.hpp:16:1: error: stray '\226' in program
C:/Users/daniel/Documents/R/win-library/3.2/BH/include/boost/type_traits/is_base_of.hpp:16:1: error: stray '\317' in program
C:/Users/daniel/Documents/R/win-library/3.2/BH/include/boost/type_traits/is_base_of.hpp:16:1: error: stray '\234' in program
C:/Users/daniel/Documents/R/win-library/3.2/BH/include/boost/type_traits/is_base_of.hpp:16:1: error: stray '\223' in program
C:/Users/daniel/Documents/R/win-library/3.2/BH/include/boost/type_traits/is_base_of.hpp:16:1: error: stray '\370' in program
C:/Users/daniel/Documents/R/win-library/3.2/BH/include/boost/type_traits/is_base_of.hpp:16:1: error: stray '\235' in program
C:/Users/daniel/Documents/R/win-library/3.2/BH/include/boost/type_traits/is_base_of.hpp:16:1: error: stray '\16' in program
C:/Users/daniel/Documents/R/win-library/3.2/BH/include/boost/type_traits/is_base_of.hpp:16:1: error: stray '\251' in program
C:/Users/daniel/Documents/R/win-library/3.2/BH/include/boost/type_traits/is_base_of.hpp:16:1: error: stray '\306' in program
C:/Users/daniel/Documents/R/win-library/3.2/BH/include/boost/type_traits/is_base_of.hpp:16:1: error: stray '\360' in program
C:/Users/daniel/Documents/R/win-library/3.2/BH/include/boost/type_traits/is_base_of.hpp:16:1: error: stray '\374' in program
C:/Users/daniel/Documents/R/win-library/3.2/BH/include/boost/type_traits/is_base_of.hpp:16:1: error: stray '\376' in program
C:/Users/daniel/Documents/R/win-library/3.2/BH/include/boost/type_traits/is_base_of.hpp:16:1: error: stray '\365' in program
C:/Users/daniel/Documents/R/win-library/3.2/BH/include/boost/type_traits/is_base_of.hpp:16:1: error: stray '\226' in program
C:/Users/daniel/Documents/R/win-library/3.2/BH/include/boost/type_traits/is_base_of.hpp:16:1: error: stray '\345' in program
C:/Users/daniel/Documents/R/win-library/3.2/BH/include/boost/type_traits/is_base_of.hpp:16:1: error: stray '\334' in program
C:/Users/daniel/Documents/R/win-library/3.2/BH/include/boost/type_traits/is_base_of.hpp:16:1: error: stray '@' in program
C:/Users/daniel/Documents/R/win-library/3.2/BH/include/boost/type_traits/is_base_of.hpp:16:1: error: stray '\23' in program
C:/Users/daniel/Documents/R/win-library/3.2/BH/include/boost/type_traits/is_base_of.hpp:16:1: error: stray '\177' in program
C:/Users/daniel/Documents/R/win-library/3.2/BH/include/boost/type_traits/is_base_of.hpp:16:1: error: stray '\250' in program
C:/Users/daniel/Documents/R/win-library/3.2/BH/include/boost/type_traits/is_base_of.hpp:16:1: error: stray '\323' in program
C:/Users/daniel/Documents/R/win-library/3.2/BH/include/boost/type_traits/is_base_of.hpp:16:1: error: stray '\10' in program
C:/Users/daniel/Documents/R/win-library/3.2/BH/include/boost/type_traits/is_base_of.hpp:16:1: error: stray '\7' in program
C:/Users/daniel/Documents/R/win-library/3.2/BH/include/boost/type_traits/is_base_of.hpp:16:1: error: stray '\32' in program
C:/Users/daniel/Documents/R/win-library/3.2/BH/include/boost/type_traits/is_base_of.hpp:16:1: error: stray '\224' in program
C:/Users/daniel/Documents/R/win-library/3.2/BH/include/boost/type_traits/is_base_of.hpp:16:1: error: stray '\225' in program
C:/Users/daniel/Documents/R/win-library/3.2/BH/include/boost/type_traits/is_base_of.hpp:16:1: error: stray '\326' in program
C:/Users/daniel/Documents/R/win-library/3.2/BH/include/boost/type_traits/is_base_of.hpp:16:1: error: stray '\5' in program
C:/Users/daniel/Documents/R/win-library/3.2/BH/include/boost/type_traits/is_base_of.hpp:16:1: error: stray '\300' in program
C:/Users/daniel/Documents/R/win-library/3.2/BH/include/boost/type_traits/is_base_of.hpp:16:1: error: stray '\234' in program
C:/Users/daniel/Documents/R/win-library/3.2/BH/include/boost/type_traits/is_base_of.hpp:16:1: error: stray '\25' in program
C:/Users/daniel/Documents/R/win-library/3.2/BH/include/boost/type_traits/is_base_of.hpp:16:1: error: stray '\30' in program
C:/Users/daniel/Documents/R/win-library/3.2/BH/include/boost/type_traits/is_base_of.hpp:16:1: error: stray '\24' in program
C:/Users/daniel/Documents/R/win-library/3.2/BH/include/boost/type_traits/is_base_of.hpp:16:1: error: stray '\245' in program
C:/Users/daniel/Documents/R/win-library/3.2/BH/include/boost/type_traits/is_base_of.hpp:16:1: error: stray '\207' in program
C:/Users/daniel/Documents/R/win-library/3.2/BH/include/boost/type_traits/is_base_of.hpp:16:1: error: stray '\332' in program
C:/Users/daniel/Documents/R/win-library/3.2/BH/include/boost/type_traits/is_base_of.hpp:16:1: error: stray '\10' in program
C:/Users/daniel/Documents/R/win-library/3.2/BH/include/boost/type_traits/is_base_of.hpp:16:1: error: stray '\25' in program
C:/Users/daniel/Documents/R/win-library/3.2/BH/include/boost/type_traits/is_base_of.hpp:16:1: error: stray '\267' in program
C:/Users/daniel/Documents/R/win-library/3.2/BH/include/boost/type_traits/is_base_of.hpp:16:1: error: stray '\306' in program
C:/Users/daniel/Documents/R/win-library/3.2/BH/include/boost/type_traits/is_base_of.hpp:16:1: error: stray '\200' in program
C:/Users/daniel/Documents/R/win-library/3.2/BH/include/boost/type_traits/is_base_of.hpp:16:1: error: stray '\200' in program
C:/Users/daniel/Documents/R/win-library/3.2/BH/include/boost/type_traits/is_base_of.hpp:16:1: error: stray '\323' in program
C:/Users/daniel/Documents/R/win-library/3.2/BH/include/boost/type_traits/is_base_of.hpp:16:1: error: stray '\344' in program
C:/Users/daniel/Documents/R/win-library/3.2/BH/include/boost/type_traits/is_base_of.hpp:16:1: error: stray '\311' in program
C:/Users/daniel/Documents/R/win-library/3.2/BH/include/boost/type_traits/is_base_of.hpp:16:1: error: stray '\233' in program
C:/Users/daniel/Documents/R/win-library/3.2/BH/include/boost/type_traits/is_base_of.hpp:16:1: error: stray '\301' in program
C:/Users/daniel/Documents/R/win-library/3.2/BH/include/boost/type_traits/is_base_of.hpp:16:1: error: stray '\210' in program
C:/Users/daniel/Documents/R/win-library/3.2/BH/include/boost/type_traits/is_base_of.hpp:16:1: error: stray '\206' in program
C:/Users/daniel/Documents/R/win-library/3.2/BH/include/boost/type_traits/is_base_of.hpp:16:1: error: stray '\27' in program
C:/Users/daniel/Documents/R/win-library/3.2/BH/include/boost/type_traits/is_base_of.hpp:16:1: error: stray '\231' in program
C:/Users/daniel/Documents/R/win-library/3.2/BH/include/boost/type_traits/is_base_of.hpp:16:1: error: stray '@' in program
C:/Users/daniel/Documents/R/win-library/3.2/BH/include/boost/type_traits/is_base_of.hpp:16:1: error: stray '\365' in program
C:/Users/daniel/Documents/R/win-library/3.2/BH/include/boost/type_traits/is_base_of.hpp:16:1: error: stray '\233' in program
C:/Users/daniel/Documents/R/win-library/3.2/BH/include/boost/type_traits/is_base_of.hpp:16:1: error: stray '\307' in program
C:/Users/daniel/Documents/R/win-library/3.2/BH/include/boost/type_traits/is_base_of.hpp:16:1: error: stray '\270' in program
C:/Users/daniel/Documents/R/win-library/3.2/BH/include/boost/type_traits/is_base_of.hpp:16:1: error: stray '\321' in program
C:/Users/daniel/Documents/R/win-library/3.2/BH/include/boost/type_traits/is_base_of.hpp:16:1: error: stray '\216' in program
C:/Users/daniel/Documents/R/win-library/3.2/BH/include/boost/type_traits/is_base_of.hpp:16:1: error: stray '\240' in program
C:/Users/daniel/Documents/R/win-library/3.2/BH/include/boost/type_traits/is_base_of.hpp:16:1: error: stray '\350' in program
C:/Users/daniel/Documents/R/win-library/3.2/BH/include/boost/type_traits/is_base_of.hpp:16:1: error: stray '\373' in program
C:/Users/daniel/Documents/R/win-library/3.2/BH/include/boost/type_traits/is_base_of.hpp:16:156: error: invalid suffix "M" on integer constant
C:/Users/daniel/Documents/R/win-library/3.2/BH/include/boost/type_traits/is_base_of.hpp:16:1: error: stray '\237' in program
C:/Users/daniel/Documents/R/win-library/3.2/BH/include/boost/type_traits/is_base_of.hpp:16:1: error: stray '\325' in program
C:/Users/daniel/Documents/R/win-library/3.2/BH/include/boost/type_traits/is_base_of.hpp:16:1: error: stray '\315' in program
C:/Users/daniel/Documents/R/win-library/3.2/BH/include/boost/type_traits/is_base_of.hpp:16:1: error: stray '\324' in program
C:/Users/daniel/Documents/R/win-library/3.2/BH/include/boost/type_traits/is_base_of.hpp:16:1: error: stray '\374' in program
C:/Users/daniel/Documents/R/win-library/3.2/BH/include/boost/type_traits/is_base_of.hpp:16:1: error: stray '\343' in program
C:/Users/daniel/Documents/R/win-library/3.2/BH/include/boost/type_traits/is_base_of.hpp:16:1: error: stray '\16' in program
C:/Users/daniel/Documents/R/win-library/3.2/BH/include/boost/type_traits/is_base_of.hpp:16:167: error: invalid suffix "o" on integer constant
C:/Users/daniel/Documents/R/win-library/3.2/BH/include/boost/type_traits/is_base_of.hpp:16:1: error: stray '\320' in program
C:/Users/daniel/Documents/R/win-library/3.2/BH/include/boost/type_traits/is_base_of.hpp:16:1: error: stray '\232' in program
C:/Users/daniel/Documents/R/win-library/3.2/BH/include/boost/type_traits/is_base_of.hpp:16:1: error: stray '\241' in program
C:/Users/daniel/Documents/R/win-library/3.2/BH/include/boost/type_traits/is_base_of.hpp:16:1: error: stray '\267' in program
C:/Users/daniel/Documents/R/win-library/3.2/BH/include/boost/type_traits/is_base_of.hpp:16:1: error: stray '\324' in program
C:/Users/daniel/Documents/R/win-library/3.2/BH/include/boost/type_traits/is_base_of.hpp:16:1: error: stray '\341' in program
C:/Users/daniel/Documents/R/win-library/3.2/BH/include/boost/type_traits/is_base_of.hpp:16:1: error: stray '\231' in program
C:/Users/daniel/Documents/R/win-library/3.2/BH/include/boost/type_traits/is_base_of.hpp:16:1: error: stray '\361' in program
C:/Users/daniel/Documents/R/win-library/3.2/BH/include/boost/type_traits/is_base_of.hpp:16:1: error: stray '\333' in program
C:/Users/daniel/Documents/R/win-library/3.2/BH/include/boost/type_traits/is_base_of.hpp:16:1: error: stray '\234' in program
C:/Users/daniel/Documents/R/win-library/3.2/BH/include/boost/type_traits/is_base_of.hpp:16:1: error: stray '\373' in program
C:/Users/daniel/Documents/R/win-library/3.2/BH/include/boost/type_traits/is_base_of.hpp:16:1: error: stray '\260' in program
C:/Users/daniel/Documents/R/win-library/3.2/BH/include/boost/type_traits/is_base_of.hpp:16:1: error: stray '\230' in program
C:/Users/daniel/Documents/R/win-library/3.2/BH/include/boost/type_traits/is_base_of.hpp:16:1: error: stray '\376' in program
C:/Users/daniel/Documents/R/win-library/3.2/BH/include/boost/type_traits/is_base_of.hpp:16:1: error: stray '\340' in program
C:/Users/daniel/Documents/R/win-library/3.2/BH/include/boost/type_traits/is_base_of.hpp:16:1: error: stray '\236' in program
C:/Users/daniel/Documents/R/win-library/3.2/BH/include/boost/type_traits/is_base_of.hpp:16:1: error: stray '\215' in program
C:/Users/daniel/Documents/R/win-library/3.2/BH/include/boost/type_traits/is_base_of.hpp:16:1: error: stray '\242' in program
C:/Users/daniel/Documents/R/win-library/3.2/BH/include/boost/type_traits/is_base_of.hpp:16:1: error: stray '\301' in program
C:/Users/daniel/Documents/R/win-library/3.2/BH/include/boost/type_traits/is_base_of.hpp:16:1: error: stray '\316' in program
C:/Users/daniel/Documents/R/win-library/3.2/BH/include/boost/type_traits/is_base_of.hpp:16:1: error: stray '\217' in program
C:/Users/daniel/Documents/R/win-library/3.2/BH/include/boost/type_traits/is_base_of.hpp:16:1: error: stray '\374' in program
C:/Users/daniel/Documents/R/win-library/3.2/BH/include/boost/type_traits/is_base_of.hpp:16:1: error: stray '\243' in program
C:/Users/daniel/Documents/R/win-library/3.2/BH/include/boost/type_traits/is_base_of.hpp:16:1: error: stray '\342' in program
C:/Users/daniel/Documents/R/win-library/3.2/BH/include/boost/type_traits/is_base_of.hpp:16:1: error: stray '\333' in program
C:/Users/daniel/Documents/R/win-library/3.2/BH/include/boost/type_traits/is_base_of.hpp:16:1: error: stray '\327' in program
C:/Users/daniel/Documents/R/win-library/3.2/BH/include/boost/type_traits/is_base_of.hpp:16:1: error: stray '\241' in program
C:/Users/daniel/Documents/R/win-library/3.2/BH/include/boost/type_traits/is_base_of.hpp:16:1: error: stray '\34' in program
C:/Users/daniel/Documents/R/win-library/3.2/BH/include/boost/type_traits/is_base_of.hpp:16:1: error: stray '\340' in program
C:/Users/daniel/Documents/R/win-library/3.2/BH/include/boost/type_traits/is_base_of.hpp:16:205: error: invalid suffix "a9" on integer constant
C:/Users/daniel/Documents/R/win-library/3.2/BH/include/boost/type_traits/is_base_of.hpp:16:1: error: stray '\367' in program
C:/Users/daniel/Documents/R/win-library/3.2/BH/include/boost/type_traits/is_base_of.hpp:16:1: error: stray '\253' in program
C:/Users/daniel/Documents/R/win-library/3.2/BH/include/boost/type_traits/is_base_of.hpp:16:1: error: stray '\206' in program
C:/Users/daniel/Documents/R/win-library/3.2/BH/include/boost/type_traits/is_base_of.hpp:16:1: error: stray '\355' in program
C:/Users/daniel/Documents/R/win-library/3.2/BH/include/boost/type_traits/is_base_of.hpp:16:1: error: stray '\222' in program
C:/Users/daniel/Documents/R/win-library/3.2/BH/include/boost/type_traits/is_base_of.hpp:16:1: error: stray '\332' in program
C:/Users/daniel/Documents/R/win-library/3.2/BH/include/boost/type_traits/is_base_of.hpp:16:1: error: stray '\322' in program
C:/Users/daniel/Documents/R/win-library/3.2/BH/include/boost/type_traits/is_base_of.hpp:16:1: error: stray '\320' in program
C:/Users/daniel/Documents/R/win-library/3.2/BH/include/boost/type_traits/is_base_of.hpp:16:1: error: stray '\20' in program
C:/Users/daniel/Documents/R/win-library/3.2/BH/include/boost/type_traits/is_base_of.hpp:16:1: error: stray '\232' in program
C:/Users/daniel/Documents/R/win-library/3.2/BH/include/boost/type_traits/is_base_of.hpp:16:1: error: stray '\376' in program
C:/Users/daniel/Documents/R/win-library/3.2/BH/include/boost/type_traits/is_base_of.hpp:16:1: error: stray '\32' in program
C:/Users/daniel/Documents/R/win-library/3.2/BH/include/boost/type_traits/is_base_of.hpp:16:1: error: stray '\301' in program
C:/Users/daniel/Documents/R/win-library/3.2/BH/include/boost/type_traits/is_base_of.hpp:16:1: error: stray '\230' in program
C:/Users/daniel/Documents/R/win-library/3.2/BH/include/boost/type_traits/is_base_of.hpp:16:1: error: stray '\311' in program
C:/Users/daniel/Documents/R/win-library/3.2/BH/include/boost/type_traits/is_base_of.hpp:16:1: error: stray '\251' in program
C:/Users/daniel/Documents/R/win-library/3.2/BH/include/boost/type_traits/is_base_of.hpp:16:1: error: stray '\355' in program
C:/Users/daniel/Documents/R/win-library/3.2/BH/include/boost/type_traits/is_base_of.hpp:16:1: error: stray '\353' in program
C:/Users/daniel/Documents/R/win-library/3.2/BH/include/boost/type_traits/is_base_of.hpp:16:1: error: stray '\241' in program
C:/Users/daniel/Documents/R/win-library/3.2/BH/include/boost/type_traits/is_base_of.hpp:16:1: error: stray '\6' in program
C:/Users/daniel/Documents/R/win-library/3.2/BH/include/boost/type_traits/is_base_of.hpp:16:1: error: stray '\34' in program
C:/Users/daniel/Documents/R/win-library/3.2/BH/include/boost/type_traits/is_base_of.hpp:16:1: error: stray '\341' in program
C:/Users/daniel/Documents/R/win-library/3.2/BH/include/boost/type_traits/is_base_of.hpp:16:1: error: stray '\32' in program
C:/Users/daniel/Documents/R/win-library/3.2/BH/include/boost/type_traits/is_base_of.hpp:16:1: error: stray '\32' in program
C:/Users/daniel/Documents/R/win-library/3.2/BH/include/boost/type_traits/is_base_of.hpp:16:1: error: stray '\307' in program
C:/Users/daniel/Documents/R/win-library/3.2/BH/include/boost/type_traits/is_base_of.hpp:16:1: error: stray '\371' in program
C:/Users/daniel/Documents/R/win-library/3.2/BH/include/boost/type_traits/is_base_of.hpp:16:1: error: stray '\340' in program
C:/Users/daniel/Documents/R/win-library/3.2/BH/include/boost/type_traits/is_base_of.hpp:16:1: error: stray '\367' in program
C:/Users/daniel/Documents/R/win-library/3.2/BH/include/boost/type_traits/is_base_of.hpp:16:1: error: stray '@' in program
C:/Users/daniel/Documents/R/win-library/3.2/BH/include/boost/type_traits/is_base_of.hpp:16:1: error: missing terminating " character
C:/Users/daniel/Documents/R/win-library/3.2/BH/include/boost/type_traits/is_base_of.hpp:17:1: error: stray '\1' in program
C:/Users/daniel/Documents/R/win-library/3.2/BH/include/boost/type_traits/is_base_of.hpp:17:1: error: stray '\6' in program
C:/Users/daniel/Documents/R/win-library/3.2/BH/include/boost/type_traits/is_base_of.hpp:17:1: error: stray '\213' in program
C:/Users/daniel/Documents/R/win-library/3.2/BH/include/boost/type_traits/is_base_of.hpp:17:1: error: stray '\373' in program
C:/Users/daniel/Documents/R/win-library/3.2/BH/include/boost/type_traits/is_base_of.hpp:17:1: error: stray '\242' in program
C:/Users/daniel/Documents/R/win-library/3.2/BH/include/boost/type_traits/is_base_of.hpp:17:1: error: stray '\' in program
C:/Users/daniel/Documents/R/win-library/3.2/BH/include/boost/type_traits/is_base_of.hpp:17:1: error: stray '\177' in program
C:/Users/daniel/Documents/R/win-library/3.2/BH/include/boost/type_traits/is_base_of.hpp:17:1: error: stray '\1' in program
C:/Users/daniel/Documents/R/win-library/3.2/BH/include/boost/type_traits/is_base_of.hpp:17:1: error: stray '#' in program
C:/Users/daniel/Documents/R/win-library/3.2/BH/include/boost/type_traits/is_base_of.hpp:17:1: error: stray '\3' in program
C:/Users/daniel/Documents/R/win-library/3.2/BH/include/boost/type_traits/is_base_of.hpp:17:1: error: stray '\314' in program
C:/Users/daniel/Documents/R/win-library/3.2/BH/include/boost/type_traits/is_base_of.hpp:17:1: error: stray '\30' in program
C:/Users/daniel/Documents/R/win-library/3.2/BH/include/boost/type_traits/is_base_of.hpp:17:1: error: stray '\5' in program
C:/Users/daniel/Documents/R/win-library/3.2/BH/include/boost/type_traits/is_base_of.hpp:17:1: error: stray '\217' in program
C:/Users/daniel/Documents/R/win-library/3.2/BH/include/boost/type_traits/is_base_of.hpp:17:1: error: stray '\214' in program
C:/Users/daniel/Documents/R/win-library/3.2/BH/include/boost/type_traits/is_base_of.hpp:17:1: error: stray '\323' in program
C:/Users/daniel/Documents/R/win-library/3.2/BH/include/boost/type_traits/is_base_of.hpp:17:1: error: stray '\5' in program
C:/Users/daniel/Documents/R/win-library/3.2/BH/include/boost/type_traits/is_base_of.hpp:17:1: error: stray '\32' in program
from C:/Users/daniel/Documents/R/win-library/3.2/BH/include/boost/range/iterator_range_core.hpp:38,
from C:/Users/daniel/Documents/R/win-library/3.2/BH/include/boost/lexical_cast.hpp:30,
from C:/Users/daniel/Documents/R/win-library/3.2/BH/include/boost/math/constants/constants.hpp:18,
from C:/Users/daniel/Documents/R/win-library/3.2/StanHeaders/include/stan/math/prim/scal/fun/constants.hpp:4,
from C:/Users/daniel/Documents/R/win-library/3.2/StanHeaders/include/stan/math/rev/core/operator_unary_plus.hpp:7,
from C:/Users/daniel/Documents/R/win-library/3.2/StanHeaders/include/stan/math/rev/core.hpp:35,
from C:/Users/daniel/Documents/R/win-library/3.2/StanHeaders/include/stan/math/prim/scal/meta/OperandsAndPartials.hpp:21,
from C:/Users/daniel/Documents/R/win-library/3.2/StanHeaders/include/stan/math.hpp:39,
from C:/Users/daniel/Documents/R/win-library/3.2/StanHeaders/include/src/stan/model/model_header.hpp:4,
from file230c3e17a18.cpp:8:
C:/Users/daniel/Documents/R/win-library/3.2/BH/include/boost/preprocessor/repetition/detail/for.hpp:1:3: error: expected unqualified-id before ']' token
C:/Users/daniel/Documents/R/win-library/3.2/BH/include/boost/preprocessor/repetition/detail/for.hpp:1:72: error: expected unqualified-id before ',' token
C:/Users/daniel/Documents/R/win-library/3.2/BH/include/boost/preprocessor/repetition/detail/for.hpp:1:77: error: expected constructor, destructor, or type conversion before '.' token
C:/Users/daniel/Documents/R/win-library/3.2/BH/include/boost/preprocessor/repetition/detail/for.hpp:1:79: error: expected declaration before '}' token
make: *** [file230c3e17a18.o] Error 1
Warning message:
running command 'make -f "C:/PROGRA~1/R/R-32~1.2/etc/i386/Makeconf" -f "C:/PROGRA~1/R/R-32~1.2/share/make/
winshlib.mk" -f "C:\Users\daniel\Documents/.R/Makevars" SHLIB_LDFLAGS='$(SHLIB_CXXLDFLAGS)' SHLIB_LD='$(SHLIB_CXXLD)' SHLIB="file230c3e17a18.dll" OBJECTS="file230c3e17a18.o"' had status 2
ERROR(s) during compilation: source code errors or compiler configuration errors!
Program source:
1:
2: // includes from the plugin
3:
4:
5: // user includes
6: #define STAN__SERVICES__COMMAND_HPP// Code generated by Stan version 2.7
7:
8: #include <stan/model/model_header.hpp>
9:
10: namespace model230c720361d4_CPTbehavioral_namespace {
11:
12: using std::istream;
13: using std::string;
14: using std::stringstream;
15: using std::vector;
16: using stan::io::dump;
17: using stan::math::lgamma;
18: using stan::model::prob_grad;
19: using namespace stan::math;
20:
21: typedef Eigen::Matrix<double,Eigen::Dynamic,1> vector_d;
22: typedef Eigen::Matrix<double,1,Eigen::Dynamic> row_vector_d;
23: typedef Eigen::Matrix<double,Eigen::Dynamic,Eigen::Dynamic> matrix_d;
24:
25: static int current_statement_begin__;
26: class model230c720361d4_CPTbehavioral : public prob_grad {
27: private:
28: int J;
29: vector<double> y;
30: vector<double> sigma;
31: public:
32: model230c720361d4_CPTbehavioral(stan::io::var_context& context__,
33: std::ostream* pstream__ = 0)
34: : prob_grad(0) {
35: current_statement_begin__ = -1;
36:
37: static const char* function__ = "model230c720361d4_CPTbehavioral_namespace::model230c720361d4_CPTbehavioral";
38: (void) function__; // dummy call to supress warning
39: size_t pos__;
40: (void) pos__; // dummy call to supress warning
41: std::vector<int> vals_i__;
42: std::vector<double> vals_r__;
43: context__.validate_dims("data initialization", "J", "int", context__.to_vec());
44: J = int(0);
45: vals_i__ = context__.vals_i("J");
46: pos__ = 0;
47: J = vals_i__[pos__++];
48: context__.validate_dims("data initialization", "y", "double", context__.to_vec(J));
49: validate_non_negative_index("y", "J", J);
50: y = std::vector<double>(J,double(0));
51: vals_r__ = context__.vals_r("y");
52: pos__ = 0;
53: size_t y_limit_0__ = J;
54: for (size_t i_0__ = 0; i_0__ < y_limit_0__; ++i_0__) {
55: y[i_0__] = vals_r__[pos__++];
56: }
57: context__.validate_dims("data initialization", "sigma", "double", context__.to_vec(J));
58: validate_non_negative_index("sigma", "J", J);
59: sigma = std::vector<double>(J,double(0));
60: vals_r__ = context__.vals_r("sigma");
61: pos__ = 0;
62: size_t sigma_limit_0__ = J;
63: for (size_t i_0__ = 0; i_0__ < sigma_limit_0__; ++i_0__) {
64: sigma[i_0__] = vals_r__[pos__++];
65: }
66:
67: // validate data
68: check_greater_or_equal(function__,"J",J,0);
69: for (int k0__ = 0; k0__ < J; ++k0__) {
70: check_greater_or_equal(function__,"sigma[k0__]",sigma[k0__],0);
71: }
72:
73: double DUMMY_VAR__(std::numeric_limits<double>::quiet_NaN());
74: (void) DUMMY_VAR__; // suppress unused var warning
75:
76:
77: // initialize transformed variables to avoid seg fault on val access
78:
79: try {
80: } catch (const std::exception& e) {
81: stan::lang::rethrow_located(e,current_statement_begin__);
82: // Next line prevents compiler griping about no return
83: throw std::runtime_error("*** IF YOU SEE THIS, PLEASE REPORT A BUG ***");
84: }
85:
86: // validate transformed data
87:
88: // set parameter ranges
89: num_params_r__ = 0U;
90: param_ranges_i__.clear();
91: ++num_params_r__;
92: ++num_params_r__;
93: num_params_r__ += J;
94: }
95:
96: ~model230c720361d4_CPTbehavioral() { }
97:
98:
99: void transform_inits(const stan::io::var_context& context__,
100: std::vector<int>& params_i__,
101: std::vector<double>& params_r__,
102: std::ostream* pstream__) const {
103: stan::io::writer<double> writer__(params_r__,params_i__);
104: size_t pos__;
105: (void) pos__; // dummy call to supress warning
106: std::vector<double> vals_r__;
107: std::vector<int> vals_i__;
108:
109: if (!(context__.contains_r("mu")))
110: throw std::runtime_error("variable mu missing");
111: vals_r__ = context__.vals_r("mu");
112: pos__ = 0U;
113: context__.validate_dims("initialization", "mu", "double", context__.to_vec());
114: double mu(0);
115: mu = vals_r__[pos__++];
116: try {
117: writer__.scalar_unconstrain(mu);
118: } catch (const std::exception& e) {
119: throw std::runtime_error(std::string("Error transforming variable mu: ") + e.what());
120: }
121:
122: if (!(context__.contains_r("tau")))
123: throw std::runtime_error("variable tau missing");
124: vals_r__ = context__.vals_r("tau");
125: pos__ = 0U;
126: context__.validate_dims("initialization", "tau", "double", context__.to_vec());
127: double tau(0);
128: tau = vals_r__[pos__++];
129: try {
130: writer__.scalar_lb_unconstrain(0,tau);
131: } catch (const std::exception& e) {
132: throw std::runtime_error(std::string("Error transforming variable tau: ") + e.what());
133: }
134:
135: if (!(context__.contains_r("eta")))
136: throw std::runtime_error("variable eta missing");
137: vals_r__ = context__.vals_r("eta");
138: pos__ = 0U;
139: context__.validate_dims("initialization", "eta", "double", context__.to_vec(J));
140: std::vector<double> eta(J,double(0));
141: for (int i0__ = 0U; i0__ < J; ++i0__)
142: eta[i0__] = vals_r__[pos__++];
143: for (int i0__ = 0U; i0__ < J; ++i0__)
144: try {
145: writer__.scalar_unconstrain(eta[i0__]);
146: } catch (const std::exception& e) {
147: throw std::runtime_error(std::string("Error transforming variable eta: ") + e.what());
148: }
149:
150: params_r__ = writer__.data_r();
151: params_i__ = writer__.data_i();
152: }
153:
154: void transform_inits(const stan::io::var_context& context,
155: Eigen::Matrix<double,Eigen::Dynamic,1>& params_r,
156: std::ostream* pstream__) const {
157: std::vector<double> params_r_vec;
158: std::vector<int> params_i_vec;
159: transform_inits(context, params_i_vec, params_r_vec, pstream__);
160: params_r.resize(params_r_vec.size());
161: for (int i = 0; i < params_r.size(); ++i)
162: params_r(i) = params_r_vec[i];
163: }
164:
165:
166: template <bool propto__, bool jacobian__, typename T__>
167: T__ log_prob(vector<T__>& params_r__,
168: vector<int>& params_i__,
169: std::ostream* pstream__ = 0) const {
170:
171: T__ DUMMY_VAR__(std::numeric_limits<double>::quiet_NaN());
172: (void) DUMMY_VAR__; // suppress unused var warning
173:
174: T__ lp__(0.0);
175: stan::math::accumulator<T__> lp_accum__;
176:
177: // model parameters
178: stan::io::reader<T__> in__(params_r__,params_i__);
179:
180: T__ mu;
181: (void) mu; // dummy to suppress unused var warning
182: if (jacobian__)
183: mu = in__.scalar_constrain(lp__);
184: else
185: mu = in__.scalar_constrain();
186:
187: T__ tau;
188: (void) tau; // dummy to suppress unused var warning
189: if (jacobian__)
190: tau = in__.scalar_lb_constrain(0,lp__);
191: else
192: tau = in__.scalar_lb_constrain(0);
193:
194: vector<T__> eta;
195: size_t dim_eta_0__ = J;
196: eta.reserve(dim_eta_0__);
197: for (size_t k_0__ = 0; k_0__ < dim_eta_0__; ++k_0__) {
198: if (jacobian__)
199: eta.push_back(in__.scalar_constrain(lp__));
200: else
201: eta.push_back(in__.scalar_constrain());
202: }
203:
204:
205: // transformed parameters
206: vector<T__> theta(J);
207:
208: // initialize transformed variables to avoid seg fault on val access
209: stan::math::fill(theta,DUMMY_VAR__);
210:
211: try {
212: current_statement_begin__ = 13;
213: for (int j = 1; j <= J; ++j) {
214: current_statement_begin__ = 14;
215: stan::math::assign(get_base1_lhs(theta,j,"theta",1), (mu + (tau * get_base1(eta,j,"eta",1))));
216: }
217: } catch (const std::exception& e) {
218: stan::lang::rethrow_located(e,current_statement_begin__);
219: // Next line prevents compiler griping about no return
220: throw std::runtime_error("*** IF YOU SEE THIS, PLEASE REPORT A BUG ***");
221: }
222:
223: // validate transformed parameters
224: for (int i0__ = 0; i0__ < J; ++i0__) {
225: if (stan::math::is_uninitialized(theta[i0__])) {
226: std::stringstream msg__;
227: msg__ << "Undefined transformed parameter: theta" << '[' << i0__ << ']';
228: throw std::runtime_error(msg__.str());
229: }
230: }
231:
232: const char* function__ = "validate transformed params";
233: (void) function__; // dummy to suppress unused var warning
234:
235: // model body
236: try {
237: current_statement_begin__ = 17;
238: lp_accum__.add(normal_log<propto__>(eta, 0, 1));
239: current_statement_begin__ = 18;
240: lp_accum__.add(normal_log<propto__>(y, theta, sigma));
241: } catch (const std::exception& e) {
242: stan::lang::rethrow_located(e,current_statement_begin__);
243: // Next line prevents compiler griping about no return
244: throw std::runtime_error("*** IF YOU SEE THIS, PLEASE REPORT A BUG ***");
245: }
246:
247: lp_accum__.add(lp__);
248: return lp_accum__.sum();
249:
250: } // log_prob()
251:
252: template <bool propto, bool jacobian, typename T_>
253: T_ log_prob(Eigen::Matrix<T_,Eigen::Dynamic,1>& params_r,
254: std::ostream* pstream = 0) const {
255: std::vector<T_> vec_params_r;
256: vec_params_r.reserve(params_r.size());
257: for (int i = 0; i < params_r.size(); ++i)
258: vec_params_r.push_back(params_r(i));
259: std::vector<int> vec_params_i;
260: return log_prob<propto,jacobian,T_>(vec_params_r, vec_params_i, pstream);
261: }
262:
263:
264: void get_param_names(std::vector<std::string>& names__) const {
265: names__.resize(0);
266: names__.push_back("mu");
267: names__.push_back("tau");
268: names__.push_back("eta");
269: names__.push_back("theta");
270: }
271:
272:
273: void get_dims(std::vector<std::vector<size_t> >& dimss__) const {
274: dimss__.resize(0);
275: std::vector<size_t> dims__;
276: dims__.resize(0);
277: dimss__.push_back(dims__);
278: dims__.resize(0);
279: dimss__.push_back(dims__);
280: dims__.resize(0);
281: dims__.push_back(J);
282: dimss__.push_back(dims__);
283: dims__.resize(0);
284: dims__.push_back(J);
285: dimss__.push_back(dims__);
286: }
287:
288: template <typename RNG>
289: void write_array(RNG& base_rng__,
290: std::vector<double>& params_r__,
291: std::vector<int>& params_i__,
292: std::vector<double>& vars__,
293: bool include_tparams__ = true,
294: bool include_gqs__ = true,
295: std::ostream* pstream__ = 0) const {
296: vars__.resize(0);
297: stan::io::reader<double> in__(params_r__,params_i__);
298: static const char* function__ = "model230c720361d4_CPTbehavioral_namespace::write_array";
299: (void) function__; // dummy call to supress warning
300: // read-transform, write parameters
301: double mu = in__.scalar_constrain();
302: double tau = in__.scalar_lb_constrain(0);
303: vector<double> eta;
304: size_t dim_eta_0__ = J;
305: for (size_t k_0__ = 0; k_0__ < dim_eta_0__; ++k_0__) {
306: eta.push_back(in__.scalar_constrain());
307: }
308: vars__.push_back(mu);
309: vars__.push_back(tau);
310: for (int k_0__ = 0; k_0__ < J; ++k_0__) {
311: vars__.push_back(eta[k_0__]);
312: }
313:
314: if (!include_tparams__) return;
315: // declare and define transformed parameters
316: double lp__ = 0.0;
317: (void) lp__; // dummy call to supress warning
318: stan::math::accumulator<double> lp_accum__;
319:
320: vector<double> theta(J, 0.0);
321:
322: try {
323: current_statement_begin__ = 13;
324: for (int j = 1; j <= J; ++j) {
325: current_statement_begin__ = 14;
326: stan::math::assign(get_base1_lhs(theta,j,"theta",1), (mu + (tau * get_base1(eta,j,"eta",1))));
327: }
328: } catch (const std::exception& e) {
329: stan::lang::rethrow_located(e,current_statement_begin__);
330: // Next line prevents compiler griping about no return
331: throw std::runtime_error("*** IF YOU SEE THIS, PLEASE REPORT A BUG ***");
332: }
333:
334: // validate transformed parameters
335:
336: // write transformed parameters
337: for (int k_0__ = 0; k_0__ < J; ++k_0__) {
338: vars__.push_back(theta[k_0__]);
339: }
340:
341: if (!include_gqs__) return;
342: // declare and define generated quantities
343:
344: double DUMMY_VAR__(std::numeric_limits<double>::quiet_NaN());
345: (void) DUMMY_VAR__; // suppress unused var warning
346:
347:
348: // initialize transformed variables to avoid seg fault on val access
349:
350: try {
351: } catch (const std::exception& e) {
352: stan::lang::rethrow_located(e,current_statement_begin__);
353: // Next line prevents compiler griping about no return
354: throw std::runtime_error("*** IF YOU SEE THIS, PLEASE REPORT A BUG ***");
355: }
356:
357: // validate generated quantities
358:
359: // write generated quantities
360: }
361:
362: template <typename RNG>
363: void write_array(RNG& base_rng,
364: Eigen::Matrix<double,Eigen::Dynamic,1>& params_r,
365: Eigen::Matrix<double,Eigen::Dynamic,1>& vars,
366: bool include_tparams = true,
367: bool include_gqs = true,
368: std::ostream* pstream = 0) const {
369: std::vector<double> params_r_vec(params_r.size());
370: for (int i = 0; i < params_r.size(); ++i)
371: params_r_vec[i] = params_r(i);
372: std::vector<double> vars_vec;
373: std::vector<int> params_i_vec;
374: write_array(base_rng,params_r_vec,params_i_vec,vars_vec,include_tparams,include_gqs,pstream);
375: vars.resize(vars_vec.size());
376: for (int i = 0; i < vars.size(); ++i)
377: vars(i) = vars_vec[i];
378: }
379:
380: static std::string model_name() {
381: return "model230c720361d4_CPTbehavioral";
382: }
383:
384:
385: void constrained_param_names(std::vector<std::string>& param_names__,
386: bool include_tparams__ = true,
387: bool include_gqs__ = true) const {
388: std::stringstream param_name_stream__;
389: param_name_stream__.str(std::string());
390: param_name_stream__ << "mu";
391: param_names__.push_back(param_name_stream__.str());
392: param_name_stream__.str(std::string());
393: param_name_stream__ << "tau";
394: param_names__.push_back(param_name_stream__.str());
395: for (int k_0__ = 1; k_0__ <= J; ++k_0__) {
396: param_name_stream__.str(std::string());
397: param_name_stream__ << "eta" << '.' << k_0__;
398: param_names__.push_back(param_name_stream__.str());
399: }
400:
401: if (!include_gqs__ && !include_tparams__) return;
402: for (int k_0__ = 1; k_0__ <= J; ++k_0__) {
403: param_name_stream__.str(std::string());
404: param_name_stream__ << "theta" << '.' << k_0__;
405: param_names__.push_back(param_name_stream__.str());
406: }
407:
408: if (!include_gqs__) return;
409: }
410:
411:
412: void unconstrained_param_names(std::vector<std::string>& param_names__,
413: bool include_tparams__ = true,
414: bool include_gqs__ = true) const {
415: std::stringstream param_name_stream__;
416: param_name_stream__.str(std::string());
417: param_name_stream__ << "mu";
418: param_names__.push_back(param_name_stream__.str());
419: param_name_stream__.str(std::string());
420: param_name_stream__ << "tau";
421: param_names__.push_back(param_name_stream__.str());
422: for (int k_0__ = 1; k_0__ <= J; ++k_0__) {
423: param_name_stream__.str(std::string());
424: param_name_stream__ << "eta" << '.' << k_0__;
425: param_names__.push_back(param_name_stream__.str());
426: }
427:
428: if (!include_gqs__ && !include_tparams__) return;
429: for (int k_0__ = 1; k_0__ <= J; ++k_0__) {
430: param_name_stream__.str(std::string());
431: param_name_stream__ << "theta" << '.' << k_0__;
432: param_names__.push_back(param_name_stream__.str());
433: }
434:
435: if (!include_gqs__) return;
436: }
437:
438: }; // model
439:
440: } // namespace
441:
442: typedef model230c720361d4_CPTbehavioral_namespace::model230c720361d4_CPTbehavioral stan_model;
443:
444: #include <rstan/rstaninc.hpp>
445: /**
446: * Define Rcpp Module to expose stan_fit's functions to R.
447: */
448: RCPP_MODULE(stan_fit4model230c720361d4_CPTbehavioral_mod){
449: Rcpp::class_<rstan::stan_fit<model230c720361d4_CPTbehavioral_namespace::model230c720361d4_CPTbehavioral,
450: boost::random::ecuyer1988> >("stan_fit4model230c720361d4_CPTbehavioral")
451: // .constructor<Rcpp::List>()
452: .constructor<SEXP, SEXP>()
453: // .constructor<SEXP, SEXP>()
454: .method("call_sampler",
455: &rstan::stan_fit<model230c720361d4_CPTbehavioral_namespace::model230c720361d4_CPTbehavioral, boost::random::ecuyer1988>::call_sampler)
456: .method("param_names",
457: &rstan::stan_fit<model230c720361d4_CPTbehavioral_namespace::model230c720361d4_CPTbehavioral, boost::random::ecuyer1988>::param_names)
458: .method("param_names_oi",
459: &rstan::stan_fit<model230c720361d4_CPTbehavioral_namespace::model230c720361d4_CPTbehavioral, boost::random::ecuyer1988>::param_names_oi)
460: .method("param_fnames_oi",
461: &rstan::stan_fit<model230c720361d4_CPTbehavioral_namespace::model230c720361d4_CPTbehavioral, boost::random::ecuyer1988>::param_fnames_oi)
462: .method("param_dims",
463: &rstan::stan_fit<model230c720361d4_CPTbehavioral_namespace::model230c720361d4_CPTbehavioral, boost::random::ecuyer1988>::param_dims)
464: .method("param_dims_oi",
465: &rstan::stan_fit<model230c720361d4_CPTbehavioral_namespace::model230c720361d4_CPTbehavioral, boost::random::ecuyer1988>::param_dims_oi)
466: .method("update_param_oi",
467: &rstan::stan_fit<model230c720361d4_CPTbehavioral_namespace::model230c720361d4_CPTbehavioral, boost::random::ecuyer1988>::update_param_oi)
468: .method("param_oi_tidx",
469: &rstan::stan_fit<model230c720361d4_CPTbehavioral_namespace::model230c720361d4_CPTbehavioral, boost::random::ecuyer1988>::param_oi_tidx)
470: .method("grad_log_prob",
471: &rstan::stan_fit<model230c720361d4_CPTbehavioral_namespace::model230c720361d4_CPTbehavioral, boost::random::ecuyer1988>::grad_log_prob)
472: .method("log_prob",
473: &rstan::stan_fit<model230c720361d4_CPTbehavioral_namespace::model230c720361d4_CPTbehavioral, boost::random::ecuyer1988>::log_prob)
474: .method("unconstrain_pars",
475: &rstan::stan_fit<model230c720361d4_CPTbehavioral_namespace::model230c720361d4_CPTbehavioral, boost::random::ecuyer1988>::unconstrain_pars)
476: .method("constrain_pars",
477: &rstan::stan_fit<model230c720361d4_CPTbehavioral_namespace::model230c720361d4_CPTbehavioral, boost::random::ecuyer1988>::constrain_pars)
478: .method("num_pars_unconstrained",
479: &rstan::stan_fit<model230c720361d4_CPTbehavioral_namespace::model230c720361d4_CPTbehavioral, boost::random::ecuyer1988>::num_pars_unconstrained)
480: .method("unconstrained_param_names",
481: &rstan::stan_fit<model230c720361d4_CPTbehavioral_namespace::model230c720361d4_CPTbehavioral, boost::random::ecuyer1988>::unconstrained_param_names)
482: .method("constrained_param_names",
483: &rstan::stan_fit<model230c720361d4_CPTbehavioral_namespace::model230c720361d4_CPTbehavioral, boost::random::ecuyer1988>::constrained_param_names)
484: ;
485: }
486:
487: // declarations
488: extern "C" {
489: SEXP file230c3e17a18( ) ;
490: }
491:
492: // definition
493:
494: SEXP file230c3e17a18( ){
495: return Rcpp::wrap("CPTbehavioral");
496: }
497:
498:
running command 'C:/PROGRA~1/R/R-32~1.2/bin/i386/R CMD SHLIB file230c3e17a18.cpp 2> file230c3e17a18.cpp.err.txt' had status 1