Comment #2 on issue 72 by
Woody.Se...@gmail.com: Two failed MetaTrait unit
tests
http://code.google.com/p/stan/issues/detail?id=72
I get similar failure on an updated RHEL 6 distribution
kernel version 2.6.32-279.11.1.el6.x86_64
g++ version 4.4.6 20120305 (Red Hat 4.4.6-4)
stan version 1.02
The MetaTraits.VectorView_matrix_var failure is follwed by a segmentation
fault:
[ RUN ] MetaTraits.VectorView_matrix_var
make: *** [runtest/test/meta/traits] Segmentation fault (core dumped)
Several of the model tests fail:
[ FAILED ]
Models_BugsExamples_Vol3_HepatitisME/Model_Test_Fixture/0.ChainsTest, where
TypeParam = Models_BugsExamples_Vol3_HepatitisME
[ FAILED ]
Models_BugsExamples_Vol1_Stacks_A_Normal/Model_Test_Fixture/0.ChainsTest,
where TypeParam = Models_BugsExamples_Vol1_Stacks_A_Normal
[ FAILED ] Models_BugsExamples_Vol2_Air/Model_Test_Fixture/0.ChainsTest,
where TypeParam = Models_BugsExamples_Vol2_Air
[ FAILED ]
Models_BugsExamples_Vol2_MvnOrange/Model_Test_Fixture/0.ChainsTest, where
TypeParam = Models_BugsExamples_Vol2_MvnOrange
and two additional BUGS tests:
[ FAILED ] Models_BugsExamples_Vol1_Kidney/Model_Test_Fixture/0.RunModel,
where TypeParam = Models_BugsExamples_Vol1_Kidney
[ FAILED ]
Models_BugsExamples_Vol1_Kidney/Model_Test_Fixture/0.ChainsTest, where
TypeParam = Models_BugsExamples_Vol1_Kidney
Woody Setzer