Changes:
[ca...@alias-i.com] normal refactored to two distros
------------------------------------------
Started by an SCM change
Updating https://stan.googlecode.com/svn/trunk
U src\test\prob\distributions_normal_test.cpp
A src\test\meta
A src\test\meta\traits_test.cpp
U src\stan\prob\distributions_normal.hpp
U src\stan\prob\distributions_error_handling.hpp
A src\stan\meta
A src\stan\meta\traits.hpp
U src\stan\agrad\agrad.hpp
At revision 309
[workspace] $ cmd /c call C:\Windows\TEMP\hudson2366900620112372957.bat
<http://d1m1s1b1.stat.columbia.edu:8080/job/Stan/ws/>make> test-all CC="g++-4"
g++-4 -O0 -Wall -g -DNDEBUG -I src -I lib -I lib/gtest/include -I lib/gtest src/test/agrad/ad_test.cpp lib/gtest/src/gtest_main.cc ar/libgtest.a -o test/agrad/ad
test/agrad/ad --gtest_output="xml:test/agrad/ad.xml"
Running main() from gtest_main.cc
[==========] Running 47 tests from 1 test case.
[----------] Global test environment set-up.
[----------] 47 tests from agrad_ad
[ RUN ] agrad_ad.av_eq
[ OK ] agrad_ad.av_eq (0 ms)
[ RUN ] agrad_ad.av_plus_eq_bv
[ OK ] agrad_ad.av_plus_eq_bv (0 ms)
[ RUN ] agrad_ad.av_plus_eq_b
[ OK ] agrad_ad.av_plus_eq_b (0 ms)
[ RUN ] agrad_ad.av_minus_eq_bv
[ OK ] agrad_ad.av_minus_eq_bv (0 ms)
[ RUN ] agrad_ad.av_minus_eq_b
[ OK ] agrad_ad.av_minus_eq_b (0 ms)
[ RUN ] agrad_ad.av_div_eq_bv
[ OK ] agrad_ad.av_div_eq_bv (0 ms)
[ RUN ] agrad_ad.av_div_eq_b
[ OK ] agrad_ad.av_div_eq_b (0 ms)
[ RUN ] agrad_ad.av_eq_bv
[ OK ] agrad_ad.av_eq_bv (0 ms)
[ RUN ] agrad_ad.av_eq_b
[ OK ] agrad_ad.av_eq_b (0 ms)
[ RUN ] agrad_ad.av_neq_bv
[ OK ] agrad_ad.av_neq_bv (0 ms)
[ RUN ] agrad_ad.av_neq_b
[ OK ] agrad_ad.av_neq_b (0 ms)
[ RUN ] agrad_ad.av_lt_bv
[ OK ] agrad_ad.av_lt_bv (0 ms)
[ RUN ] agrad_ad.av_lt_b
[ OK ] agrad_ad.av_lt_b (0 ms)
[ RUN ] agrad_ad.a_lt_bv
[ OK ] agrad_ad.a_lt_bv (0 ms)
[ RUN ] agrad_ad.av_gt_bv
[ OK ] agrad_ad.av_gt_bv (0 ms)
[ RUN ] agrad_ad.av_gt_b
[ OK ] agrad_ad.av_gt_b (0 ms)
[ RUN ] agrad_ad.a_gt_bv
[ OK ] agrad_ad.a_gt_bv (0 ms)
[ RUN ] agrad_ad.av_lte_bv
[ OK ] agrad_ad.av_lte_bv (0 ms)
[ RUN ] agrad_ad.av_lte_b
[ OK ] agrad_ad.av_lte_b (0 ms)
[ RUN ] agrad_ad.a_lte_bv
[ OK ] agrad_ad.a_lte_bv (0 ms)
[ RUN ] agrad_ad.av_gte_bv
[ OK ] agrad_ad.av_gte_bv (0 ms)
[ RUN ] agrad_ad.av_gte_b
[ OK ] agrad_ad.av_gte_b (0 ms)
[ RUN ] agrad_ad.a_gte_bv
[ OK ] agrad_ad.a_gte_bv (0 ms)
[ RUN ] agrad_ad.negation_a
[ OK ] agrad_ad.negation_a (0 ms)
[ RUN ] agrad_ad.pos_a
[ OK ] agrad_ad.pos_a (0 ms)
[ RUN ] agrad_ad.negative_a
[ OK ] agrad_ad.negative_a (0 ms)
[ RUN ] agrad_ad.a_plus_b
[ OK ] agrad_ad.a_plus_b (0 ms)
[ RUN ] agrad_ad.av_minus_bv
[ OK ] agrad_ad.av_minus_bv (0 ms)
[ RUN ] agrad_ad.av_minus_b
[ OK ] agrad_ad.av_minus_b (0 ms)
[ RUN ] agrad_ad.a_minus_bv
[ OK ] agrad_ad.a_minus_bv (0 ms)
[ RUN ] agrad_ad.av_times_bv
[ OK ] agrad_ad.av_times_bv (0 ms)
[ RUN ] agrad_ad.av_times_b
[ OK ] agrad_ad.av_times_b (0 ms)
[ RUN ] agrad_ad.a_times_bv
[ OK ] agrad_ad.a_times_bv (0 ms)
[ RUN ] agrad_ad.av_div_bv
[ OK ] agrad_ad.av_div_bv (0 ms)
[ RUN ] agrad_ad.av_div_bv_2
[ OK ] agrad_ad.av_div_bv_2 (0 ms)
[ RUN ] agrad_ad.av_div_bv_3
[ OK ] agrad_ad.av_div_bv_3 (0 ms)
[ RUN ] agrad_ad.av_div_b
[ OK ] agrad_ad.av_div_b (0 ms)
[ RUN ] agrad_ad.a_div_bv_2
[ OK ] agrad_ad.a_div_bv_2 (0 ms)
[ RUN ] agrad_ad.av_plus_plus
[ OK ] agrad_ad.av_plus_plus (0 ms)
[ RUN ] agrad_ad.plus_plus_av
[ OK ] agrad_ad.plus_plus_av (0 ms)
[ RUN ] agrad_ad.av_minus_minus
[ OK ] agrad_ad.av_minus_minus (1 ms)
[ RUN ] agrad_ad.minus_minus_av
[ OK ] agrad_ad.minus_minus_av (0 ms)
[ RUN ] agrad_ad.exp_av
[ OK ] agrad_ad.exp_av (0 ms)
[ RUN ] agrad_ad.log_av
[ OK ] agrad_ad.log_av (0 ms)
[ RUN ] agrad_ad.log_av_2
[ OK ] agrad_ad.log_av_2 (0 ms)
[ RUN ] agrad_ad.log10_av
[ OK ] agrad_ad.log10_av (0 ms)
[ RUN ] agrad_ad.log10_av_2
[ OK ] agrad_ad.log10_av_2 (0 ms)
[----------] 47 tests from agrad_ad (1 ms total)
[----------] Global test environment tear-down
[==========] 47 tests from 1 test case ran. (2 ms total)
[ PASSED ] 47 tests.
g++-4 -O0 -Wall -g -DNDEBUG -I src -I lib -I lib/gtest/include -I lib/gtest src/test/agrad/agrad_eigen_test.cpp lib/gtest/src/gtest_main.cc ar/libgtest.a -o test/agrad/agrad_eigen
In file included from src/test/agrad/agrad_eigen_test.cpp:7:0:
src/stan/agrad/agrad.hpp:11:37: fatal error: stan/meta/conversions.hpp: No such file or directory
compilation terminated.
make: *** [test/agrad/agrad_eigen] Error 1
<http://d1m1s1b1.stat.columbia.edu:8080/job/Stan/ws/>exit> 2
Build step 'Execute Windows batch command' marked build as failure
Recording test results
Changes:
[ca...@alias-i.com] fixed traits and conversions in meta
------------------------------------------
[...truncated 271 lines...]
[ OK ] agrad_agrad.a_of_x (0 ms)
[ RUN ] agrad_agrad.a__a_eq_x
[ OK ] agrad_agrad.a__a_eq_x (0 ms)
[ RUN ] agrad_agrad.a
[ OK ] agrad_agrad.a (0 ms)
[ RUN ] agrad_agrad.eq_a
[ OK ] agrad_agrad.eq_a (0 ms)
[ RUN ] agrad_agrad.a_lt_b
[ OK ] agrad_agrad.a_lt_b (0 ms)
[ RUN ] agrad_agrad.a_lt_y
[ OK ] agrad_agrad.a_lt_y (0 ms)
[ RUN ] agrad_agrad.x_lt_b
[ OK ] agrad_agrad.x_lt_b (0 ms)
[ RUN ] agrad_agrad.a_gt_b
[ OK ] agrad_agrad.a_gt_b (0 ms)
[ RUN ] agrad_agrad.a_gt_y
[ OK ] agrad_agrad.a_gt_y (0 ms)
[ RUN ] agrad_agrad.x_gt_b
[ OK ] agrad_agrad.x_gt_b (0 ms)
[ RUN ] agrad_agrad.a_lte_b
[ OK ] agrad_agrad.a_lte_b (0 ms)
[ RUN ] agrad_agrad.a_lte_y
[ OK ] agrad_agrad.a_lte_y (0 ms)
[ RUN ] agrad_agrad.x_lte_b
[ OK ] agrad_agrad.x_lte_b (0 ms)
[ RUN ] agrad_agrad.a_gte_b
[ OK ] agrad_agrad.a_gte_b (0 ms)
[ RUN ] agrad_agrad.a_gte_y
[ OK ] agrad_agrad.a_gte_y (0 ms)
[ RUN ] agrad_agrad.x_gte_b
[ OK ] agrad_agrad.x_gte_b (0 ms)
[ RUN ] agrad_agrad.a_eq_b
[ OK ] agrad_agrad.a_eq_b (0 ms)
[ RUN ] agrad_agrad.x_eq_b
[ OK ] agrad_agrad.x_eq_b (0 ms)
[ RUN ] agrad_agrad.a_eq_y
[ OK ] agrad_agrad.a_eq_y (0 ms)
[ RUN ] agrad_agrad.a_neq_y
[ OK ] agrad_agrad.a_neq_y (0 ms)
[ RUN ] agrad_agrad.pos_a
[ OK ] agrad_agrad.pos_a (0 ms)
[ RUN ] agrad_agrad.neg_a
[ OK ] agrad_agrad.neg_a (0 ms)
[ RUN ] agrad_agrad.a_plus_b
[ OK ] agrad_agrad.a_plus_b (0 ms)
[ RUN ] agrad_agrad.a_plus_a
[ OK ] agrad_agrad.a_plus_a (0 ms)
[ RUN ] agrad_agrad.a_plus_neg_b
[ OK ] agrad_agrad.a_plus_neg_b (0 ms)
[ RUN ] agrad_agrad.a_plus_x
[ OK ] agrad_agrad.a_plus_x (0 ms)
[ RUN ] agrad_agrad.x_plus_a
[ OK ] agrad_agrad.x_plus_a (0 ms)
[ RUN ] agrad_agrad.a_minus_b
[ OK ] agrad_agrad.a_minus_b (0 ms)
[ RUN ] agrad_agrad.a_minus_a
[ OK ] agrad_agrad.a_minus_a (0 ms)
[ RUN ] agrad_agrad.a_minus_x
[ OK ] agrad_agrad.a_minus_x (0 ms)
[ RUN ] agrad_agrad.x_minus_a
[ OK ] agrad_agrad.x_minus_a (0 ms)
[ RUN ] agrad_agrad.a_times_b
[ OK ] agrad_agrad.a_times_b (0 ms)
[ RUN ] agrad_agrad.a_times_a
[ OK ] agrad_agrad.a_times_a (0 ms)
[ RUN ] agrad_agrad.a_times_y
[ OK ] agrad_agrad.a_times_y (0 ms)
[ RUN ] agrad_agrad.x_times_b
[ OK ] agrad_agrad.x_times_b (0 ms)
[ RUN ] agrad_agrad.a_div_b
[ OK ] agrad_agrad.a_div_b (0 ms)
[ RUN ] agrad_agrad.a_divide_bd
[ OK ] agrad_agrad.a_divide_bd (0 ms)
[ RUN ] agrad_agrad.ad_divide_b
[ OK ] agrad_agrad.ad_divide_b (0 ms)
[ RUN ] agrad_agrad.plus_plus_a
[ OK ] agrad_agrad.plus_plus_a (0 ms)
[ RUN ] agrad_agrad.plus_plus_a_2
[ OK ] agrad_agrad.plus_plus_a_2 (0 ms)
[ RUN ] agrad_agrad.plus_plus_a_3
[ OK ] agrad_agrad.plus_plus_a_3 (0 ms)
[ RUN ] agrad_agrad.a_plus_plus
[ OK ] agrad_agrad.a_plus_plus (0 ms)
[ RUN ] agrad_agrad.a_plus_plus_2
[ OK ] agrad_agrad.a_plus_plus_2 (0 ms)
[ RUN ] agrad_agrad.minus_minus_a
[ OK ] agrad_agrad.minus_minus_a (0 ms)
[ RUN ] agrad_agrad.minus_minus_a_2
[ OK ] agrad_agrad.minus_minus_a_2 (0 ms)
[ RUN ] agrad_agrad.a_minus_minus
[ OK ] agrad_agrad.a_minus_minus (0 ms)
[ RUN ] agrad_agrad.a_minus_minus_2
[ OK ] agrad_agrad.a_minus_minus_2 (0 ms)
[ RUN ] agrad_agrad.a_pluseq_b
[ OK ] agrad_agrad.a_pluseq_b (0 ms)
[ RUN ] agrad_agrad.a_pluseq_bd
[ OK ] agrad_agrad.a_pluseq_bd (0 ms)
[ RUN ] agrad_agrad.a_minuseq_b
[ OK ] agrad_agrad.a_minuseq_b (0 ms)
[ RUN ] agrad_agrad.a_negeq_bd
[ OK ] agrad_agrad.a_negeq_bd (0 ms)
[ RUN ] agrad_agrad.a_timeseq_b
[ OK ] agrad_agrad.a_timeseq_b (0 ms)
[ RUN ] agrad_agrad.a_timeseq_bd
[ OK ] agrad_agrad.a_timeseq_bd (0 ms)
[ RUN ] agrad_agrad.a_divideeq_b
[ OK ] agrad_agrad.a_divideeq_b (0 ms)
[ RUN ] agrad_agrad.a_divideeq_bd
[ OK ] agrad_agrad.a_divideeq_bd (0 ms)
[ RUN ] agrad_agrad.not_a
[ OK ] agrad_agrad.not_a (0 ms)
[ RUN ] agrad_agrad.exp_a
[ OK ] agrad_agrad.exp_a (0 ms)
[ RUN ] agrad_agrad.a_ostream
[ OK ] agrad_agrad.a_ostream (0 ms)
[ RUN ] agrad_agrad.log_a
[ OK ] agrad_agrad.log_a (0 ms)
[ RUN ] agrad_agrad.log10_a
[ OK ] agrad_agrad.log10_a (0 ms)
[ RUN ] agrad_agrad.sqrt_a
[ OK ] agrad_agrad.sqrt_a (0 ms)
[ RUN ] agrad_agrad.pow_var_var
[ OK ] agrad_agrad.pow_var_var (0 ms)
[ RUN ] agrad_agrad.pow_var_double
[ OK ] agrad_agrad.pow_var_double (0 ms)
[ RUN ] agrad_agrad.pow_double_var
[ OK ] agrad_agrad.pow_double_var (0 ms)
[ RUN ] agrad_agrad.cos_var
[ OK ] agrad_agrad.cos_var (0 ms)
[ RUN ] agrad_agrad.sin_var
[ OK ] agrad_agrad.sin_var (0 ms)
[ RUN ] agrad_agrad.tan_var
[ OK ] agrad_agrad.tan_var (0 ms)
[ RUN ] agrad_agrad.acos_var
[ OK ] agrad_agrad.acos_var (0 ms)
[ RUN ] agrad_agrad.asin_var
[ OK ] agrad_agrad.asin_var (0 ms)
[ RUN ] agrad_agrad.atan_var
[ OK ] agrad_agrad.atan_var (0 ms)
[ RUN ] agrad_agrad.atan2_var_var
[ OK ] agrad_agrad.atan2_var_var (0 ms)
[ RUN ] agrad_agrad.atan2_var_double
[ OK ] agrad_agrad.atan2_var_double (0 ms)
[ RUN ] agrad_agrad.atan2_double_var
[ OK ] agrad_agrad.atan2_double_var (0 ms)
[ RUN ] agrad_agrad.cosh_var
[ OK ] agrad_agrad.cosh_var (0 ms)
[ RUN ] agrad_agrad.sinh_var
[ OK ] agrad_agrad.sinh_var (0 ms)
[ RUN ] agrad_agrad.tanh_var
[ OK ] agrad_agrad.tanh_var (0 ms)
[ RUN ] agrad_agrad.fabs_var
[ OK ] agrad_agrad.fabs_var (0 ms)
[ RUN ] agrad_agrad.fabs_var_2
[ OK ] agrad_agrad.fabs_var_2 (0 ms)
[ RUN ] agrad_agrad.fabs_var_3
[ OK ] agrad_agrad.fabs_var_3 (0 ms)
[ RUN ] agrad_agrad.abs_var
[ OK ] agrad_agrad.abs_var (0 ms)
[ RUN ] agrad_agrad.abs_var_2
[ OK ] agrad_agrad.abs_var_2 (0 ms)
[ RUN ] agrad_agrad.abs_var_3
[ OK ] agrad_agrad.abs_var_3 (0 ms)
[ RUN ] agrad_agrad.floor_var
[ OK ] agrad_agrad.floor_var (0 ms)
[ RUN ] agrad_agrad.ceil_var
[ OK ] agrad_agrad.ceil_var (0 ms)
[ RUN ] agrad_agrad.fmod_var_var
[ OK ] agrad_agrad.fmod_var_var (0 ms)
[ RUN ] agrad_agrad.fmod_var_double
[ OK ] agrad_agrad.fmod_var_double (0 ms)
[ RUN ] agrad_agrad.fmod_double_var
[ OK ] agrad_agrad.fmod_double_var (0 ms)
[----------] 88 tests from agrad_agrad (1 ms total)
[----------] Global test environment tear-down
[==========] 88 tests from 1 test case ran. (3 ms total)
[ PASSED ] 88 tests.
g++-4 -O0 -Wall -g -DNDEBUG -I src -I lib -I lib/gtest/include -I lib/gtest src/test/agrad/distributions_test.cpp lib/gtest/src/gtest_main.cc ar/libgtest.a -o test/agrad/distributions
In file included from src/stan/prob/distributions.hpp:19:0,
from src/test/agrad/distributions_test.cpp:7:
src/stan/prob/distributions_normal.hpp:53:33: error: no default argument for ‘T_y’
src/stan/prob/distributions_normal.hpp:53:33: error: no default argument for ‘T_loc’
src/stan/prob/distributions_normal.hpp:53:33: error: no default argument for ‘T_scale’
src/stan/prob/distributions_normal.hpp:53:33: error: default template arguments may not be used in function templates without -std=c++0x or -std=gnu++0x
src/stan/prob/distributions_normal.hpp:102:102: error: no default argument for ‘T_y’
src/stan/prob/distributions_normal.hpp:102:102: error: no default argument for ‘T_loc’
src/stan/prob/distributions_normal.hpp:102:102: error: no default argument for ‘T_scale’
src/stan/prob/distributions_normal.hpp:102:102: error: default template arguments may not be used in function templates without -std=c++0x or -std=gnu++0x
src/stan/prob/distributions_normal.hpp:149:43: error: no default argument for ‘T_y’
src/stan/prob/distributions_normal.hpp:149:43: error: no default argument for ‘T_loc’
src/stan/prob/distributions_normal.hpp:149:43: error: no default argument for ‘T_scale’
src/stan/prob/distributions_normal.hpp:149:43: error: default template arguments may not be used in function templates without -std=c++0x or -std=gnu++0x
In file included from src/test/agrad/distributions_test.cpp:7:0:
src/stan/prob/distributions.hpp: In function ‘double stan::prob::normal(double, double, double)’:
src/stan/prob/distributions.hpp:81:40: error: no matching function for call to ‘normal_log(double&, double&, double&)’
src/test/agrad/distributions_test.cpp: In member function ‘virtual void prob_prob_norm_exception_Test::TestBody()’:
src/test/agrad/distributions_test.cpp:19:3: error: no matching function for call to ‘normal_log(double, double, stan::agrad::var&)’
src/test/agrad/distributions_test.cpp:21:3: error: no matching function for call to ‘normal_log(double, double, stan::agrad::var&)’
src/test/agrad/distributions_test.cpp: In member function ‘virtual void agrad_agrad_norm_grad_Test::TestBody()’:
src/test/agrad/distributions_test.cpp:33:47: error: no matching function for call to ‘normal_log(double&, stan::agrad::var&, stan::agrad::var&)’
src/test/agrad/distributions_test.cpp:34:47: error: no matching function for call to ‘normal_log(double&, stan::agrad::var&, stan::agrad::var&)’
src/test/agrad/distributions_test.cpp:36:3: error: no matching function for call to ‘normal_log(double&, stan::agrad::var&, stan::agrad::var&)’
src/test/agrad/distributions_test.cpp:37:3: error: no matching function for call to ‘normal_log(double&, stan::agrad::var&, stan::agrad::var&)’
src/test/agrad/distributions_test.cpp: In member function ‘virtual void agrad_agrad_norm_grad_small_example_Test::TestBody()’:
src/test/agrad/distributions_test.cpp:68:47: error: no matching function for call to ‘normal_log(double&, stan::agrad::var&, stan::agrad::var&)’
src/test/agrad/distributions_test.cpp:69:47: error: no matching function for call to ‘normal_log(double&, stan::agrad::var&, stan::agrad::var&)’
src/test/agrad/distributions_test.cpp:70:47: error: no matching function for call to ‘normal_log(double&, stan::agrad::var&, stan::agrad::var&)’
src/test/agrad/distributions_test.cpp:71:47: error: no matching function for call to ‘normal_log(double&, stan::agrad::var&, stan::agrad::var&)’
src/test/agrad/distributions_test.cpp:72:47: error: no matching function for call to ‘normal_log(double&, stan::agrad::var&, stan::agrad::var&)’
src/test/agrad/distributions_test.cpp:73:47: error: no matching function for call to ‘normal_log(double&, stan::agrad::var&, stan::agrad::var&)’
src/test/agrad/distributions_test.cpp:74:47: error: no matching function for call to ‘normal_log(double&, stan::agrad::var&, stan::agrad::var&)’
src/test/agrad/distributions_test.cpp:75:47: error: no matching function for call to ‘normal_log(double&, stan::agrad::var&, stan::agrad::var&)’
src/test/agrad/distributions_test.cpp:76:47: error: no matching function for call to ‘normal_log(double&, stan::agrad::var&, stan::agrad::var&)’
src/test/agrad/distributions_test.cpp:77:47: error: no matching function for call to ‘normal_log(double&, stan::agrad::var&, stan::agrad::var&)’
src/test/agrad/distributions_test.cpp:79:3: error: no matching function for call to ‘normal_log(double&, stan::agrad::var&, stan::agrad::var&)’
src/test/agrad/distributions_test.cpp:80:3: error: no matching function for call to ‘normal_log(double&, stan::agrad::var&, stan::agrad::var&)’
src/test/agrad/distributions_test.cpp:81:3: error: no matching function for call to ‘normal_log(double&, stan::agrad::var&, stan::agrad::var&)’
src/test/agrad/distributions_test.cpp:82:3: error: no matching function for call to ‘normal_log(double&, stan::agrad::var&, stan::agrad::var&)’
src/test/agrad/distributions_test.cpp:83:3: error: no matching function for call to ‘normal_log(double&, stan::agrad::var&, stan::agrad::var&)’
src/test/agrad/distributions_test.cpp:84:3: error: no matching function for call to ‘normal_log(double&, stan::agrad::var&, stan::agrad::var&)’
src/test/agrad/distributions_test.cpp:85:3: error: no matching function for call to ‘normal_log(double&, stan::agrad::var&, stan::agrad::var&)’
src/test/agrad/distributions_test.cpp:86:3: error: no matching function for call to ‘normal_log(double&, stan::agrad::var&, stan::agrad::var&)’
src/test/agrad/distributions_test.cpp:87:3: error: no matching function for call to ‘normal_log(double&, stan::agrad::var&, stan::agrad::var&)’
src/test/agrad/distributions_test.cpp:88:3: error: no matching function for call to ‘normal_log(double&, stan::agrad::var&, stan::agrad::var&)’
test/agrad/distributions --gtest_output="xml:test/agrad/distributions.xml"
Running main() from gtest_main.cc
[==========] Running 0 tests from 0 test cases.
[==========] 0 tests from 0 test cases ran. (0 ms total)
[ PASSED ] 0 tests.
g++-4 -O0 -Wall -g -DNDEBUG -I src -I lib -I lib/gtest/include -I lib/gtest src/test/agrad/matrix_test.cpp lib/gtest/src/gtest_main.cc ar/libgtest.a -o test/agrad/matrix
In file included from src/test/agrad/matrix_test.cpp:1:0:
lib/gtest/include/gtest/gtest.h: In function ‘testing::AssertionResult testing::internal::CmpHelperEQ(const char*, const char*, const T1&, const T2&) [with T1 = int, T2 = unsigned int]’:
lib/gtest/include/gtest/gtest.h:1353:30: instantiated from ‘static testing::AssertionResult testing::internal::EqHelper<lhs_is_null_literal>::Compare(const char*, const char*, const T1&, const T2&) [with T1 = int, T2 = unsigned int, bool lhs_is_null_literal = false]’
src/test/agrad/matrix_test.cpp:159:3: instantiated from here
lib/gtest/include/gtest/gtest.h:1316:3: warning: comparison between signed and unsigned integer expressions
test/agrad/matrix --gtest_output="xml:test/agrad/matrix.xml"
Running main() from gtest_main.cc
[==========] Running 0 tests from 0 test cases.
[==========] 0 tests from 0 test cases ran. (0 ms total)
[ PASSED ] 0 tests.
g++-4 -O0 -Wall -g -DNDEBUG -I src -I lib -I lib/gtest/include -I lib/gtest src/test/meta/traits_test.cpp lib/gtest/src/gtest_main.cc ar/libgtest.a -o test/meta/traits
/usr/lib/gcc/i686-pc-cygwin/4.5.3/../../../../i686-pc-cygwin/bin/ld: cannot open output file test/meta/traits.exe: No such file or directory
collect2: ld returned 1 exit status
make: *** [test/meta/traits] Error 1
------------------------------------------
[...truncated 11695 lines...]
[ RUN ] ProbDistributions.Exponential
[ OK ] ProbDistributions.Exponential (0 ms)
[----------] 1 test from ProbDistributions (0 ms total)
[----------] 1 test from ProbDistributionsCumulative
[ RUN ] ProbDistributionsCumulative.Exponential
[ OK ] ProbDistributionsCumulative.Exponential (0 ms)
[----------] 1 test from ProbDistributionsCumulative (0 ms total)
[----------] 14 tests from ProbDistributionsTruncated
[ RUN ] ProbDistributionsTruncated.ExponentialLowHigh
[ OK ] ProbDistributionsTruncated.ExponentialLowHigh (0 ms)
[ RUN ] ProbDistributionsTruncated.ExponentialLowHighDefaultPolicyX
[ OK ] ProbDistributionsTruncated.ExponentialLowHighDefaultPolicyX (1 ms)
[ RUN ] ProbDistributionsTruncated.ExponentialLowHighDefaultPolicyBeta
[ OK ] ProbDistributionsTruncated.ExponentialLowHighDefaultPolicyBeta (0 ms)
[ RUN ] ProbDistributionsTruncated.ExponentialLowHighDefaultPolicyLow
[ OK ] ProbDistributionsTruncated.ExponentialLowHighDefaultPolicyLow (1 ms)
[ RUN ] ProbDistributionsTruncated.ExponentialLowHighDefaultPolicyHigh
[ OK ] ProbDistributionsTruncated.ExponentialLowHighDefaultPolicyHigh (0 ms)
[ RUN ] ProbDistributionsTruncated.ExponentialLowHighDefaultPolicyLowHigh
[ OK ] ProbDistributionsTruncated.ExponentialLowHighDefaultPolicyLowHigh (0 ms)
[ RUN ] ProbDistributionsTruncated.ExponentialLow
[ OK ] ProbDistributionsTruncated.ExponentialLow (0 ms)
[ RUN ] ProbDistributionsTruncated.ExponentialLowDefaultPolicyX
[ OK ] ProbDistributionsTruncated.ExponentialLowDefaultPolicyX (0 ms)
[ RUN ] ProbDistributionsTruncated.ExponentialLowDefaultPolicyBeta
[ OK ] ProbDistributionsTruncated.ExponentialLowDefaultPolicyBeta (0 ms)
[ RUN ] ProbDistributionsTruncated.ExponentialLowDefaultPolicyLow
[ OK ] ProbDistributionsTruncated.ExponentialLowDefaultPolicyLow (0 ms)
[ RUN ] ProbDistributionsTruncated.ExponentialHigh
[ OK ] ProbDistributionsTruncated.ExponentialHigh (0 ms)
[ RUN ] ProbDistributionsTruncated.ExponentialHighDefaultPolicyX
[ OK ] ProbDistributionsTruncated.ExponentialHighDefaultPolicyX (0 ms)
[ RUN ] ProbDistributionsTruncated.ExponentialHighDefaultPolicyBeta
[ OK ] ProbDistributionsTruncated.ExponentialHighDefaultPolicyBeta (0 ms)
[ RUN ] ProbDistributionsTruncated.ExponentialHighDefaultPolicyHigh
[ OK ] ProbDistributionsTruncated.ExponentialHighDefaultPolicyHigh (0 ms)
[----------] 14 tests from ProbDistributionsTruncated (3 ms total)
[----------] Global test environment tear-down
[==========] 16 tests from 3 test cases ran. (3 ms total)
[ PASSED ] 16 tests.
g++-4 -O0 -Wall -g -DNDEBUG -I src -I lib -I lib/gtest/include -I lib/gtest src/test/prob/distributions_gamma_test.cpp lib/gtest/src/gtest_main.cc ar/libgtest.a -o test/prob/distributions_gamma
test/prob/distributions_gamma --gtest_output="xml:test/prob/distributions_gamma.xml"
Running main() from gtest_main.cc
[==========] Running 3 tests from 2 test cases.
[----------] Global test environment set-up.
[----------] 2 tests from ProbDistributions
[ RUN ] ProbDistributions.Gamma
[ OK ] ProbDistributions.Gamma (0 ms)
[ RUN ] ProbDistributions.GammaDefaultPolicy
[ OK ] ProbDistributions.GammaDefaultPolicy (1 ms)
[----------] 2 tests from ProbDistributions (1 ms total)
[----------] 1 test from ProbDistributionsCumulative
[ RUN ] ProbDistributionsCumulative.Gamma
[ OK ] ProbDistributionsCumulative.Gamma (0 ms)
[----------] 1 test from ProbDistributionsCumulative (0 ms total)
[----------] Global test environment tear-down
[==========] 3 tests from 2 test cases ran. (1 ms total)
[ PASSED ] 3 tests.
g++-4 -O0 -Wall -g -DNDEBUG -I src -I lib -I lib/gtest/include -I lib/gtest src/test/prob/distributions_hypergeometric_test.cpp lib/gtest/src/gtest_main.cc ar/libgtest.a -o test/prob/distributions_hypergeometric
test/prob/distributions_hypergeometric --gtest_output="xml:test/prob/distributions_hypergeometric.xml"
Running main() from gtest_main.cc
[==========] Running 1 test from 1 test case.
[----------] Global test environment set-up.
[----------] 1 test from ProbDistributions
[ RUN ] ProbDistributions.Hypergeometric
[ OK ] ProbDistributions.Hypergeometric (0 ms)
[----------] 1 test from ProbDistributions (0 ms total)
[----------] Global test environment tear-down
[==========] 1 test from 1 test case ran. (0 ms total)
[ PASSED ] 1 test.
g++-4 -O0 -Wall -g -DNDEBUG -I src -I lib -I lib/gtest/include -I lib/gtest src/test/prob/distributions_inv_chi_square_test.cpp lib/gtest/src/gtest_main.cc ar/libgtest.a -o test/prob/distributions_inv_chi_square
test/prob/distributions_inv_chi_square --gtest_output="xml:test/prob/distributions_inv_chi_square.xml"
Running main() from gtest_main.cc
[==========] Running 1 test from 1 test case.
[----------] Global test environment set-up.
[----------] 1 test from ProbDistributions
[ RUN ] ProbDistributions.InvChiSquare
[ OK ] ProbDistributions.InvChiSquare (0 ms)
[----------] 1 test from ProbDistributions (0 ms total)
[----------] Global test environment tear-down
[==========] 1 test from 1 test case ran. (0 ms total)
[ PASSED ] 1 test.
g++-4 -O0 -Wall -g -DNDEBUG -I src -I lib -I lib/gtest/include -I lib/gtest src/test/prob/distributions_inv_gamma_test.cpp lib/gtest/src/gtest_main.cc ar/libgtest.a -o test/prob/distributions_inv_gamma
test/prob/distributions_inv_gamma --gtest_output="xml:test/prob/distributions_inv_gamma.xml"
Running main() from gtest_main.cc
[==========] Running 2 tests from 1 test case.
[----------] Global test environment set-up.
[----------] 2 tests from ProbDistributions
[ RUN ] ProbDistributions.InvGamma
[ OK ] ProbDistributions.InvGamma (0 ms)
[ RUN ] ProbDistributions.InvGammaDefaultPolicy
[ OK ] ProbDistributions.InvGammaDefaultPolicy (1 ms)
[----------] 2 tests from ProbDistributions (1 ms total)
[----------] Global test environment tear-down
[==========] 2 tests from 1 test case ran. (1 ms total)
[ PASSED ] 2 tests.
g++-4 -O0 -Wall -g -DNDEBUG -I src -I lib -I lib/gtest/include -I lib/gtest src/test/prob/distributions_inv_wishart_test.cpp lib/gtest/src/gtest_main.cc ar/libgtest.a -o test/prob/distributions_inv_wishart
test/prob/distributions_inv_wishart --gtest_output="xml:test/prob/distributions_inv_wishart.xml"
Running main() from gtest_main.cc
[==========] Running 1 test from 1 test case.
[----------] Global test environment set-up.
[----------] 1 test from ProbDistributions
[ RUN ] ProbDistributions.InvWishart
[ OK ] ProbDistributions.InvWishart (0 ms)
[----------] 1 test from ProbDistributions (0 ms total)
[----------] Global test environment tear-down
[==========] 1 test from 1 test case ran. (0 ms total)
[ PASSED ] 1 test.
g++-4 -O0 -Wall -g -DNDEBUG -I src -I lib -I lib/gtest/include -I lib/gtest src/test/prob/distributions_logistic_test.cpp lib/gtest/src/gtest_main.cc ar/libgtest.a -o test/prob/distributions_logistic
test/prob/distributions_logistic --gtest_output="xml:test/prob/distributions_logistic.xml"
Running main() from gtest_main.cc
[==========] Running 1 test from 1 test case.
[----------] Global test environment set-up.
[----------] 1 test from ProbDistributions
[ RUN ] ProbDistributions.Logistic
[ OK ] ProbDistributions.Logistic (0 ms)
[----------] 1 test from ProbDistributions (0 ms total)
[----------] Global test environment tear-down
[==========] 1 test from 1 test case ran. (1 ms total)
[ PASSED ] 1 test.
g++-4 -O0 -Wall -g -DNDEBUG -I src -I lib -I lib/gtest/include -I lib/gtest src/test/prob/distributions_lognormal_test.cpp lib/gtest/src/gtest_main.cc ar/libgtest.a -o test/prob/distributions_lognormal
In file included from src/stan/prob/distributions.hpp:19:0,
from src/test/prob/distributions_lognormal_test.cpp:2:
src/stan/prob/distributions_normal.hpp:53:33: error: no default argument for ‘T_y’
src/stan/prob/distributions_normal.hpp:53:33: error: no default argument for ‘T_loc’
src/stan/prob/distributions_normal.hpp:53:33: error: no default argument for ‘T_scale’
src/stan/prob/distributions_normal.hpp:53:33: error: default template arguments may not be used in function templates without -std=c++0x or -std=gnu++0x
src/stan/prob/distributions_normal.hpp:102:102: error: no default argument for ‘T_y’
src/stan/prob/distributions_normal.hpp:102:102: error: no default argument for ‘T_loc’
src/stan/prob/distributions_normal.hpp:102:102: error: no default argument for ‘T_scale’
src/stan/prob/distributions_normal.hpp:102:102: error: default template arguments may not be used in function templates without -std=c++0x or -std=gnu++0x
src/stan/prob/distributions_normal.hpp:149:43: error: no default argument for ‘T_y’
src/stan/prob/distributions_normal.hpp:149:43: error: no default argument for ‘T_loc’
src/stan/prob/distributions_normal.hpp:149:43: error: no default argument for ‘T_scale’
src/stan/prob/distributions_normal.hpp:149:43: error: default template arguments may not be used in function templates without -std=c++0x or -std=gnu++0x
In file included from src/test/prob/distributions_lognormal_test.cpp:2:0:
src/stan/prob/distributions.hpp: In function ‘double stan::prob::normal(double, double, double)’:
src/stan/prob/distributions.hpp:81:40: error: no matching function for call to ‘normal_log(double&, double&, double&)’
test/prob/distributions_lognormal --gtest_output="xml:test/prob/distributions_lognormal.xml"
Running main() from gtest_main.cc
[==========] Running 0 tests from 0 test cases.
[==========] 0 tests from 0 test cases ran. (0 ms total)
[ PASSED ] 0 tests.
g++-4 -O0 -Wall -g -DNDEBUG -I src -I lib -I lib/gtest/include -I lib/gtest src/test/prob/distributions_multi_normal_test.cpp lib/gtest/src/gtest_main.cc ar/libgtest.a -o test/prob/distributions_multi_normal
test/prob/distributions_multi_normal --gtest_output="xml:test/prob/distributions_multi_normal.xml"
Running main() from gtest_main.cc
[==========] Running 2 tests from 1 test case.
[----------] Global test environment set-up.
[----------] 2 tests from ProbDistributions
[ RUN ] ProbDistributions.MultiNormal
[ OK ] ProbDistributions.MultiNormal (0 ms)
[ RUN ] ProbDistributions.MultiNormalDefaultPolicy
[ OK ] ProbDistributions.MultiNormalDefaultPolicy (2 ms)
[----------] 2 tests from ProbDistributions (2 ms total)
[----------] Global test environment tear-down
[==========] 2 tests from 1 test case ran. (2 ms total)
[ PASSED ] 2 tests.
g++-4 -O0 -Wall -g -DNDEBUG -I src -I lib -I lib/gtest/include -I lib/gtest src/test/prob/distributions_multinomial_test.cpp lib/gtest/src/gtest_main.cc ar/libgtest.a -o test/prob/distributions_multinomial
test/prob/distributions_multinomial --gtest_output="xml:test/prob/distributions_multinomial.xml"
Running main() from gtest_main.cc
[==========] Running 1 test from 1 test case.
[----------] Global test environment set-up.
[----------] 1 test from ProbDistributions
[ RUN ] ProbDistributions.Multinomial
[ OK ] ProbDistributions.Multinomial (0 ms)
[----------] 1 test from ProbDistributions (0 ms total)
[----------] Global test environment tear-down
[==========] 1 test from 1 test case ran. (1 ms total)
[ PASSED ] 1 test.
g++-4 -O0 -Wall -g -DNDEBUG -I src -I lib -I lib/gtest/include -I lib/gtest src/test/prob/distributions_neg_binomial_test.cpp lib/gtest/src/gtest_main.cc ar/libgtest.a -o test/prob/distributions_neg_binomial
test/prob/distributions_neg_binomial --gtest_output="xml:test/prob/distributions_neg_binomial.xml"
Running main() from gtest_main.cc
[==========] Running 1 test from 1 test case.
[----------] Global test environment set-up.
[----------] 1 test from ProbDistributions
[ RUN ] ProbDistributions.NegBinomial
[ OK ] ProbDistributions.NegBinomial (0 ms)
[----------] 1 test from ProbDistributions (0 ms total)
[----------] Global test environment tear-down
[==========] 1 test from 1 test case ran. (1 ms total)
[ PASSED ] 1 test.
g++-4 -O0 -Wall -g -DNDEBUG -I src -I lib -I lib/gtest/include -I lib/gtest src/test/prob/distributions_normal_test.cpp lib/gtest/src/gtest_main.cc ar/libgtest.a -o test/prob/distributions_normal
In file included from src/test/prob/distributions_normal_test.cpp:5:0:
src/stan/prob/distributions_normal.hpp:53:33: error: no default argument for ‘T_y’
src/stan/prob/distributions_normal.hpp:53:33: error: no default argument for ‘T_loc’
src/stan/prob/distributions_normal.hpp:53:33: error: no default argument for ‘T_scale’
src/stan/prob/distributions_normal.hpp:53:33: error: default template arguments may not be used in function templates without -std=c++0x or -std=gnu++0x
src/stan/prob/distributions_normal.hpp:102:102: error: no default argument for ‘T_y’
src/stan/prob/distributions_normal.hpp:102:102: error: no default argument for ‘T_loc’
src/stan/prob/distributions_normal.hpp:102:102: error: no default argument for ‘T_scale’
src/stan/prob/distributions_normal.hpp:102:102: error: default template arguments may not be used in function templates without -std=c++0x or -std=gnu++0x
src/stan/prob/distributions_normal.hpp:149:43: error: no default argument for ‘T_y’
src/stan/prob/distributions_normal.hpp:149:43: error: no default argument for ‘T_loc’
src/stan/prob/distributions_normal.hpp:149:43: error: no default argument for ‘T_scale’
src/stan/prob/distributions_normal.hpp:149:43: error: default template arguments may not be used in function templates without -std=c++0x or -std=gnu++0x
src/test/prob/distributions_normal_test.cpp: In member function ‘virtual void ProbDistributions_Normal_Test::TestBody()’:
src/test/prob/distributions_normal_test.cpp:25:3: error: no matching function for call to ‘normal_log(double, double, double)’
src/test/prob/distributions_normal_test.cpp:26:3: error: no matching function for call to ‘normal_log(double, double, double)’
src/test/prob/distributions_normal_test.cpp:27:3: error: no matching function for call to ‘normal_log(double, double, double)’
src/test/prob/distributions_normal_test.cpp:28:3: error: no matching function for call to ‘normal_log(double, double, double)’
src/test/prob/distributions_normal_test.cpp: In member function ‘virtual void ProbDistributions_NormalDefaultPolicy_Test::TestBody()’:
src/test/prob/distributions_normal_test.cpp:32:3: error: no matching function for call to ‘normal_log(double, double, double&)’
src/test/prob/distributions_normal_test.cpp:34:3: error: no matching function for call to ‘normal_log(double, double, double&)’
src/test/prob/distributions_normal_test.cpp: In member function ‘virtual void ProbDistributions_NormalErrnoPolicy_Test::TestBody()’:
src/test/prob/distributions_normal_test.cpp:41:63: error: no matching function for call to ‘normal_log(double, double, double&, my_policy)’
src/test/prob/distributions_normal_test.cpp:45:63: error: no matching function for call to ‘normal_log(double, double, double&, my_policy)’
src/test/prob/distributions_normal_test.cpp: In member function ‘virtual void ProbDistributions_NormalPropTo_Test::TestBody()’:
src/test/prob/distributions_normal_test.cpp:49:3: error: no matching function for call to ‘normal_log(double, double, double)’
src/test/prob/distributions_normal_test.cpp:50:3: error: no matching function for call to ‘normal_log(double, double, double)’
src/test/prob/distributions_normal_test.cpp:51:3: error: no matching function for call to ‘normal_log(double, double, double)’
src/test/prob/distributions_normal_test.cpp:52:3: error: no matching function for call to ‘normal_log(double, double, double)’
src/test/prob/distributions_normal_test.cpp: In member function ‘virtual void ProbDistributions_NormalPropToDefaultPolicy_Test::TestBody()’:
src/test/prob/distributions_normal_test.cpp:56:3: error: no matching function for call to ‘normal_log(double, double, double&)’
src/test/prob/distributions_normal_test.cpp:58:3: error: no matching function for call to ‘normal_log(double, double, double&)’
src/test/prob/distributions_normal_test.cpp: In member function ‘virtual void ProbDistributionsCumulative_Normal_Test::TestBody()’:
src/test/prob/distributions_normal_test.cpp:75:3: error: no matching function for call to ‘normal_p(double, double, double)’
src/test/prob/distributions_normal_test.cpp:76:3: error: no matching function for call to ‘normal_p(double, double, double)’
src/test/prob/distributions_normal_test.cpp:77:3: error: no matching function for call to ‘normal_p(double, double, double)’
src/test/prob/distributions_normal_test.cpp: In member function ‘virtual void ProbDistributionsCumulative_NormalDefaultPolicySigma_Test::TestBody()’:
src/test/prob/distributions_normal_test.cpp:81:3: error: no matching function for call to ‘normal_p(double, double, double)’
src/test/prob/distributions_normal_test.cpp:83:3: error: no matching function for call to ‘normal_p(double, double, double)’
src/test/prob/distributions_normal_test.cpp: In member function ‘virtual void ProbDistributions_NormalVec_Test::TestBody()’:
src/test/prob/distributions_normal_test.cpp:91:3: error: no matching function for call to ‘normal_log(std::vector<double>&, double&, double&)’
src/test/prob/distributions_normal_test.cpp:100:47: error: no matching function for call to ‘normal_log(double&, double&, double&)’
src/test/prob/distributions_normal_test.cpp:102:3: error: no matching function for call to ‘normal_log(std::vector<double>&, double&, double&)’
src/stan/prob/distributions_constants.hpp: At global scope:
src/stan/prob/distributions_constants.hpp:15:20: warning: ‘stan::prob::<unnamed>::LOG_ZERO’ defined but not used
src/stan/prob/distributions_constants.hpp:19:20: warning: ‘stan::prob::<unnamed>::NEG_LOG_TWO’ defined but not used
src/stan/prob/distributions_constants.hpp:23:20: warning: ‘stan::prob::<unnamed>::NEG_LOG_PI’ defined but not used
src/stan/prob/distributions_constants.hpp:25:20: warning: ‘stan::prob::<unnamed>::NEG_LOG_SQRT_PI’ defined but not used
src/stan/prob/distributions_constants.hpp:27:20: warning: ‘stan::prob::<unnamed>::NEG_LOG_TWO_OVER_TWO’ defined but not used
make: *** [test/prob/distributions_normal] Error 1
Changes:
[bea...@alum.mit.edu] updated makefile
------------------------------------------
Started by an SCM change
Updating https://stan.googlecode.com/svn/trunk
U makefile
At revision 311
[workspace] $ cmd /c call C:\Windows\TEMP\hudson4179108541323158455.bat
<http://d1m1s1b1.stat.columbia.edu:8080/job/Stan/ws/>make> test-all CC="g++-4"
g++-4 -O0 -Wall -g -DNDEBUG -std=c++0x -I src -I lib -I lib/gtest/include -I lib/gtest src/test/prob/distributions_normal_test.cpp lib/gtest/src/gtest_main.cc ar/libgtest.a -o test/prob/distributions_normal
In file included from lib/gtest/include/gtest/internal/gtest-internal.h:40:0,
from lib/gtest/include/gtest/gtest.h:57,
from src/test/prob/distributions_normal_test.cpp:2:
lib/gtest/include/gtest/internal/gtest-port.h: In function ‘int testing::internal::posix::FileNo(FILE*)’:
lib/gtest/include/gtest/internal/gtest-port.h:1589:51: error: ‘fileno’ was not declared in this scope
lib/gtest/include/gtest/internal/gtest-port.h: In function ‘char* testing::internal::posix::StrDup(const char*)’:
lib/gtest/include/gtest/internal/gtest-port.h:1595:57: error: ‘strdup’ was not declared in this scope
lib/gtest/include/gtest/internal/gtest-port.h: In function ‘FILE* testing::internal::posix::FDOpen(int, const char*)’:
lib/gtest/include/gtest/internal/gtest-port.h:1627:71: error: ‘fdopen’ was not declared in this scope
In file included from src/stan/prob/distributions_normal.hpp:12:0,
from src/test/prob/distributions_normal_test.cpp:5:
src/stan/prob/distributions_error_handling.hpp: In function ‘bool stan::prob::check_x(const char*, const std::vector<T>&, T_result*, const Policy&) [with T_x = double, T_result = double, Policy = boost::math::policies::policy<boost::math::policies::default_policy, boost::math::policies::default_policy, boost::math::policies::default_policy, boost::math::policies::default_policy, boost::math::policies::default_policy, boost::math::policies::default_policy, boost::math::policies::default_policy, boost::math::policies::default_policy, boost::math::policies::default_policy, boost::math::policies::default_policy, boost::math::policies::default_policy>]’:
src/stan/prob/distributions_normal.hpp:157:7: instantiated from ‘typename boost::math::tools::promote_args<T_y, T_loc, T_scale>::type stan::prob::normal_log(const std::vector<T_y>&, const T_loc&, const T_scale&, const Policy&) [with bool propto = false, T_y = double, T_loc = double, T_scale = double, Policy = boost::math::policies::policy<boost::math::policies::default_policy, boost::math::policies::default_policy, boost::math::policies::default_policy, boost::math::policies::default_policy, boost::math::policies::default_policy, boost::math::policies::default_policy, boost::math::policies::default_policy, boost::math::policies::default_policy, boost::math::policies::default_policy, boost::math::policies::default_policy, boost::math::policies::default_policy>, typename boost::math::tools::promote_args<T_y, T_loc, T_scale>::type = double]’
src/test/prob/distributions_normal_test.cpp:91:3: instantiated from here
src/stan/prob/distributions_error_handling.hpp:48:20: warning: comparison between signed and unsigned integer expressions
src/stan/prob/distributions_constants.hpp: At global scope:
src/stan/prob/distributions_constants.hpp:15:20: warning: ‘stan::prob::<unnamed>::LOG_ZERO’ defined but not used
src/stan/prob/distributions_constants.hpp:19:20: warning: ‘stan::prob::<unnamed>::NEG_LOG_TWO’ defined but not used
src/stan/prob/distributions_constants.hpp:23:20: warning: ‘stan::prob::<unnamed>::NEG_LOG_PI’ defined but not used
src/stan/prob/distributions_constants.hpp:25:20: warning: ‘stan::prob::<unnamed>::NEG_LOG_SQRT_PI’ defined but not used
src/stan/prob/distributions_constants.hpp:27:20: warning: ‘stan::prob::<unnamed>::NEG_LOG_TWO_OVER_TWO’ defined but not used
In file included from lib/gtest/include/gtest/internal/gtest-internal.h:40:0,
from lib/gtest/include/gtest/gtest.h:57,
from lib/gtest/src/gtest_main.cc:32:
lib/gtest/include/gtest/internal/gtest-port.h: In function ‘int testing::internal::posix::FileNo(FILE*)’:
lib/gtest/include/gtest/internal/gtest-port.h:1589:51: error: ‘fileno’ was not declared in this scope
lib/gtest/include/gtest/internal/gtest-port.h: In function ‘char* testing::internal::posix::StrDup(const char*)’:
lib/gtest/include/gtest/internal/gtest-port.h:1595:57: error: ‘strdup’ was not declared in this scope
lib/gtest/include/gtest/internal/gtest-port.h: In function ‘FILE* testing::internal::posix::FDOpen(int, const char*)’:
lib/gtest/include/gtest/internal/gtest-port.h:1627:71: error: ‘fdopen’ was not declared in this scope
Changes:
[bea...@alum.mit.edu] undoing change to makefile
------------------------------------------
Started by an SCM change
Updating https://stan.googlecode.com/svn/trunk
U makefile
At revision 312
[workspace] $ cmd /c call C:\Windows\TEMP\hudson8964224720172465063.bat
<http://d1m1s1b1.stat.columbia.edu:8080/job/Stan/ws/>make> test-all CC="g++-4"
src/stan/prob/distributions_constants.hpp: At global scope:
src/stan/prob/distributions_constants.hpp:15:20: warning: ‘stan::prob::<unnamed>::LOG_ZERO’ defined but not used
src/stan/prob/distributions_constants.hpp:19:20: warning: ‘stan::prob::<unnamed>::NEG_LOG_TWO’ defined but not used
src/stan/prob/distributions_constants.hpp:23:20: warning: ‘stan::prob::<unnamed>::NEG_LOG_PI’ defined but not used
src/stan/prob/distributions_constants.hpp:25:20: warning: ‘stan::prob::<unnamed>::NEG_LOG_SQRT_PI’ defined but not used
src/stan/prob/distributions_constants.hpp:27:20: warning: ‘stan::prob::<unnamed>::NEG_LOG_TWO_OVER_TWO’ defined but not used