Build failed in Jenkins: Stan #276

6 views
Skip to first unread message

mc.sta...@gmail.com

unread,
Jan 2, 2012, 11:55:53 PM1/2/12
to stan...@googlegroups.com
See <http://d1m1s1b1.stat.columbia.edu:8080/job/Stan/276/changes>

Changes:

[bea...@alum.mit.edu] makefile: changed target to test-all-no-fail

------------------------------------------
[...truncated 2083 lines...]

[----------] Global test environment tear-down
[==========] 2 tests from 1 test case ran. (0 ms total)
[ PASSED ] 2 tests.
================================================================================
================================================================================
g++-4 -O0 -Wall -g -DNDEBUG -I src -I lib -std=gnu++0x -I lib/gtest/include -I lib/gtest -DGTEST_HAS_PTHREAD=0 src/test/prob/distributions/poisson_test.cpp lib/gtest/src/gtest_main.cc ar/libgtest.a -o test/prob/distributions/poisson
src/stan/maths/special_functions.hpp:535:19: warning: ‘double stan::maths::log_sum_exp(const std::vector<double>&)’ defined but not used
test/prob/distributions/poisson --gtest_output="xml:test/prob/distributions/poisson.xml"
Running main() from gtest_main.cc
[==========] Running 2 tests from 1 test case.
[----------] Global test environment set-up.
[----------] 2 tests from ProbDistributions
[ RUN ] ProbDistributions.Poisson
[ OK ] ProbDistributions.Poisson (0 ms)
[ RUN ] ProbDistributions.PoissonPropto
[ OK ] ProbDistributions.PoissonPropto (0 ms)
[----------] 2 tests from ProbDistributions (0 ms total)

[----------] Global test environment tear-down
[==========] 2 tests from 1 test case ran. (0 ms total)
[ PASSED ] 2 tests.
================================================================================
================================================================================
g++-4 -O0 -Wall -g -DNDEBUG -I src -I lib -std=gnu++0x -I lib/gtest/include -I lib/gtest -DGTEST_HAS_PTHREAD=0 src/test/prob/distributions/scaled_inv_chi_square_test.cpp lib/gtest/src/gtest_main.cc ar/libgtest.a -o test/prob/distributions/scaled_inv_chi_square
src/stan/maths/special_functions.hpp:535:19: warning: ‘double stan::maths::log_sum_exp(const std::vector<double>&)’ defined but not used
test/prob/distributions/scaled_inv_chi_square --gtest_output="xml:test/prob/distributions/scaled_inv_chi_square.xml"
Running main() from gtest_main.cc
[==========] Running 1 test from 1 test case.
[----------] Global test environment set-up.
[----------] 1 test from ProbDistributions
[ RUN ] ProbDistributions.ScaledInvChiSquare
[ OK ] ProbDistributions.ScaledInvChiSquare (0 ms)
[----------] 1 test from ProbDistributions (0 ms total)

[----------] Global test environment tear-down
[==========] 1 test from 1 test case ran. (0 ms total)
[ PASSED ] 1 test.
================================================================================
================================================================================
g++-4 -O0 -Wall -g -DNDEBUG -I src -I lib -std=gnu++0x -I lib/gtest/include -I lib/gtest -DGTEST_HAS_PTHREAD=0 src/test/prob/distributions/student_t_test.cpp lib/gtest/src/gtest_main.cc ar/libgtest.a -o test/prob/distributions/student_t
src/stan/maths/special_functions.hpp:535:19: warning: ‘double stan::maths::log_sum_exp(const std::vector<double>&)’ defined but not used
test/prob/distributions/student_t --gtest_output="xml:test/prob/distributions/student_t.xml"
Running main() from gtest_main.cc
[==========] Running 2 tests from 1 test case.
[----------] Global test environment set-up.
[----------] 2 tests from ProbDistributions
[ RUN ] ProbDistributions.StudentT
[ OK ] ProbDistributions.StudentT (0 ms)
[ RUN ] ProbDistributions.StudentTPropto
[ OK ] ProbDistributions.StudentTPropto (0 ms)
[----------] 2 tests from ProbDistributions (0 ms total)

[----------] Global test environment tear-down
[==========] 2 tests from 1 test case ran. (0 ms total)
[ PASSED ] 2 tests.
================================================================================
================================================================================
g++-4 -O0 -Wall -g -DNDEBUG -I src -I lib -std=gnu++0x -I lib/gtest/include -I lib/gtest -DGTEST_HAS_PTHREAD=0 src/test/prob/distributions/uniform_test.cpp lib/gtest/src/gtest_main.cc ar/libgtest.a -o test/prob/distributions/uniform
src/stan/maths/special_functions.hpp:535:19: warning: ‘double stan::maths::log_sum_exp(const std::vector<double>&)’ defined but not used
test/prob/distributions/uniform --gtest_output="xml:test/prob/distributions/uniform.xml"
Running main() from gtest_main.cc
[==========] Running 10 tests from 1 test case.
[----------] Global test environment set-up.
[----------] 10 tests from ProbDistributionsUniform
[ RUN ] ProbDistributionsUniform.Uniform
[ OK ] ProbDistributionsUniform.Uniform (0 ms)
[ RUN ] ProbDistributionsUniform.Propto
[ OK ] ProbDistributionsUniform.Propto (0 ms)
[ RUN ] ProbDistributionsUniform.DefaultPolicyY
[ OK ] ProbDistributionsUniform.DefaultPolicyY (0 ms)
[ RUN ] ProbDistributionsUniform.DefaultPolicyLower
[ OK ] ProbDistributionsUniform.DefaultPolicyLower (0 ms)
[ RUN ] ProbDistributionsUniform.DefaultPolicyUpper
[ OK ] ProbDistributionsUniform.DefaultPolicyUpper (0 ms)
[ RUN ] ProbDistributionsUniform.DefaultPolicyBounds
[ OK ] ProbDistributionsUniform.DefaultPolicyBounds (0 ms)
[ RUN ] ProbDistributionsUniform.ErrnoPolicyBounds
[ OK ] ProbDistributionsUniform.ErrnoPolicyBounds (0 ms)
[ RUN ] ProbDistributionsUniform.ErrnoPolicyY
[ OK ] ProbDistributionsUniform.ErrnoPolicyY (0 ms)
[ RUN ] ProbDistributionsUniform.ErrnoPolicyLower
[ OK ] ProbDistributionsUniform.ErrnoPolicyLower (0 ms)
[ RUN ] ProbDistributionsUniform.ErrnoPolicyUpper
[ OK ] ProbDistributionsUniform.ErrnoPolicyUpper (0 ms)
[----------] 10 tests from ProbDistributionsUniform (0 ms total)

[----------] Global test environment tear-down
[==========] 10 tests from 1 test case ran. (0 ms total)
[ PASSED ] 10 tests.
================================================================================
================================================================================
g++-4 -O0 -Wall -g -DNDEBUG -I src -I lib -std=gnu++0x -I lib/gtest/include -I lib/gtest -DGTEST_HAS_PTHREAD=0 src/test/prob/distributions/weibull_test.cpp lib/gtest/src/gtest_main.cc ar/libgtest.a -o test/prob/distributions/weibull
src/stan/maths/special_functions.hpp:535:19: warning: ‘double stan::maths::log_sum_exp(const std::vector<double>&)’ defined but not used
test/prob/distributions/weibull --gtest_output="xml:test/prob/distributions/weibull.xml"
Running main() from gtest_main.cc
[==========] Running 4 tests from 2 test cases.
[----------] Global test environment set-up.
[----------] 2 tests from ProbDistributions
[ RUN ] ProbDistributions.Weibull
[ OK ] ProbDistributions.Weibull (0 ms)
[ RUN ] ProbDistributions.WeibullPropto
[ OK ] ProbDistributions.WeibullPropto (0 ms)
[----------] 2 tests from ProbDistributions (0 ms total)

[----------] 2 tests from ProbDistributionsCumulative
[ RUN ] ProbDistributionsCumulative.Weibull
[ OK ] ProbDistributionsCumulative.Weibull (0 ms)
[ RUN ] ProbDistributionsCumulative.WeibullPropto
[ OK ] ProbDistributionsCumulative.WeibullPropto (0 ms)
[----------] 2 tests from ProbDistributionsCumulative (0 ms total)

[----------] Global test environment tear-down
[==========] 4 tests from 2 test cases ran. (0 ms total)
[ PASSED ] 4 tests.
================================================================================
================================================================================
g++-4 -O0 -Wall -g -DNDEBUG -I src -I lib -std=gnu++0x -I lib/gtest/include -I lib/gtest -DGTEST_HAS_PTHREAD=0 src/test/prob/distributions/wishart_test.cpp lib/gtest/src/gtest_main.cc ar/libgtest.a -o test/prob/distributions/wishart
src/stan/maths/special_functions.hpp:535:19: warning: ‘double stan::maths::log_sum_exp(const std::vector<double>&)’ defined but not used
test/prob/distributions/wishart --gtest_output="xml:test/prob/distributions/wishart.xml"
Running main() from gtest_main.cc
[==========] Running 4 tests from 1 test case.
[----------] Global test environment set-up.
[----------] 4 tests from ProbDistributions
[ RUN ] ProbDistributions.Wishart2x2
[ OK ] ProbDistributions.Wishart2x2 (0 ms)
[ RUN ] ProbDistributions.Wishart4x4
[ OK ] ProbDistributions.Wishart4x4 (0 ms)
[ RUN ] ProbDistributions.Wishart2x2Propto
[ OK ] ProbDistributions.Wishart2x2Propto (0 ms)
[ RUN ] ProbDistributions.Wishart4x4Propto
[ OK ] ProbDistributions.Wishart4x4Propto (0 ms)
[----------] 4 tests from ProbDistributions (0 ms total)

[----------] Global test environment tear-down
[==========] 4 tests from 1 test case ran. (0 ms total)
[ PASSED ] 4 tests.
mkdir -p demo
g++-4 -O0 -Wall -g -DNDEBUG -I src -I lib -std=gnu++0x src/demo/gm.cpp -c -o demo/gm.o
In file included from src/demo/gm.cpp:27:0:
src/stan/gm/ast.hpp: In member function ‘stan::gm::expr_type stan::gm::function_signatures::get_result_type(const std::string&, const std::vector<stan::gm::expr_type>&)’:
src/stan/gm/ast.hpp:363:21: warning: comparison between signed and unsigned integer expressions
src/stan/gm/ast.hpp:367:29: warning: comparison between signed and unsigned integer expressions
In file included from src/demo/gm.cpp:28:0:
src/stan/gm/parser.hpp: In constructor ‘stan::gm::program_grammar<Iterator>::program_grammar()’:
src/stan/gm/parser.hpp:564:78: error: call of overloaded ‘ref(std::map<std::basic_string<char>, stan::gm::base_var_decl>&)’ is ambiguous
lib/boost/spirit/home/phoenix/core/reference.hpp:50:5: note: candidates are: const boost::phoenix::actor<boost::phoenix::reference<T> > boost::phoenix::ref(T&) [with T = std::map<std::basic_string<char>, stan::gm::base_var_decl>]
/usr/lib/gcc/i686-pc-cygwin/4.5.3/include/c++/functional:439:5: note: std::reference_wrapper<_Tp> std::ref(_Tp&) [with _Tp = std::map<std::basic_string<char>, stan::gm::base_var_decl>]
src/stan/gm/parser.hpp:565:78: error: call of overloaded ‘ref(std::map<std::basic_string<char>, stan::gm::base_var_decl>&)’ is ambiguous
lib/boost/spirit/home/phoenix/core/reference.hpp:50:5: note: candidates are: const boost::phoenix::actor<boost::phoenix::reference<T> > boost::phoenix::ref(T&) [with T = std::map<std::basic_string<char>, stan::gm::base_var_decl>]
/usr/lib/gcc/i686-pc-cygwin/4.5.3/include/c++/functional:439:5: note: std::reference_wrapper<_Tp> std::ref(_Tp&) [with _Tp = std::map<std::basic_string<char>, stan::gm::base_var_decl>]
src/stan/gm/parser.hpp:566:78: error: call of overloaded ‘ref(std::map<std::basic_string<char>, stan::gm::base_var_decl>&)’ is ambiguous
lib/boost/spirit/home/phoenix/core/reference.hpp:50:5: note: candidates are: const boost::phoenix::actor<boost::phoenix::reference<T> > boost::phoenix::ref(T&) [with T = std::map<std::basic_string<char>, stan::gm::base_var_decl>]
/usr/lib/gcc/i686-pc-cygwin/4.5.3/include/c++/functional:439:5: note: std::reference_wrapper<_Tp> std::ref(_Tp&) [with _Tp = std::map<std::basic_string<char>, stan::gm::base_var_decl>]
src/stan/gm/parser.hpp:567:78: error: call of overloaded ‘ref(std::map<std::basic_string<char>, stan::gm::base_var_decl>&)’ is ambiguous
lib/boost/spirit/home/phoenix/core/reference.hpp:50:5: note: candidates are: const boost::phoenix::actor<boost::phoenix::reference<T> > boost::phoenix::ref(T&) [with T = std::map<std::basic_string<char>, stan::gm::base_var_decl>]
/usr/lib/gcc/i686-pc-cygwin/4.5.3/include/c++/functional:439:5: note: std::reference_wrapper<_Tp> std::ref(_Tp&) [with _Tp = std::map<std::basic_string<char>, stan::gm::base_var_decl>]
src/stan/gm/parser.hpp:568:78: error: call of overloaded ‘ref(std::map<std::basic_string<char>, stan::gm::base_var_decl>&)’ is ambiguous
lib/boost/spirit/home/phoenix/core/reference.hpp:50:5: note: candidates are: const boost::phoenix::actor<boost::phoenix::reference<T> > boost::phoenix::ref(T&) [with T = std::map<std::basic_string<char>, stan::gm::base_var_decl>]
/usr/lib/gcc/i686-pc-cygwin/4.5.3/include/c++/functional:439:5: note: std::reference_wrapper<_Tp> std::ref(_Tp&) [with _Tp = std::map<std::basic_string<char>, stan::gm::base_var_decl>]
src/stan/gm/parser.hpp:569:78: error: call of overloaded ‘ref(std::map<std::basic_string<char>, stan::gm::base_var_decl>&)’ is ambiguous
lib/boost/spirit/home/phoenix/core/reference.hpp:50:5: note: candidates are: const boost::phoenix::actor<boost::phoenix::reference<T> > boost::phoenix::ref(T&) [with T = std::map<std::basic_string<char>, stan::gm::base_var_decl>]
/usr/lib/gcc/i686-pc-cygwin/4.5.3/include/c++/functional:439:5: note: std::reference_wrapper<_Tp> std::ref(_Tp&) [with _Tp = std::map<std::basic_string<char>, stan::gm::base_var_decl>]
src/stan/gm/parser.hpp:570:78: error: call of overloaded ‘ref(std::map<std::basic_string<char>, stan::gm::base_var_decl>&)’ is ambiguous
lib/boost/spirit/home/phoenix/core/reference.hpp:50:5: note: candidates are: const boost::phoenix::actor<boost::phoenix::reference<T> > boost::phoenix::ref(T&) [with T = std::map<std::basic_string<char>, stan::gm::base_var_decl>]
/usr/lib/gcc/i686-pc-cygwin/4.5.3/include/c++/functional:439:5: note: std::reference_wrapper<_Tp> std::ref(_Tp&) [with _Tp = std::map<std::basic_string<char>, stan::gm::base_var_decl>]
src/stan/gm/parser.hpp:571:78: error: call of overloaded ‘ref(std::map<std::basic_string<char>, stan::gm::base_var_decl>&)’ is ambiguous
lib/boost/spirit/home/phoenix/core/reference.hpp:50:5: note: candidates are: const boost::phoenix::actor<boost::phoenix::reference<T> > boost::phoenix::ref(T&) [with T = std::map<std::basic_string<char>, stan::gm::base_var_decl>]
/usr/lib/gcc/i686-pc-cygwin/4.5.3/include/c++/functional:439:5: note: std::reference_wrapper<_Tp> std::ref(_Tp&) [with _Tp = std::map<std::basic_string<char>, stan::gm::base_var_decl>]
src/stan/gm/parser.hpp:572:78: error: call of overloaded ‘ref(std::map<std::basic_string<char>, stan::gm::base_var_decl>&)’ is ambiguous
lib/boost/spirit/home/phoenix/core/reference.hpp:50:5: note: candidates are: const boost::phoenix::actor<boost::phoenix::reference<T> > boost::phoenix::ref(T&) [with T = std::map<std::basic_string<char>, stan::gm::base_var_decl>]
/usr/lib/gcc/i686-pc-cygwin/4.5.3/include/c++/functional:439:5: note: std::reference_wrapper<_Tp> std::ref(_Tp&) [with _Tp = std::map<std::basic_string<char>, stan::gm::base_var_decl>]
src/stan/gm/parser.hpp:574:77: error: call of overloaded ‘ref(std::stringstream&)’ is ambiguous
lib/boost/spirit/home/phoenix/core/reference.hpp:50:5: note: candidates are: const boost::phoenix::actor<boost::phoenix::reference<T> > boost::phoenix::ref(T&) [with T = std::basic_stringstream<char>]
/usr/lib/gcc/i686-pc-cygwin/4.5.3/include/c++/functional:439:5: note: std::reference_wrapper<_Tp> std::ref(_Tp&) [with _Tp = std::basic_stringstream<char>]
src/stan/gm/parser.hpp:597:66: error: call of overloaded ‘ref(std::stringstream&)’ is ambiguous
lib/boost/spirit/home/phoenix/core/reference.hpp:50:5: note: candidates are: const boost::phoenix::actor<boost::phoenix::reference<T> > boost::phoenix::ref(T&) [with T = std::basic_stringstream<char>]
/usr/lib/gcc/i686-pc-cygwin/4.5.3/include/c++/functional:439:5: note: std::reference_wrapper<_Tp> std::ref(_Tp&) [with _Tp = std::basic_stringstream<char>]
src/stan/gm/parser.hpp:607:66: error: call of overloaded ‘ref(std::stringstream&)’ is ambiguous
lib/boost/spirit/home/phoenix/core/reference.hpp:50:5: note: candidates are: const boost::phoenix::actor<boost::phoenix::reference<T> > boost::phoenix::ref(T&) [with T = std::basic_stringstream<char>]
/usr/lib/gcc/i686-pc-cygwin/4.5.3/include/c++/functional:439:5: note: std::reference_wrapper<_Tp> std::ref(_Tp&) [with _Tp = std::basic_stringstream<char>]
src/stan/gm/parser.hpp:617:66: error: call of overloaded ‘ref(std::stringstream&)’ is ambiguous
lib/boost/spirit/home/phoenix/core/reference.hpp:50:5: note: candidates are: const boost::phoenix::actor<boost::phoenix::reference<T> > boost::phoenix::ref(T&) [with T = std::basic_stringstream<char>]
/usr/lib/gcc/i686-pc-cygwin/4.5.3/include/c++/functional:439:5: note: std::reference_wrapper<_Tp> std::ref(_Tp&) [with _Tp = std::basic_stringstream<char>]
src/stan/gm/parser.hpp:619:66: error: call of overloaded ‘ref(std::stringstream&)’ is ambiguous
lib/boost/spirit/home/phoenix/core/reference.hpp:50:5: note: candidates are: const boost::phoenix::actor<boost::phoenix::reference<T> > boost::phoenix::ref(T&) [with T = std::basic_stringstream<char>]
/usr/lib/gcc/i686-pc-cygwin/4.5.3/include/c++/functional:439:5: note: std::reference_wrapper<_Tp> std::ref(_Tp&) [with _Tp = std::basic_stringstream<char>]
src/stan/gm/parser.hpp:629:66: error: call of overloaded ‘ref(std::stringstream&)’ is ambiguous
lib/boost/spirit/home/phoenix/core/reference.hpp:50:5: note: candidates are: const boost::phoenix::actor<boost::phoenix::reference<T> > boost::phoenix::ref(T&) [with T = std::basic_stringstream<char>]
/usr/lib/gcc/i686-pc-cygwin/4.5.3/include/c++/functional:439:5: note: std::reference_wrapper<_Tp> std::ref(_Tp&) [with _Tp = std::basic_stringstream<char>]
src/stan/gm/parser.hpp:639:66: error: call of overloaded ‘ref(std::stringstream&)’ is ambiguous
lib/boost/spirit/home/phoenix/core/reference.hpp:50:5: note: candidates are: const boost::phoenix::actor<boost::phoenix::reference<T> > boost::phoenix::ref(T&) [with T = std::basic_stringstream<char>]
/usr/lib/gcc/i686-pc-cygwin/4.5.3/include/c++/functional:439:5: note: std::reference_wrapper<_Tp> std::ref(_Tp&) [with _Tp = std::basic_stringstream<char>]
src/stan/gm/parser.hpp:649:66: error: call of overloaded ‘ref(std::stringstream&)’ is ambiguous
lib/boost/spirit/home/phoenix/core/reference.hpp:50:5: note: candidates are: const boost::phoenix::actor<boost::phoenix::reference<T> > boost::phoenix::ref(T&) [with T = std::basic_stringstream<char>]
/usr/lib/gcc/i686-pc-cygwin/4.5.3/include/c++/functional:439:5: note: std::reference_wrapper<_Tp> std::ref(_Tp&) [with _Tp = std::basic_stringstream<char>]
src/stan/gm/parser.hpp:659:66: error: call of overloaded ‘ref(std::stringstream&)’ is ambiguous
lib/boost/spirit/home/phoenix/core/reference.hpp:50:5: note: candidates are: const boost::phoenix::actor<boost::phoenix::reference<T> > boost::phoenix::ref(T&) [with T = std::basic_stringstream<char>]
/usr/lib/gcc/i686-pc-cygwin/4.5.3/include/c++/functional:439:5: note: std::reference_wrapper<_Tp> std::ref(_Tp&) [with _Tp = std::basic_stringstream<char>]
src/stan/gm/parser.hpp:700:73: error: call of overloaded ‘ref(std::map<std::basic_string<char>, stan::gm::base_var_decl>&)’ is ambiguous
lib/boost/spirit/home/phoenix/core/reference.hpp:50:5: note: candidates are: const boost::phoenix::actor<boost::phoenix::reference<T> > boost::phoenix::ref(T&) [with T = std::map<std::basic_string<char>, stan::gm::base_var_decl>]
/usr/lib/gcc/i686-pc-cygwin/4.5.3/include/c++/functional:439:5: note: std::reference_wrapper<_Tp> std::ref(_Tp&) [with _Tp = std::map<std::basic_string<char>, stan::gm::base_var_decl>]
src/stan/gm/parser.hpp:735:67: error: call of overloaded ‘ref(std::stringstream&)’ is ambiguous
lib/boost/spirit/home/phoenix/core/reference.hpp:50:5: note: candidates are: const boost::phoenix::actor<boost::phoenix::reference<T> > boost::phoenix::ref(T&) [with T = std::basic_stringstream<char>]
/usr/lib/gcc/i686-pc-cygwin/4.5.3/include/c++/functional:439:5: note: std::reference_wrapper<_Tp> std::ref(_Tp&) [with _Tp = std::basic_stringstream<char>]
src/stan/gm/parser.hpp:742:67: error: call of overloaded ‘ref(std::stringstream&)’ is ambiguous
lib/boost/spirit/home/phoenix/core/reference.hpp:50:5: note: candidates are: const boost::phoenix::actor<boost::phoenix::reference<T> > boost::phoenix::ref(T&) [with T = std::basic_stringstream<char>]
/usr/lib/gcc/i686-pc-cygwin/4.5.3/include/c++/functional:439:5: note: std::reference_wrapper<_Tp> std::ref(_Tp&) [with _Tp = std::basic_stringstream<char>]
src/stan/gm/parser.hpp:744:67: error: call of overloaded ‘ref(std::stringstream&)’ is ambiguous
lib/boost/spirit/home/phoenix/core/reference.hpp:50:5: note: candidates are: const boost::phoenix::actor<boost::phoenix::reference<T> > boost::phoenix::ref(T&) [with T = std::basic_stringstream<char>]
/usr/lib/gcc/i686-pc-cygwin/4.5.3/include/c++/functional:439:5: note: std::reference_wrapper<_Tp> std::ref(_Tp&) [with _Tp = std::basic_stringstream<char>]
src/stan/gm/parser.hpp:758:68: error: call of overloaded ‘ref(std::stringstream&)’ is ambiguous
lib/boost/spirit/home/phoenix/core/reference.hpp:50:5: note: candidates are: const boost::phoenix::actor<boost::phoenix::reference<T> > boost::phoenix::ref(T&) [with T = std::basic_stringstream<char>]
/usr/lib/gcc/i686-pc-cygwin/4.5.3/include/c++/functional:439:5: note: std::reference_wrapper<_Tp> std::ref(_Tp&) [with _Tp = std::basic_stringstream<char>]
src/stan/gm/parser.hpp:760:68: error: call of overloaded ‘ref(std::stringstream&)’ is ambiguous
lib/boost/spirit/home/phoenix/core/reference.hpp:50:5: note: candidates are: const boost::phoenix::actor<boost::phoenix::reference<T> > boost::phoenix::ref(T&) [with T = std::basic_stringstream<char>]
/usr/lib/gcc/i686-pc-cygwin/4.5.3/include/c++/functional:439:5: note: std::reference_wrapper<_Tp> std::ref(_Tp&) [with _Tp = std::basic_stringstream<char>]
src/stan/gm/parser.hpp:766:71: error: call of overloaded ‘ref(std::stringstream&)’ is ambiguous
lib/boost/spirit/home/phoenix/core/reference.hpp:50:5: note: candidates are: const boost::phoenix::actor<boost::phoenix::reference<T> > boost::phoenix::ref(T&) [with T = std::basic_stringstream<char>]
/usr/lib/gcc/i686-pc-cygwin/4.5.3/include/c++/functional:439:5: note: std::reference_wrapper<_Tp> std::ref(_Tp&) [with _Tp = std::basic_stringstream<char>]
src/stan/gm/parser.hpp:768:71: error: call of overloaded ‘ref(std::stringstream&)’ is ambiguous
lib/boost/spirit/home/phoenix/core/reference.hpp:50:5: note: candidates are: const boost::phoenix::actor<boost::phoenix::reference<T> > boost::phoenix::ref(T&) [with T = std::basic_stringstream<char>]
/usr/lib/gcc/i686-pc-cygwin/4.5.3/include/c++/functional:439:5: note: std::reference_wrapper<_Tp> std::ref(_Tp&) [with _Tp = std::basic_stringstream<char>]
src/stan/gm/parser.hpp:794:65: error: call of overloaded ‘ref(std::stringstream&)’ is ambiguous
lib/boost/spirit/home/phoenix/core/reference.hpp:50:5: note: candidates are: const boost::phoenix::actor<boost::phoenix::reference<T> > boost::phoenix::ref(T&) [with T = std::basic_stringstream<char>]
/usr/lib/gcc/i686-pc-cygwin/4.5.3/include/c++/functional:439:5: note: std::reference_wrapper<_Tp> std::ref(_Tp&) [with _Tp = std::basic_stringstream<char>]
src/stan/gm/parser.hpp:819:54: error: call of overloaded ‘ref(std::map<std::basic_string<char>, stan::gm::base_var_decl>&)’ is ambiguous
lib/boost/spirit/home/phoenix/core/reference.hpp:50:5: note: candidates are: const boost::phoenix::actor<boost::phoenix::reference<T> > boost::phoenix::ref(T&) [with T = std::map<std::basic_string<char>, stan::gm::base_var_decl>]
/usr/lib/gcc/i686-pc-cygwin/4.5.3/include/c++/functional:439:5: note: std::reference_wrapper<_Tp> std::ref(_Tp&) [with _Tp = std::map<std::basic_string<char>, stan::gm::base_var_decl>]
src/stan/gm/parser.hpp:820:24: error: call of overloaded ‘ref(std::stringstream&)’ is ambiguous
lib/boost/spirit/home/phoenix/core/reference.hpp:50:5: note: candidates are: const boost::phoenix::actor<boost::phoenix::reference<T> > boost::phoenix::ref(T&) [with T = std::basic_stringstream<char>]
/usr/lib/gcc/i686-pc-cygwin/4.5.3/include/c++/functional:439:5: note: std::reference_wrapper<_Tp> std::ref(_Tp&) [with _Tp = std::basic_stringstream<char>]
src/stan/gm/parser.hpp:835:30: error: call of overloaded ‘ref(std::map<std::basic_string<char>, stan::gm::base_var_decl>&)’ is ambiguous
lib/boost/spirit/home/phoenix/core/reference.hpp:50:5: note: candidates are: const boost::phoenix::actor<boost::phoenix::reference<T> > boost::phoenix::ref(T&) [with T = std::map<std::basic_string<char>, stan::gm::base_var_decl>]
/usr/lib/gcc/i686-pc-cygwin/4.5.3/include/c++/functional:439:5: note: std::reference_wrapper<_Tp> std::ref(_Tp&) [with _Tp = std::map<std::basic_string<char>, stan::gm::base_var_decl>]
src/stan/gm/parser.hpp:836:24: error: call of overloaded ‘ref(std::stringstream&)’ is ambiguous
lib/boost/spirit/home/phoenix/core/reference.hpp:50:5: note: candidates are: const boost::phoenix::actor<boost::phoenix::reference<T> > boost::phoenix::ref(T&) [with T = std::basic_stringstream<char>]
/usr/lib/gcc/i686-pc-cygwin/4.5.3/include/c++/functional:439:5: note: std::reference_wrapper<_Tp> std::ref(_Tp&) [with _Tp = std::basic_stringstream<char>]
src/stan/gm/parser.hpp:841:64: error: call of overloaded ‘ref(std::map<std::basic_string<char>, stan::gm::base_var_decl>&)’ is ambiguous
lib/boost/spirit/home/phoenix/core/reference.hpp:50:5: note: candidates are: const boost::phoenix::actor<boost::phoenix::reference<T> > boost::phoenix::ref(T&) [with T = std::map<std::basic_string<char>, stan::gm::base_var_decl>]
/usr/lib/gcc/i686-pc-cygwin/4.5.3/include/c++/functional:439:5: note: std::reference_wrapper<_Tp> std::ref(_Tp&) [with _Tp = std::map<std::basic_string<char>, stan::gm::base_var_decl>]
g++-4 -O0 -Wall -g -DNDEBUG -I src -I lib -std=gnu++0x demo/gm.o -o demo/gm
/usr/lib/gcc/i686-pc-cygwin/4.5.3/../../../libcygwin.a(libcmain.o):(.text+0xa9): undefined reference to `_WinMain@16'
collect2: ld returned 1 exit status
make: *** [demo/gm] Error 1

<http://d1m1s1b1.stat.columbia.edu:8080/job/Stan/ws/>exit> 2
Build step 'Execute Windows batch command' marked build as failure
Recording test results

mc.sta...@gmail.com

unread,
Jan 3, 2012, 2:23:57 AM1/3/12
to stan...@googlegroups.com
See <http://d1m1s1b1.stat.columbia.edu:8080/job/Stan/277/changes>

Changes:

[ca...@alias-i.com] putting back makefile with clang specified

[ca...@alias-i.com] requalified boost::phoenix::ref in parser

------------------------------------------
[...truncated 1877 lines...]
[ RUN ] ProbDistributions.Multinomial
[ OK ] ProbDistributions.Multinomial (0 ms)
[ RUN ] ProbDistributions.MultinomialPropto
[ OK ] ProbDistributions.MultinomialPropto (0 ms)


[----------] 2 tests from ProbDistributions (0 ms total)

[----------] Global test environment tear-down
[==========] 2 tests from 1 test case ran. (0 ms total)
[ PASSED ] 2 tests.
================================================================================
================================================================================

g++-4 -O0 -Wall -g -DNDEBUG -I src -I lib -std=gnu++0x -I lib/gtest/include -I lib/gtest -DGTEST_HAS_PTHREAD=0 src/test/prob/distributions/neg_binomial_test.cpp lib/gtest/src/gtest_main.cc ar/libgtest.a -o test/prob/distributions/neg_binomial


src/stan/maths/special_functions.hpp:535:19: warning: ‘double stan::maths::log_sum_exp(const std::vector<double>&)’ defined but not used

test/prob/distributions/neg_binomial --gtest_output="xml:test/prob/distributions/neg_binomial.xml"


Running main() from gtest_main.cc
[==========] Running 2 tests from 1 test case.
[----------] Global test environment set-up.
[----------] 2 tests from ProbDistributions

[ RUN ] ProbDistributions.NegBinomial
[ OK ] ProbDistributions.NegBinomial (0 ms)
[ RUN ] ProbDistributions.NegBinomialPropto
[ OK ] ProbDistributions.NegBinomialPropto (0 ms)


[----------] 2 tests from ProbDistributions (0 ms total)

[----------] Global test environment tear-down
[==========] 2 tests from 1 test case ran. (0 ms total)
[ PASSED ] 2 tests.
================================================================================
================================================================================

g++-4 -O0 -Wall -g -DNDEBUG -I src -I lib -std=gnu++0x -I lib/gtest/include -I lib/gtest -DGTEST_HAS_PTHREAD=0 src/test/prob/distributions/normal_test.cpp lib/gtest/src/gtest_main.cc ar/libgtest.a -o test/prob/distributions/normal
In file included from src/stan/prob/distributions/normal.hpp:5:0,
from src/test/prob/distributions/normal_test.cpp:2:
src/stan/prob/error_handling.hpp: In function ‘bool stan::prob::check_x(const char*, const std::vector<T>&, T_result*, const Policy&) [with T_x = double, T_result = double, Policy = boost::math::policies::policy<boost::math::policies::default_policy, boost::math::policies::default_policy, boost::math::policies::default_policy, boost::math::policies::default_policy, boost::math::policies::default_policy, boost::math::policies::default_policy, boost::math::policies::default_policy, boost::math::policies::default_policy, boost::math::policies::default_policy, boost::math::policies::default_policy, boost::math::policies::default_policy>]’:
src/stan/prob/distributions/normal.hpp:155:7: instantiated from ‘typename boost::math::tools::promote_args<T_y, T_loc, T_scale>::type stan::prob::normal_log(const std::vector<T_y>&, const T_loc&, const T_scale&, const Policy&) [with bool propto = false, T_y = double, T_loc = double, T_scale = double, Policy = boost::math::policies::policy<boost::math::policies::default_policy, boost::math::policies::default_policy, boost::math::policies::default_policy, boost::math::policies::default_policy, boost::math::policies::default_policy, boost::math::policies::default_policy, boost::math::policies::default_policy, boost::math::policies::default_policy, boost::math::policies::default_policy, boost::math::policies::default_policy, boost::math::policies::default_policy>, typename boost::math::tools::promote_args<T_y, T_loc, T_scale>::type = double]’
src/test/prob/distributions/normal_test.cpp:122:3: instantiated from here
src/stan/prob/error_handling.hpp:46:20: warning: comparison between signed and unsigned integer expressions
src/stan/prob/error_handling.hpp: In function ‘bool stan::prob::check_x(const char*, const std::vector<T>&, T_result*, const Policy&) [with T_x = double, T_result = double, Policy = boost::math::policies::policy<boost::math::policies::domain_error<(boost::math::policies::error_policy_type)1u>, boost::math::policies::pole_error<(boost::math::policies::error_policy_type)1u>, boost::math::policies::overflow_error<(boost::math::policies::error_policy_type)1u>, boost::math::policies::evaluation_error<(boost::math::policies::error_policy_type)1u> >]’:
src/stan/prob/distributions/normal.hpp:155:7: instantiated from ‘typename boost::math::tools::promote_args<T_y, T_loc, T_scale>::type stan::prob::normal_log(const std::vector<T_y>&, const T_loc&, const T_scale&, const Policy&) [with bool propto = false, T_y = double, T_loc = double, T_scale = double, Policy = boost::math::policies::policy<boost::math::policies::domain_error<(boost::math::policies::error_policy_type)1u>, boost::math::policies::pole_error<(boost::math::policies::error_policy_type)1u>, boost::math::policies::overflow_error<(boost::math::policies::error_policy_type)1u>, boost::math::policies::evaluation_error<(boost::math::policies::error_policy_type)1u> >, typename boost::math::tools::promote_args<T_y, T_loc, T_scale>::type = double]’
src/test/prob/distributions/normal_test.cpp:167:66: instantiated from here
src/stan/prob/error_handling.hpp:46:20: warning: comparison between signed and unsigned integer expressions
src/stan/maths/special_functions.hpp: At global scope:


src/stan/maths/special_functions.hpp:535:19: warning: ‘double stan::maths::log_sum_exp(const std::vector<double>&)’ defined but not used

test/prob/distributions/normal --gtest_output="xml:test/prob/distributions/normal.xml"
Running main() from gtest_main.cc
[==========] Running 18 tests from 1 test case.


[----------] Global test environment set-up.

[----------] 18 tests from ProbDistributionsNormal
[ RUN ] ProbDistributionsNormal.Normal
[ OK ] ProbDistributionsNormal.Normal (0 ms)
[ RUN ] ProbDistributionsNormal.DefaultPolicyScale
[ OK ] ProbDistributionsNormal.DefaultPolicyScale (0 ms)
[ RUN ] ProbDistributionsNormal.ErrnoPolicyScale
[ OK ] ProbDistributionsNormal.ErrnoPolicyScale (0 ms)
[ RUN ] ProbDistributionsNormal.DefaultPolicyY
[ OK ] ProbDistributionsNormal.DefaultPolicyY (0 ms)
[ RUN ] ProbDistributionsNormal.ErrnoPolicyY
[ OK ] ProbDistributionsNormal.ErrnoPolicyY (0 ms)
[ RUN ] ProbDistributionsNormal.DefaultPolicyLocation
[ OK ] ProbDistributionsNormal.DefaultPolicyLocation (0 ms)
[ RUN ] ProbDistributionsNormal.ErrnoPolicyLocation
[ OK ] ProbDistributionsNormal.ErrnoPolicyLocation (0 ms)
[ RUN ] ProbDistributionsNormal.Propto
[ OK ] ProbDistributionsNormal.Propto (0 ms)
[ RUN ] ProbDistributionsNormal.Cumulative
[ OK ] ProbDistributionsNormal.Cumulative (0 ms)
[ RUN ] ProbDistributionsNormal.CumulativeDefaultPolicySigma
[ OK ] ProbDistributionsNormal.CumulativeDefaultPolicySigma (0 ms)
[ RUN ] ProbDistributionsNormal.NormalVector
[ OK ] ProbDistributionsNormal.NormalVector (0 ms)
[ RUN ] ProbDistributionsNormal.ProptoVector
[ OK ] ProbDistributionsNormal.ProptoVector (0 ms)
[ RUN ] ProbDistributionsNormal.DefaultPolicyVectorScale
[ OK ] ProbDistributionsNormal.DefaultPolicyVectorScale (0 ms)
[ RUN ] ProbDistributionsNormal.ErrnoPolicyNormalVectorScale
[ OK ] ProbDistributionsNormal.ErrnoPolicyNormalVectorScale (0 ms)
[ RUN ] ProbDistributionsNormal.DefaultPolicyNormalVectorY
[ OK ] ProbDistributionsNormal.DefaultPolicyNormalVectorY (0 ms)
[ RUN ] ProbDistributionsNormal.ErrnoPolicyNormalVectorY
[ OK ] ProbDistributionsNormal.ErrnoPolicyNormalVectorY (0 ms)
[ RUN ] ProbDistributionsNormal.DefaultPolicyNormalVectorLocation
[ OK ] ProbDistributionsNormal.DefaultPolicyNormalVectorLocation (0 ms)
[ RUN ] ProbDistributionsNormal.ErrnoPolicyNormalVectorLocation
[ OK ] ProbDistributionsNormal.ErrnoPolicyNormalVectorLocation (0 ms)
[----------] 18 tests from ProbDistributionsNormal (0 ms total)

[----------] Global test environment tear-down

[==========] 18 tests from 1 test case ran. (0 ms total)
[ PASSED ] 18 tests.
================================================================================
================================================================================
g++-4 -O0 -Wall -g -DNDEBUG -I src -I lib -std=gnu++0x -I lib/gtest/include -I lib/gtest -DGTEST_HAS_PTHREAD=0 src/test/prob/distributions/pareto_test.cpp lib/gtest/src/gtest_main.cc ar/libgtest.a -o test/prob/distributions/pareto


src/stan/maths/special_functions.hpp:535:19: warning: ‘double stan::maths::log_sum_exp(const std::vector<double>&)’ defined but not used

test/prob/distributions/pareto --gtest_output="xml:test/prob/distributions/pareto.xml"


Running main() from gtest_main.cc
[==========] Running 2 tests from 1 test case.
[----------] Global test environment set-up.
[----------] 2 tests from ProbDistributions

[ RUN ] ProbDistributions.Pareto
[ OK ] ProbDistributions.Pareto (0 ms)
[ RUN ] ProbDistributions.ParetoPropto
[ OK ] ProbDistributions.ParetoPropto (0 ms)

mc.sta...@gmail.com

unread,
Jan 3, 2012, 2:40:59 AM1/3/12
to stan...@googlegroups.com
See <http://d1m1s1b1.stat.columbia.edu:8080/job/Stan/278/changes>

Changes:

[ca...@alias-i.com] fixed signed/unsigned bug in ast

------------------------------------------
[...truncated 1875 lines...]

mc.sta...@gmail.com

unread,
Jan 3, 2012, 12:37:57 PM1/3/12
to stan...@googlegroups.com
See <http://d1m1s1b1.stat.columbia.edu:8080/job/Stan/279/changes>

Changes:

[ca...@alias-i.com] added sum over std::vector declaration

------------------------------------------
[...truncated 1878 lines...]

[ OK ] ProbDistributionsNormal.DefaultPolicyNormalVectorLocation (15 ms)


[ RUN ] ProbDistributionsNormal.ErrnoPolicyNormalVectorLocation
[ OK ] ProbDistributionsNormal.ErrnoPolicyNormalVectorLocation (0 ms)

[----------] 18 tests from ProbDistributionsNormal (15 ms total)

[----------] Global test environment tear-down

[==========] 18 tests from 1 test case ran. (15 ms total)

mc.sta...@gmail.com

unread,
Jan 3, 2012, 4:12:59 PM1/3/12
to stan...@googlegroups.com
See <http://d1m1s1b1.stat.columbia.edu:8080/job/Stan/280/changes>

Changes:

[guo...@gmail.com] vol 2 example cervix (not work not only because of discrete parameters)

------------------------------------------
[...truncated 1879 lines...]

[ OK ] ProbDistributionsNormal.DefaultPolicyNormalVectorLocation (0 ms)


[ RUN ] ProbDistributionsNormal.ErrnoPolicyNormalVectorLocation
[ OK ] ProbDistributionsNormal.ErrnoPolicyNormalVectorLocation (0 ms)

[----------] 18 tests from ProbDistributionsNormal (0 ms total)

[----------] Global test environment tear-down

[==========] 18 tests from 1 test case ran. (0 ms total)

mc.sta...@gmail.com

unread,
Jan 3, 2012, 7:00:57 PM1/3/12
to stan...@googlegroups.com
See <http://d1m1s1b1.stat.columbia.edu:8080/job/Stan/281/changes>

Changes:

[bea...@alum.mit.edu] distributions: wishart

------------------------------------------
[...truncated 1876 lines...]

mc.sta...@gmail.com

unread,
Jan 4, 2012, 12:47:49 AM1/4/12
to stan...@googlegroups.com
See <http://d1m1s1b1.stat.columbia.edu:8080/job/Stan/282/changes>

Changes:

[thomas....@gmail.com] vol 1 lsat example working

------------------------------------------
[...truncated 1878 lines...]

mc.sta...@gmail.com

unread,
Jan 4, 2012, 1:36:09 PM1/4/12
to stan...@googlegroups.com
See <http://d1m1s1b1.stat.columbia.edu:8080/job/Stan/283/changes>

Changes:

[bea...@alum.mit.edu] distributions: inv_wishart

------------------------------------------
[...truncated 1885 lines...]

mc.sta...@gmail.com

unread,
Jan 4, 2012, 2:33:21 PM1/4/12
to stan...@googlegroups.com
See <http://d1m1s1b1.stat.columbia.edu:8080/job/Stan/284/changes>

Changes:

[bea...@alum.mit.edu] distributions: student_t

------------------------------------------
[...truncated 1929 lines...]

mc.sta...@gmail.com

unread,
Jan 4, 2012, 2:41:23 PM1/4/12
to stan...@googlegroups.com
See <http://d1m1s1b1.stat.columbia.edu:8080/job/Stan/285/changes>

Changes:

[bea...@alum.mit.edu] distributions: beta

------------------------------------------
[...truncated 1957 lines...]

mc.sta...@gmail.com

unread,
Jan 4, 2012, 3:01:38 PM1/4/12
to stan...@googlegroups.com
See <http://d1m1s1b1.stat.columbia.edu:8080/job/Stan/286/changes>

Changes:

[bea...@alum.mit.edu] distributions: cauchy

[ OK ] ProbDistributionsNormal.DefaultPolicyLocation (1 ms)


[ RUN ] ProbDistributionsNormal.ErrnoPolicyLocation
[ OK ] ProbDistributionsNormal.ErrnoPolicyLocation (0 ms)
[ RUN ] ProbDistributionsNormal.Propto
[ OK ] ProbDistributionsNormal.Propto (0 ms)
[ RUN ] ProbDistributionsNormal.Cumulative
[ OK ] ProbDistributionsNormal.Cumulative (0 ms)
[ RUN ] ProbDistributionsNormal.CumulativeDefaultPolicySigma
[ OK ] ProbDistributionsNormal.CumulativeDefaultPolicySigma (0 ms)
[ RUN ] ProbDistributionsNormal.NormalVector
[ OK ] ProbDistributionsNormal.NormalVector (0 ms)
[ RUN ] ProbDistributionsNormal.ProptoVector
[ OK ] ProbDistributionsNormal.ProptoVector (0 ms)
[ RUN ] ProbDistributionsNormal.DefaultPolicyVectorScale
[ OK ] ProbDistributionsNormal.DefaultPolicyVectorScale (0 ms)
[ RUN ] ProbDistributionsNormal.ErrnoPolicyNormalVectorScale
[ OK ] ProbDistributionsNormal.ErrnoPolicyNormalVectorScale (0 ms)
[ RUN ] ProbDistributionsNormal.DefaultPolicyNormalVectorY
[ OK ] ProbDistributionsNormal.DefaultPolicyNormalVectorY (0 ms)
[ RUN ] ProbDistributionsNormal.ErrnoPolicyNormalVectorY
[ OK ] ProbDistributionsNormal.ErrnoPolicyNormalVectorY (0 ms)
[ RUN ] ProbDistributionsNormal.DefaultPolicyNormalVectorLocation
[ OK ] ProbDistributionsNormal.DefaultPolicyNormalVectorLocation (0 ms)
[ RUN ] ProbDistributionsNormal.ErrnoPolicyNormalVectorLocation
[ OK ] ProbDistributionsNormal.ErrnoPolicyNormalVectorLocation (0 ms)

[----------] 18 tests from ProbDistributionsNormal (2 ms total)

[----------] Global test environment tear-down

[==========] 18 tests from 1 test case ran. (2 ms total)

[ OK ] ProbDistributions.StudentT (1 ms)


[ RUN ] ProbDistributions.StudentTPropto
[ OK ] ProbDistributions.StudentTPropto (0 ms)

[----------] 2 tests from ProbDistributions (1 ms total)

[----------] Global test environment tear-down

[==========] 2 tests from 1 test case ran. (1 ms total)


[ PASSED ] 2 tests.
================================================================================
================================================================================
g++-4 -O0 -Wall -g -DNDEBUG -I src -I lib -std=gnu++0x -I lib/gtest/include -I lib/gtest -DGTEST_HAS_PTHREAD=0 src/test/prob/distributions/uniform_test.cpp lib/gtest/src/gtest_main.cc ar/libgtest.a -o test/prob/distributions/uniform
src/stan/maths/special_functions.hpp:535:19: warning: ‘double stan::maths::log_sum_exp(const std::vector<double>&)’ defined but not used
test/prob/distributions/uniform --gtest_output="xml:test/prob/distributions/uniform.xml"
Running main() from gtest_main.cc
[==========] Running 10 tests from 1 test case.
[----------] Global test environment set-up.
[----------] 10 tests from ProbDistributionsUniform
[ RUN ] ProbDistributionsUniform.Uniform
[ OK ] ProbDistributionsUniform.Uniform (0 ms)
[ RUN ] ProbDistributionsUniform.Propto
[ OK ] ProbDistributionsUniform.Propto (0 ms)
[ RUN ] ProbDistributionsUniform.DefaultPolicyY

[ OK ] ProbDistributionsUniform.DefaultPolicyY (1 ms)


[ RUN ] ProbDistributionsUniform.DefaultPolicyLower
[ OK ] ProbDistributionsUniform.DefaultPolicyLower (0 ms)
[ RUN ] ProbDistributionsUniform.DefaultPolicyUpper
[ OK ] ProbDistributionsUniform.DefaultPolicyUpper (0 ms)
[ RUN ] ProbDistributionsUniform.DefaultPolicyBounds

[ OK ] ProbDistributionsUniform.DefaultPolicyBounds (1 ms)


[ RUN ] ProbDistributionsUniform.ErrnoPolicyBounds
[ OK ] ProbDistributionsUniform.ErrnoPolicyBounds (0 ms)
[ RUN ] ProbDistributionsUniform.ErrnoPolicyY
[ OK ] ProbDistributionsUniform.ErrnoPolicyY (0 ms)
[ RUN ] ProbDistributionsUniform.ErrnoPolicyLower
[ OK ] ProbDistributionsUniform.ErrnoPolicyLower (0 ms)
[ RUN ] ProbDistributionsUniform.ErrnoPolicyUpper
[ OK ] ProbDistributionsUniform.ErrnoPolicyUpper (0 ms)

[----------] 10 tests from ProbDistributionsUniform (2 ms total)

[----------] Global test environment tear-down

[==========] 10 tests from 1 test case ran. (2 ms total)

[ OK ] ProbDistributions.Wishart4x4 (1 ms)


[ RUN ] ProbDistributions.Wishart2x2Propto
[ OK ] ProbDistributions.Wishart2x2Propto (0 ms)
[ RUN ] ProbDistributions.Wishart4x4Propto
[ OK ] ProbDistributions.Wishart4x4Propto (0 ms)

[----------] 4 tests from ProbDistributions (1 ms total)

[----------] Global test environment tear-down

[==========] 4 tests from 1 test case ran. (1 ms total)

mc.sta...@gmail.com

unread,
Jan 4, 2012, 4:41:34 PM1/4/12
to stan...@googlegroups.com
See <http://d1m1s1b1.stat.columbia.edu:8080/job/Stan/287/changes>

Changes:

[ca...@alias-i.com] updated triangle, reverted some ast, generator still missing model statements

------------------------------------------
[...truncated 1958 lines...]

[ OK ] ProbDistributionsNormal.DefaultPolicyLocation (0 ms)


[ RUN ] ProbDistributionsNormal.ErrnoPolicyLocation
[ OK ] ProbDistributionsNormal.ErrnoPolicyLocation (0 ms)
[ RUN ] ProbDistributionsNormal.Propto
[ OK ] ProbDistributionsNormal.Propto (0 ms)
[ RUN ] ProbDistributionsNormal.Cumulative
[ OK ] ProbDistributionsNormal.Cumulative (0 ms)
[ RUN ] ProbDistributionsNormal.CumulativeDefaultPolicySigma
[ OK ] ProbDistributionsNormal.CumulativeDefaultPolicySigma (0 ms)
[ RUN ] ProbDistributionsNormal.NormalVector
[ OK ] ProbDistributionsNormal.NormalVector (0 ms)
[ RUN ] ProbDistributionsNormal.ProptoVector
[ OK ] ProbDistributionsNormal.ProptoVector (0 ms)
[ RUN ] ProbDistributionsNormal.DefaultPolicyVectorScale
[ OK ] ProbDistributionsNormal.DefaultPolicyVectorScale (0 ms)
[ RUN ] ProbDistributionsNormal.ErrnoPolicyNormalVectorScale
[ OK ] ProbDistributionsNormal.ErrnoPolicyNormalVectorScale (0 ms)
[ RUN ] ProbDistributionsNormal.DefaultPolicyNormalVectorY
[ OK ] ProbDistributionsNormal.DefaultPolicyNormalVectorY (0 ms)
[ RUN ] ProbDistributionsNormal.ErrnoPolicyNormalVectorY
[ OK ] ProbDistributionsNormal.ErrnoPolicyNormalVectorY (0 ms)
[ RUN ] ProbDistributionsNormal.DefaultPolicyNormalVectorLocation
[ OK ] ProbDistributionsNormal.DefaultPolicyNormalVectorLocation (0 ms)
[ RUN ] ProbDistributionsNormal.ErrnoPolicyNormalVectorLocation
[ OK ] ProbDistributionsNormal.ErrnoPolicyNormalVectorLocation (0 ms)

[----------] 18 tests from ProbDistributionsNormal (0 ms total)

[----------] Global test environment tear-down

[==========] 18 tests from 1 test case ran. (0 ms total)

[ OK ] ProbDistributions.StudentT (0 ms)


[ RUN ] ProbDistributions.StudentTPropto
[ OK ] ProbDistributions.StudentTPropto (0 ms)

[----------] 2 tests from ProbDistributions (0 ms total)

[----------] Global test environment tear-down
[==========] 2 tests from 1 test case ran. (0 ms total)
[ PASSED ] 2 tests.
================================================================================
================================================================================

g++-4 -O0 -Wall -g -DNDEBUG -I src -I lib -std=gnu++0x -I lib/gtest/include -I lib/gtest -DGTEST_HAS_PTHREAD=0 src/test/prob/distributions/uniform_test.cpp lib/gtest/src/gtest_main.cc ar/libgtest.a -o test/prob/distributions/uniform
src/stan/maths/special_functions.hpp:535:19: warning: ‘double stan::maths::log_sum_exp(const std::vector<double>&)’ defined but not used
test/prob/distributions/uniform --gtest_output="xml:test/prob/distributions/uniform.xml"
Running main() from gtest_main.cc
[==========] Running 10 tests from 1 test case.
[----------] Global test environment set-up.
[----------] 10 tests from ProbDistributionsUniform
[ RUN ] ProbDistributionsUniform.Uniform
[ OK ] ProbDistributionsUniform.Uniform (0 ms)
[ RUN ] ProbDistributionsUniform.Propto
[ OK ] ProbDistributionsUniform.Propto (0 ms)
[ RUN ] ProbDistributionsUniform.DefaultPolicyY

[ OK ] ProbDistributionsUniform.DefaultPolicyY (0 ms)


[ RUN ] ProbDistributionsUniform.DefaultPolicyLower
[ OK ] ProbDistributionsUniform.DefaultPolicyLower (0 ms)
[ RUN ] ProbDistributionsUniform.DefaultPolicyUpper
[ OK ] ProbDistributionsUniform.DefaultPolicyUpper (0 ms)
[ RUN ] ProbDistributionsUniform.DefaultPolicyBounds

[ OK ] ProbDistributionsUniform.DefaultPolicyBounds (0 ms)


[ RUN ] ProbDistributionsUniform.ErrnoPolicyBounds
[ OK ] ProbDistributionsUniform.ErrnoPolicyBounds (0 ms)
[ RUN ] ProbDistributionsUniform.ErrnoPolicyY
[ OK ] ProbDistributionsUniform.ErrnoPolicyY (0 ms)
[ RUN ] ProbDistributionsUniform.ErrnoPolicyLower
[ OK ] ProbDistributionsUniform.ErrnoPolicyLower (0 ms)
[ RUN ] ProbDistributionsUniform.ErrnoPolicyUpper
[ OK ] ProbDistributionsUniform.ErrnoPolicyUpper (0 ms)

[----------] 10 tests from ProbDistributionsUniform (0 ms total)

[----------] Global test environment tear-down

[==========] 10 tests from 1 test case ran. (0 ms total)

[ OK ] ProbDistributions.Wishart4x4 (0 ms)


[ RUN ] ProbDistributions.Wishart2x2Propto
[ OK ] ProbDistributions.Wishart2x2Propto (0 ms)
[ RUN ] ProbDistributions.Wishart4x4Propto
[ OK ] ProbDistributions.Wishart4x4Propto (0 ms)

[----------] 4 tests from ProbDistributions (0 ms total)

[----------] Global test environment tear-down

[==========] 4 tests from 1 test case ran. (0 ms total)

mc.sta...@gmail.com

unread,
Jan 4, 2012, 8:33:30 PM1/4/12
to stan...@googlegroups.com
See <http://d1m1s1b1.stat.columbia.edu:8080/job/Stan/288/changes>

Changes:

[ca...@alias-i.com] fixed bug of not generating statements

------------------------------------------
[...truncated 1960 lines...]

[ OK ] ProbDistributionsUniform.DefaultPolicyY (15 ms)


[ RUN ] ProbDistributionsUniform.DefaultPolicyLower
[ OK ] ProbDistributionsUniform.DefaultPolicyLower (0 ms)
[ RUN ] ProbDistributionsUniform.DefaultPolicyUpper
[ OK ] ProbDistributionsUniform.DefaultPolicyUpper (0 ms)
[ RUN ] ProbDistributionsUniform.DefaultPolicyBounds
[ OK ] ProbDistributionsUniform.DefaultPolicyBounds (0 ms)
[ RUN ] ProbDistributionsUniform.ErrnoPolicyBounds
[ OK ] ProbDistributionsUniform.ErrnoPolicyBounds (0 ms)
[ RUN ] ProbDistributionsUniform.ErrnoPolicyY
[ OK ] ProbDistributionsUniform.ErrnoPolicyY (0 ms)
[ RUN ] ProbDistributionsUniform.ErrnoPolicyLower
[ OK ] ProbDistributionsUniform.ErrnoPolicyLower (0 ms)
[ RUN ] ProbDistributionsUniform.ErrnoPolicyUpper
[ OK ] ProbDistributionsUniform.ErrnoPolicyUpper (0 ms)

[----------] 10 tests from ProbDistributionsUniform (15 ms total)

[----------] Global test environment tear-down

[==========] 10 tests from 1 test case ran. (15 ms total)

mc.sta...@gmail.com

unread,
Jan 4, 2012, 8:40:44 PM1/4/12
to stan...@googlegroups.com
See <http://d1m1s1b1.stat.columbia.edu:8080/job/Stan/289/changes>

Changes:

[ca...@alias-i.com] removing inadvertent checkin

------------------------------------------
[...truncated 1957 lines...]

[ OK ] ProbDistributionsUniform.DefaultPolicyY (0 ms)


[ RUN ] ProbDistributionsUniform.DefaultPolicyLower
[ OK ] ProbDistributionsUniform.DefaultPolicyLower (0 ms)
[ RUN ] ProbDistributionsUniform.DefaultPolicyUpper
[ OK ] ProbDistributionsUniform.DefaultPolicyUpper (0 ms)
[ RUN ] ProbDistributionsUniform.DefaultPolicyBounds
[ OK ] ProbDistributionsUniform.DefaultPolicyBounds (0 ms)
[ RUN ] ProbDistributionsUniform.ErrnoPolicyBounds
[ OK ] ProbDistributionsUniform.ErrnoPolicyBounds (0 ms)
[ RUN ] ProbDistributionsUniform.ErrnoPolicyY
[ OK ] ProbDistributionsUniform.ErrnoPolicyY (0 ms)
[ RUN ] ProbDistributionsUniform.ErrnoPolicyLower
[ OK ] ProbDistributionsUniform.ErrnoPolicyLower (0 ms)
[ RUN ] ProbDistributionsUniform.ErrnoPolicyUpper
[ OK ] ProbDistributionsUniform.ErrnoPolicyUpper (0 ms)

[----------] 10 tests from ProbDistributionsUniform (0 ms total)

[----------] Global test environment tear-down

[==========] 10 tests from 1 test case ran. (0 ms total)

mc.sta...@gmail.com

unread,
Jan 4, 2012, 9:56:28 PM1/4/12
to stan...@googlegroups.com
See <http://d1m1s1b1.stat.columbia.edu:8080/job/Stan/290/changes>

Changes:

[guo...@gmail.com] remove some constrains on derived parameters

------------------------------------------
[...truncated 1970 lines...]

mc.sta...@gmail.com

unread,
Jan 4, 2012, 10:22:28 PM1/4/12
to stan...@googlegroups.com
See <http://d1m1s1b1.stat.columbia.edu:8080/job/Stan/291/changes>

Changes:

[guo...@gmail.com] remove constrains for derived parameters (cont.)

------------------------------------------
[...truncated 1965 lines...]

mc.sta...@gmail.com

unread,
Jan 5, 2012, 10:54:49 AM1/5/12
to stan...@googlegroups.com
See <http://d1m1s1b1.stat.columbia.edu:8080/job/Stan/292/changes>

Changes:

[bea...@alum.mit.edu] adding tests

------------------------------------------
[...truncated 1995 lines...]

mc.sta...@gmail.com

unread,
Jan 5, 2012, 11:21:47 AM1/5/12
to stan...@googlegroups.com
See <http://d1m1s1b1.stat.columbia.edu:8080/job/Stan/293/changes>

Changes:

[bea...@alum.mit.edu] adding double_exponential tests

------------------------------------------
[...truncated 2023 lines...]

mc.sta...@gmail.com

unread,
Jan 5, 2012, 11:29:24 AM1/5/12
to stan...@googlegroups.com
See <http://d1m1s1b1.stat.columbia.edu:8080/job/Stan/294/changes>

Changes:

[bea...@alum.mit.edu] distributions: weibull

------------------------------------------
[...truncated 2055 lines...]

mc.sta...@gmail.com

unread,
Jan 5, 2012, 11:37:11 AM1/5/12
to stan...@googlegroups.com
See <http://d1m1s1b1.stat.columbia.edu:8080/job/Stan/295/changes>

Changes:

[bea...@alum.mit.edu] adding lognormal agrad test.

[bea...@alum.mit.edu] distributions: logistic

------------------------------------------
[...truncated 2115 lines...]

mc.sta...@gmail.com

unread,
Jan 5, 2012, 11:45:04 AM1/5/12
to stan...@googlegroups.com
See <http://d1m1s1b1.stat.columbia.edu:8080/job/Stan/296/changes>

Changes:

[bea...@alum.mit.edu] adding bernoulli agrad tests

------------------------------------------
[...truncated 2129 lines...]

mc.sta...@gmail.com

unread,
Jan 5, 2012, 11:53:07 AM1/5/12
to stan...@googlegroups.com
See <http://d1m1s1b1.stat.columbia.edu:8080/job/Stan/297/changes>

Changes:

[bea...@alum.mit.edu] adding categorical agrad tests

------------------------------------------
[...truncated 2146 lines...]

mc.sta...@gmail.com

unread,
Jan 5, 2012, 12:14:17 PM1/5/12
to stan...@googlegroups.com
See <http://d1m1s1b1.stat.columbia.edu:8080/job/Stan/298/changes>

Changes:

[bea...@alum.mit.edu] adding binomial agrad test

------------------------------------------
[...truncated 2176 lines...]

[----------] 10 tests from ProbDistributionsUniform (15 ms total)

[----------] Global test environment tear-down

[==========] 10 tests from 1 test case ran. (15 ms total)

mc.sta...@gmail.com

unread,
Jan 5, 2012, 3:29:25 PM1/5/12
to stan...@googlegroups.com
See <http://d1m1s1b1.stat.columbia.edu:8080/job/Stan/299/changes>

Changes:

[bea...@alum.mit.edu] added agrad poisson test.

[bea...@alum.mit.edu] added agrad poisson test.

------------------------------------------
[...truncated 2193 lines...]

[----------] 10 tests from ProbDistributionsUniform (0 ms total)

[----------] Global test environment tear-down

[==========] 10 tests from 1 test case ran. (0 ms total)

mc.sta...@gmail.com

unread,
Jan 5, 2012, 3:55:37 PM1/5/12
to stan...@googlegroups.com
See <http://d1m1s1b1.stat.columbia.edu:8080/job/Stan/300/changes>

Changes:

[bea...@alum.mit.edu] added agrad neg_binomial tests

------------------------------------------
[...truncated 2214 lines...]

mc.sta...@gmail.com

unread,
Jan 5, 2012, 7:28:29 PM1/5/12
to stan...@googlegroups.com
See <http://d1m1s1b1.stat.columbia.edu:8080/job/Stan/301/changes>

Changes:

[ca...@alias-i.com] local variable generation working

mc.sta...@gmail.com

unread,
Jan 5, 2012, 7:53:27 PM1/5/12
to stan...@googlegroups.com
Reply all
Reply to author
Forward
0 new messages