Build failed in Jenkins: Stan #89

1 view
Skip to first unread message

mc.sta...@gmail.com

unread,
Dec 6, 2011, 3:52:52 PM12/6/11
to stan...@googlegroups.com
See <http://d1m1s1b1.stat.columbia.edu:8080/job/Stan/89/changes>

Changes:

[ca...@alias-i.com] reverted to r241 version of gm functions

------------------------------------------
[...truncated 240 lines...]
[ RUN ] agrad_agrad_special_functions.tgamma
[ OK ] agrad_agrad_special_functions.tgamma (0 ms)
[ RUN ] agrad_agrad_special_functions.step
[ OK ] agrad_agrad_special_functions.step (0 ms)
[ RUN ] agrad_agrad_special_functions.step_2
[ OK ] agrad_agrad_special_functions.step_2 (0 ms)
[ RUN ] agrad_agrad_special_functions.step_3
[ OK ] agrad_agrad_special_functions.step_3 (0 ms)
[ RUN ] agrad_agrad_special_functions.inv_cloglog
[ OK ] agrad_agrad_special_functions.inv_cloglog (0 ms)
[ RUN ] agrad_agrad_special_functions.log_sum_exp_vv
[ OK ] agrad_agrad_special_functions.log_sum_exp_vv (0 ms)
[ RUN ] agrad_agrad_special_functions.log_sum_exp_vd
[ OK ] agrad_agrad_special_functions.log_sum_exp_vd (0 ms)
[ RUN ] agrad_agrad_special_functions.log_sum_exp_dv
[ OK ] agrad_agrad_special_functions.log_sum_exp_dv (0 ms)
[ RUN ] agrad_agrad_special_functions.log_sum_exp_vector
[ OK ] agrad_agrad_special_functions.log_sum_exp_vector (0 ms)
[ RUN ] agrad_agrad_special_functions.square
[ OK ] agrad_agrad_special_functions.square (0 ms)
[----------] 65 tests from agrad_agrad_special_functions (2 ms total)

[----------] Global test environment tear-down
[==========] 65 tests from 1 test case ran. (2 ms total)
[ PASSED ] 65 tests.
g++-4 -O0 -Wall -g -DNDEBUG -I src -I lib -I lib/gtest/include -I lib/gtest src/test/agrad/agrad_test.cpp lib/gtest/src/gtest_main.cc ar/libgtest.a -o test/agrad/agrad
test/agrad/agrad --gtest_output="xml:test/agrad/agrad.xml"
Running main() from gtest_main.cc
[==========] Running 88 tests from 1 test case.
[----------] Global test environment set-up.
[----------] 88 tests from agrad_agrad
[ RUN ] agrad_agrad.a_eq_x
[ OK ] agrad_agrad.a_eq_x (0 ms)
[ RUN ] agrad_agrad.a_of_x
[ OK ] agrad_agrad.a_of_x (0 ms)
[ RUN ] agrad_agrad.a__a_eq_x
[ OK ] agrad_agrad.a__a_eq_x (0 ms)
[ RUN ] agrad_agrad.a
[ OK ] agrad_agrad.a (0 ms)
[ RUN ] agrad_agrad.eq_a
[ OK ] agrad_agrad.eq_a (0 ms)
[ RUN ] agrad_agrad.a_lt_b
[ OK ] agrad_agrad.a_lt_b (0 ms)
[ RUN ] agrad_agrad.a_lt_y
[ OK ] agrad_agrad.a_lt_y (0 ms)
[ RUN ] agrad_agrad.x_lt_b
[ OK ] agrad_agrad.x_lt_b (0 ms)
[ RUN ] agrad_agrad.a_gt_b
[ OK ] agrad_agrad.a_gt_b (0 ms)
[ RUN ] agrad_agrad.a_gt_y
[ OK ] agrad_agrad.a_gt_y (0 ms)
[ RUN ] agrad_agrad.x_gt_b
[ OK ] agrad_agrad.x_gt_b (0 ms)
[ RUN ] agrad_agrad.a_lte_b
[ OK ] agrad_agrad.a_lte_b (0 ms)
[ RUN ] agrad_agrad.a_lte_y
[ OK ] agrad_agrad.a_lte_y (0 ms)
[ RUN ] agrad_agrad.x_lte_b
[ OK ] agrad_agrad.x_lte_b (0 ms)
[ RUN ] agrad_agrad.a_gte_b
[ OK ] agrad_agrad.a_gte_b (0 ms)
[ RUN ] agrad_agrad.a_gte_y
[ OK ] agrad_agrad.a_gte_y (0 ms)
[ RUN ] agrad_agrad.x_gte_b
[ OK ] agrad_agrad.x_gte_b (0 ms)
[ RUN ] agrad_agrad.a_eq_b
[ OK ] agrad_agrad.a_eq_b (0 ms)
[ RUN ] agrad_agrad.x_eq_b
[ OK ] agrad_agrad.x_eq_b (0 ms)
[ RUN ] agrad_agrad.a_eq_y
[ OK ] agrad_agrad.a_eq_y (1 ms)
[ RUN ] agrad_agrad.a_neq_y
[ OK ] agrad_agrad.a_neq_y (0 ms)
[ RUN ] agrad_agrad.pos_a
[ OK ] agrad_agrad.pos_a (0 ms)
[ RUN ] agrad_agrad.neg_a
[ OK ] agrad_agrad.neg_a (0 ms)
[ RUN ] agrad_agrad.a_plus_b
[ OK ] agrad_agrad.a_plus_b (0 ms)
[ RUN ] agrad_agrad.a_plus_a
[ OK ] agrad_agrad.a_plus_a (0 ms)
[ RUN ] agrad_agrad.a_plus_neg_b
[ OK ] agrad_agrad.a_plus_neg_b (0 ms)
[ RUN ] agrad_agrad.a_plus_x
[ OK ] agrad_agrad.a_plus_x (0 ms)
[ RUN ] agrad_agrad.x_plus_a
[ OK ] agrad_agrad.x_plus_a (0 ms)
[ RUN ] agrad_agrad.a_minus_b
[ OK ] agrad_agrad.a_minus_b (0 ms)
[ RUN ] agrad_agrad.a_minus_a
[ OK ] agrad_agrad.a_minus_a (0 ms)
[ RUN ] agrad_agrad.a_minus_x
[ OK ] agrad_agrad.a_minus_x (0 ms)
[ RUN ] agrad_agrad.x_minus_a
[ OK ] agrad_agrad.x_minus_a (0 ms)
[ RUN ] agrad_agrad.a_times_b
[ OK ] agrad_agrad.a_times_b (0 ms)
[ RUN ] agrad_agrad.a_times_a
[ OK ] agrad_agrad.a_times_a (0 ms)
[ RUN ] agrad_agrad.a_times_y
[ OK ] agrad_agrad.a_times_y (0 ms)
[ RUN ] agrad_agrad.x_times_b
[ OK ] agrad_agrad.x_times_b (0 ms)
[ RUN ] agrad_agrad.a_div_b
[ OK ] agrad_agrad.a_div_b (0 ms)
[ RUN ] agrad_agrad.a_divide_bd
[ OK ] agrad_agrad.a_divide_bd (0 ms)
[ RUN ] agrad_agrad.ad_divide_b
[ OK ] agrad_agrad.ad_divide_b (0 ms)
[ RUN ] agrad_agrad.plus_plus_a
[ OK ] agrad_agrad.plus_plus_a (0 ms)
[ RUN ] agrad_agrad.plus_plus_a_2
[ OK ] agrad_agrad.plus_plus_a_2 (0 ms)
[ RUN ] agrad_agrad.plus_plus_a_3
[ OK ] agrad_agrad.plus_plus_a_3 (0 ms)
[ RUN ] agrad_agrad.a_plus_plus
[ OK ] agrad_agrad.a_plus_plus (0 ms)
[ RUN ] agrad_agrad.a_plus_plus_2
[ OK ] agrad_agrad.a_plus_plus_2 (0 ms)
[ RUN ] agrad_agrad.minus_minus_a
[ OK ] agrad_agrad.minus_minus_a (0 ms)
[ RUN ] agrad_agrad.minus_minus_a_2
[ OK ] agrad_agrad.minus_minus_a_2 (0 ms)
[ RUN ] agrad_agrad.a_minus_minus
[ OK ] agrad_agrad.a_minus_minus (0 ms)
[ RUN ] agrad_agrad.a_minus_minus_2
[ OK ] agrad_agrad.a_minus_minus_2 (0 ms)
[ RUN ] agrad_agrad.a_pluseq_b
[ OK ] agrad_agrad.a_pluseq_b (0 ms)
[ RUN ] agrad_agrad.a_pluseq_bd
[ OK ] agrad_agrad.a_pluseq_bd (0 ms)
[ RUN ] agrad_agrad.a_minuseq_b
[ OK ] agrad_agrad.a_minuseq_b (0 ms)
[ RUN ] agrad_agrad.a_negeq_bd
[ OK ] agrad_agrad.a_negeq_bd (0 ms)
[ RUN ] agrad_agrad.a_timeseq_b
[ OK ] agrad_agrad.a_timeseq_b (0 ms)
[ RUN ] agrad_agrad.a_timeseq_bd
[ OK ] agrad_agrad.a_timeseq_bd (0 ms)
[ RUN ] agrad_agrad.a_divideeq_b
[ OK ] agrad_agrad.a_divideeq_b (0 ms)
[ RUN ] agrad_agrad.a_divideeq_bd
[ OK ] agrad_agrad.a_divideeq_bd (0 ms)
[ RUN ] agrad_agrad.not_a
[ OK ] agrad_agrad.not_a (0 ms)
[ RUN ] agrad_agrad.exp_a
[ OK ] agrad_agrad.exp_a (0 ms)
[ RUN ] agrad_agrad.a_ostream
[ OK ] agrad_agrad.a_ostream (0 ms)
[ RUN ] agrad_agrad.log_a
[ OK ] agrad_agrad.log_a (0 ms)
[ RUN ] agrad_agrad.log10_a
[ OK ] agrad_agrad.log10_a (0 ms)
[ RUN ] agrad_agrad.sqrt_a
[ OK ] agrad_agrad.sqrt_a (0 ms)
[ RUN ] agrad_agrad.pow_var_var
[ OK ] agrad_agrad.pow_var_var (0 ms)
[ RUN ] agrad_agrad.pow_var_double
[ OK ] agrad_agrad.pow_var_double (0 ms)
[ RUN ] agrad_agrad.pow_double_var
[ OK ] agrad_agrad.pow_double_var (0 ms)
[ RUN ] agrad_agrad.cos_var
[ OK ] agrad_agrad.cos_var (0 ms)
[ RUN ] agrad_agrad.sin_var
[ OK ] agrad_agrad.sin_var (0 ms)
[ RUN ] agrad_agrad.tan_var
[ OK ] agrad_agrad.tan_var (0 ms)
[ RUN ] agrad_agrad.acos_var
[ OK ] agrad_agrad.acos_var (0 ms)
[ RUN ] agrad_agrad.asin_var
[ OK ] agrad_agrad.asin_var (0 ms)
[ RUN ] agrad_agrad.atan_var
[ OK ] agrad_agrad.atan_var (0 ms)
[ RUN ] agrad_agrad.atan2_var_var
[ OK ] agrad_agrad.atan2_var_var (0 ms)
[ RUN ] agrad_agrad.atan2_var_double
[ OK ] agrad_agrad.atan2_var_double (0 ms)
[ RUN ] agrad_agrad.atan2_double_var
[ OK ] agrad_agrad.atan2_double_var (0 ms)
[ RUN ] agrad_agrad.cosh_var
[ OK ] agrad_agrad.cosh_var (0 ms)
[ RUN ] agrad_agrad.sinh_var
[ OK ] agrad_agrad.sinh_var (0 ms)
[ RUN ] agrad_agrad.tanh_var
[ OK ] agrad_agrad.tanh_var (0 ms)
[ RUN ] agrad_agrad.fabs_var
[ OK ] agrad_agrad.fabs_var (0 ms)
[ RUN ] agrad_agrad.fabs_var_2
[ OK ] agrad_agrad.fabs_var_2 (0 ms)
[ RUN ] agrad_agrad.fabs_var_3
[ OK ] agrad_agrad.fabs_var_3 (0 ms)
[ RUN ] agrad_agrad.abs_var
[ OK ] agrad_agrad.abs_var (0 ms)
[ RUN ] agrad_agrad.abs_var_2
[ OK ] agrad_agrad.abs_var_2 (0 ms)
[ RUN ] agrad_agrad.abs_var_3
[ OK ] agrad_agrad.abs_var_3 (0 ms)
[ RUN ] agrad_agrad.floor_var
[ OK ] agrad_agrad.floor_var (0 ms)
[ RUN ] agrad_agrad.ceil_var
[ OK ] agrad_agrad.ceil_var (0 ms)
[ RUN ] agrad_agrad.fmod_var_var
[ OK ] agrad_agrad.fmod_var_var (0 ms)
[ RUN ] agrad_agrad.fmod_var_double
[ OK ] agrad_agrad.fmod_var_double (0 ms)
[ RUN ] agrad_agrad.fmod_double_var
[ OK ] agrad_agrad.fmod_double_var (0 ms)
[----------] 88 tests from agrad_agrad (2 ms total)

[----------] Global test environment tear-down
[==========] 88 tests from 1 test case ran. (2 ms total)
[ PASSED ] 88 tests.
g++-4 -O0 -Wall -g -DNDEBUG -I src -I lib -I lib/gtest/include -I lib/gtest src/test/agrad/distributions_test.cpp lib/gtest/src/gtest_main.cc ar/libgtest.a -o test/agrad/distributions
test/agrad/distributions --gtest_output="xml:test/agrad/distributions.xml"
Running main() from gtest_main.cc
[==========] Running 0 tests from 0 test cases.
[==========] 0 tests from 0 test cases ran. (0 ms total)
[ PASSED ] 0 tests.
g++-4 -O0 -Wall -g -DNDEBUG -I src -I lib -I lib/gtest/include -I lib/gtest src/test/agrad/matrix_test.cpp lib/gtest/src/gtest_main.cc ar/libgtest.a -o test/agrad/matrix
In file included from src/test/agrad/matrix_test.cpp:1:0:
lib/gtest/include/gtest/gtest.h: In function ‘testing::AssertionResult testing::internal::CmpHelperEQ(const char*, const char*, const T1&, const T2&) [with T1 = int, T2 = unsigned int]’:
lib/gtest/include/gtest/gtest.h:1353:30: instantiated from ‘static testing::AssertionResult testing::internal::EqHelper<lhs_is_null_literal>::Compare(const char*, const char*, const T1&, const T2&) [with T1 = int, T2 = unsigned int, bool lhs_is_null_literal = false]’
src/test/agrad/matrix_test.cpp:159:3: instantiated from here
lib/gtest/include/gtest/gtest.h:1316:3: warning: comparison between signed and unsigned integer expressions
test/agrad/matrix --gtest_output="xml:test/agrad/matrix.xml"
Running main() from gtest_main.cc
[==========] Running 0 tests from 0 test cases.
[==========] 0 tests from 0 test cases ran. (0 ms total)
[ PASSED ] 0 tests.
g++-4 -O0 -Wall -g -DNDEBUG -I src -I lib -I lib/gtest/include -I lib/gtest src/test/gm/ast_test.cpp lib/gtest/src/gtest_main.cc ar/libgtest.a -o test/gm/ast
src/test/gm/ast_test.cpp: In member function ‘virtual void gm_ast_expr_type_is_primitive_int_Test::TestBody()’:
src/test/gm/ast_test.cpp:30:3: error: ‘class stan::gm::expr_type’ has no member named ‘is_primitive_int’
src/test/gm/ast_test.cpp:31:3: error: ‘class stan::gm::expr_type’ has no member named ‘is_primitive_int’
src/test/gm/ast_test.cpp:32:3: error: ‘class stan::gm::expr_type’ has no member named ‘is_primitive_int’
src/test/gm/ast_test.cpp:33:3: error: ‘class stan::gm::expr_type’ has no member named ‘is_primitive_int’
src/test/gm/ast_test.cpp:34:3: error: ‘class stan::gm::expr_type’ has no member named ‘is_primitive_int’
src/test/gm/ast_test.cpp:35:3: error: ‘class stan::gm::expr_type’ has no member named ‘is_primitive_int’
src/test/gm/ast_test.cpp: In member function ‘virtual void gm_ast_expr_type_is_primitive_double_Test::TestBody()’:
src/test/gm/ast_test.cpp:38:3: error: ‘class stan::gm::expr_type’ has no member named ‘is_primitive_double’
src/test/gm/ast_test.cpp:39:3: error: ‘class stan::gm::expr_type’ has no member named ‘is_primitive_double’
src/test/gm/ast_test.cpp:40:3: error: ‘class stan::gm::expr_type’ has no member named ‘is_primitive_double’
src/test/gm/ast_test.cpp:41:3: error: ‘class stan::gm::expr_type’ has no member named ‘is_primitive_double’
src/test/gm/ast_test.cpp:42:3: error: ‘class stan::gm::expr_type’ has no member named ‘is_primitive_double’
src/test/gm/ast_test.cpp:43:3: error: ‘class stan::gm::expr_type’ has no member named ‘is_primitive_double’
make: *** [test/gm/ast] Error 1

<http://d1m1s1b1.stat.columbia.edu:8080/job/Stan/ws/>exit> 2
Build step 'Execute Windows batch command' marked build as failure
Recording test results

mc.sta...@gmail.com

unread,
Dec 6, 2011, 5:51:09 PM12/6/11
to stan...@googlegroups.com
Reply all
Reply to author
Forward
0 new messages