Apparently I cannot attach files, so I paste them here. First meson-setup.txt, then meson-log.txt, finally mamba list.
The Meson build system
Version: 1.12.0
Source dir: /home/martin/sage-trac
Build dir: /home/martin/sage-trac/build/cp312
Build type: native build
Project name: SageMath
Project version: 10.10.beta10
C compiler for the host machine: /home/martin/miniforge3/envs/sage-dev/bin/x86_64-conda-linux-gnu-cc (gcc 14.3.0 "x86_64-conda-linux-gnu-cc (conda-forge gcc
14.3.0-18) 14.3.0")
C linker for the host machine: /home/martin/miniforge3/envs/sage-dev/bin/x86_64-conda-linux-gnu-cc ld.bfd 2.45.1
C++ compiler for the host machine: /home/martin/miniforge3/envs/sage-dev/bin/x86_64-conda-linux-gnu-c++ (gcc 14.3.0 "x86_64-conda-linux-gnu-c++ (conda-forge
gcc 14.3.0-18) 14.3.0")
C++ linker for the host machine: /home/martin/miniforge3/envs/sage-dev/bin/x86_64-conda-linux-gnu-c++ ld.bfd 2.45.1
Found pkg-config: YES (/home/martin/miniforge3/envs/sage-dev/bin/pkg-config) 0.29.2
Run-time dependency python3 found: YES 3.12
Cython compiler for the host machine: cython (cython 3.2.4)
Found pkg-config: YES (/home/martin/miniforge3/envs/sage-dev/bin/pkg-config) 0.29.2
Build-time dependency python3 found: YES 3.12
Host machine cpu family: x86_64
Host machine cpu: x86_64
Program python found: YES (/home/martin/miniforge3/envs/sage-dev/bin/python3.12)
Found pkg-config: YES (/home/martin/miniforge3/envs/sage-dev/bin/pkg-config) 0.29.2
Run-time dependency python found: YES 3.12
Program python (pytest) found: YES (/home/martin/miniforge3/envs/sage-dev/bin/python3.12) modules: pytest
numpy-config found: YES (/home/martin/miniforge3/envs/sage-dev/bin/numpy-config) 2.4.3
Run-time dependency numpy found: YES 2.4.3
Run-time dependency gmp found: YES 6.3.0
Library pari found: YES
Checking if "pari version" with dependency -lpari runs: YES
Run-time dependency mpfr found: YES 4.2.2
Run-time dependency flint found: YES 3.3.1
Found CMake: /usr/bin/cmake (3.28.3)
Run-time dependency mkl found: NO (tried pkg-config and cmake)
Run-time dependency cblas found: YES 0.3.32
Run-time dependency gsl found: YES 2.8
Run-time dependency gdlib found: YES 2.3.3
Library m found: YES
Run-time dependency m4ri found: YES 20250128
Run-time dependency m4rie found: YES 20250128
Run-time dependency libmtx found: NO (tried pkg-config and cmake)
Has header "meataxe.h" : NO
Run-time dependency libpng found: YES 1.6.58
Run-time dependency zlib found: YES 1.3.2
Run-time dependency eclib found: YES 20250627
Library ecm found: YES
Run-time dependency gmpxx found: YES 6.3.0
Run-time dependency fflas-ffpack found: YES 2.5.0
Run-time dependency givaro found: YES 4.2.1
Run-time dependency linbox found: YES 1.7.1
Library mpc found: YES
Library mpfi found: YES
Run-time dependency libgap found: YES 4.15.1
Run-time dependency singular found: YES 4.4.1
Library ntl found: YES
Run-time dependency Boost (found: graph) for cpp found: YES 1.85.0 (/home/martin/miniforge3/envs/sage-dev)
Run-time dependency OpenMP found: YES 4.5
Program gap found: YES (/home/martin/miniforge3/envs/sage-dev/bin/gap)
Program ecm found: YES (/home/martin/miniforge3/envs/sage-dev/bin/ecm)
Program directg found: YES (/home/martin/miniforge3/envs/sage-dev/bin/directg)
Program gentourng found: YES (/home/martin/miniforge3/envs/sage-dev/bin/gentourng)
Program geng found: YES (/home/martin/miniforge3/envs/sage-dev/bin/geng)
Program genbg found: YES (/home/martin/miniforge3/envs/sage-dev/bin/genbg)
Program gentreeg found: YES (/home/martin/miniforge3/envs/sage-dev/bin/gentreeg)
Program genktreeg found: YES (/home/martin/miniforge3/envs/sage-dev/bin/genktreeg)
Program genposetg found: YES (/home/martin/miniforge3/envs/sage-dev/bin/genposetg)
Run-time dependency libsirocco found: YES 2.1.1
Program ecl found: YES 26.5.5 26.5.5 (/home/martin/miniforge3/envs/sage-dev/bin/ecl)
Program /home/martin/miniforge3/envs/sage-dev/bin/ecl-config found: YES (/home/martin/miniforge3/envs/sage-dev/bin/ecl-config)
Program maxima found: YES (/home/martin/miniforge3/envs/sage-dev/bin/maxima)
Run-time dependency libbraiding found: YES 1.3.2
Run-time dependency highs found: YES 1.14.0
Has header "interfaces/highs_c_api.h" with dependency highs: YES
Run-time dependency bdw-gc-threaded found: NO (tried pkg-config and cmake)
Run-time dependency bdw-gc found: YES 8.2.12
Run-time dependency libhomfly found: YES 1.04
Library coxeter3 found: NO
Run-time dependency lcalc found: YES 2.1.1
Run-time dependency symmetrica found: YES 3.1.0
Library bliss found: YES
Run-time dependency mcqd found: NO (tried cmake)
Has header "mcqd.h" : NO
Run-time dependency libcliquer found: YES 1.23
Run-time dependency libplanarity found: YES 4.0.1.0
Has header "planarity/graphLib.h" with dependency libplanarity: YES
Has header "treedec/combinations.hpp" : NO
Library rw found: YES
Library iml found: YES
Library glpk found: YES
Run-time dependency brial found: YES 1.2.15
Library brial_groebner found: YES
Configuring kernel.json using configuration
Configuring config.py using configuration
Build targets in project: 574
SageMath 10.10.beta10
User defined options
Native files : /home/martin/sage-trac/build/cp312/meson-python-native-file.ini
b_ndebug : if-release
b_vscrt : md
build-docs : False
buildtype : release
default_library: static
Found ninja-1.13.2 at /home/martin/miniforge3/envs/sage-dev/bin/ninja
######################
meson-log.txt
######################
Build started at 2026-09-15T20:19:05.153373
Main binary: /home/martin/miniforge3/envs/sage-dev/bin/python3.12
Build Options: -Dbuildtype=release -Db_ndebug=if-release -Db_vscrt=md -Ddefault_library=static -Dbuild-docs=False --native-file=/home/martin/sage-trac/build/cp312/meson-python-native-file.ini
Python system: Linux
The Meson build system
Version: 1.12.0
Source dir: /home/martin/sage-trac
Build dir: /home/martin/sage-trac/build/cp312
Build type: native build
Project name: SageMath
Project version: 10.10.beta10
-----------
Detecting compiler via: `/home/martin/miniforge3/envs/sage-dev/bin/x86_64-conda-linux-gnu-cc --version` -> 0
stdout:
x86_64-conda-linux-gnu-cc (conda-forge gcc 14.3.0-18) 14.3.0
Copyright (C) 2024 Free Software Foundation, Inc.
This is free software; see the source for copying conditions. There is NO
warranty; not even for MERCHANTABILITY or FITNESS FOR A PARTICULAR PURPOSE.
-----------
Running command: -cpp -x c -E -dM -
-----
-----------
Detecting linker via: `/home/martin/miniforge3/envs/sage-dev/bin/x86_64-conda-linux-gnu-cc -Wl,--version -Wl,-O2 -Wl,--sort-common -Wl,--as-needed -Wl,-z,relro -Wl,-z,now -Wl,--disable-new-dtags -Wl,--gc-sections -Wl,--allow-shlib-undefined -Wl,-rpath,/home/martin/miniforge3/envs/sage-dev/lib -Wl,-rpath-link,/home/martin/miniforge3/envs/sage-dev/lib -L/home/martin/miniforge3/envs/sage-dev/lib -march=nocona -mtune=haswell -ftree-vectorize -fPIC -fstack-protector-strong -fno-plt -O2 -ffunction-sections -pipe -isystem /home/martin/miniforge3/envs/sage-dev/include -DNDEBUG -D_FORTIFY_SOURCE=2 -O2 -isystem /home/martin/miniforge3/envs/sage-dev/include` -> 0
stdout:
GNU ld (GNU Binutils) 2.45.1
Copyright (C) 2025 Free Software Foundation, Inc.
This program is free software; you may redistribute it under the terms of
the GNU General Public License version 3 or (at your option) a later version.
This program has absolutely no warranty.
-----------
stderr:
collect2 version 14.3.0
/home/martin/miniforge3/envs/sage-dev/bin/../libexec/gcc/x86_64-conda-linux-gnu/14.3.0/ld -disable-new-dtags -plugin /home/martin/miniforge3/envs/sage-dev/bin/../libexec/gcc/x86_64-conda-linux-gnu/14.3.0/liblto_plugin.so -plugin-opt=/home/martin/miniforge3/envs/sage-dev/bin/../libexec/gcc/x86_64-conda-linux-gnu/14.3.0/lto-wrapper -plugin-opt=-fresolution=/home/martin/tmp/ccvhJuKs.res -plugin-opt=-pass-through=-lgcc -plugin-opt=-pass-through=-lgcc_s -plugin-opt=-pass-through=-lc -plugin-opt=-pass-through=-lgcc -plugin-opt=-pass-through=-lgcc_s --sysroot=/home/martin/miniforge3/envs/sage-dev/bin/../x86_64-conda-linux-gnu/sysroot --eh-frame-hdr -m elf_x86_64 -dynamic-linker /lib64/ld-linux-x86-64.so.2 -pie /home/martin/miniforge3/envs/sage-dev/bin/../x86_64-conda-linux-gnu/sysroot/lib/../lib/Scrt1.o /home/martin/miniforge3/envs/sage-dev/bin/../x86_64-conda-linux-gnu/sysroot/lib/../lib/crti.o /home/martin/miniforge3/envs/sage-dev/bin/../lib/gcc/x86_64-conda-linux-gnu/14.3.0/crtbeginS.o -L/home/martin/miniforge3/envs/sage-dev/lib -L/home/martin/miniforge3/envs/sage-dev/bin/../lib/gcc/x86_64-conda-linux-gnu/14.3.0 -L/home/martin/miniforge3/envs/sage-dev/bin/../lib/gcc -L/home/martin/miniforge3/envs/sage-dev/bin/../lib/gcc/x86_64-conda-linux-gnu/14.3.0/../../../../x86_64-conda-linux-gnu/lib/../lib -L/home/martin/miniforge3/envs/sage-dev/bin/../lib/gcc/x86_64-conda-linux-gnu/14.3.0/../../../../lib -L/home/martin/miniforge3/envs/sage-dev/bin/../x86_64-conda-linux-gnu/sysroot/lib/../lib -L/home/martin/miniforge3/envs/sage-dev/bin/../x86_64-conda-linux-gnu/sysroot/usr/lib/../lib -L/home/martin/miniforge3/envs/sage-dev/bin/../lib/gcc/x86_64-conda-linux-gnu/14.3.0/../../../../x86_64-conda-linux-gnu/lib -L/home/martin/miniforge3/envs/sage-dev/bin/../lib/gcc/x86_64-conda-linux-gnu/14.3.0/../../.. -L/home/martin/miniforge3/envs/sage-dev/bin/../x86_64-conda-linux-gnu/sysroot/lib -L/home/martin/miniforge3/envs/sage-dev/bin/../x86_64-conda-linux-gnu/sysroot/usr/lib --version -O2 --sort-common --as-needed -z relro -z now --disable-new-dtags --gc-sections --allow-shlib-undefined -rpath /home/martin/miniforge3/envs/sage-dev/lib -rpath-link /home/martin/miniforge3/envs/sage-dev/lib -lgcc --push-state --as-needed -lgcc_s --pop-state -lc -lgcc --push-state --as-needed -lgcc_s --pop-state /home/martin/miniforge3/envs/sage-dev/bin/../lib/gcc/x86_64-conda-linux-gnu/14.3.0/crtendS.o /home/martin/miniforge3/envs/sage-dev/bin/../x86_64-conda-linux-gnu/sysroot/lib/../lib/crtn.o -rpath /home/martin/miniforge3/envs/sage-dev/lib -rpath-link /home/martin/miniforge3/envs/sage-dev/lib -L /home/martin/miniforge3/envs/sage-dev/lib/stubs -L /home/martin/miniforge3/envs/sage-dev/lib
-----------
Sanity check compiler command line: /home/martin/miniforge3/envs/sage-dev/bin/x86_64-conda-linux-gnu-cc -D_FILE_OFFSET_BITS=64 -o sanity_check_for_c.exe sanity_check_for_c.c -march=nocona -mtune=haswell -ftree-vectorize -fPIC -fstack-protector-strong -fno-plt -O2 -ffunction-sections -pipe -isystem /home/martin/miniforge3/envs/sage-dev/include -DNDEBUG -D_FORTIFY_SOURCE=2 -O2 -isystem /home/martin/miniforge3/envs/sage-dev/include -march=nocona -mtune=haswell -ftree-vectorize -fPIC -fstack-protector-strong -fno-plt -O2 -ffunction-sections -pipe -isystem /home/martin/miniforge3/envs/sage-dev/include -DNDEBUG -D_FORTIFY_SOURCE=2 -O2 -isystem /home/martin/miniforge3/envs/sage-dev/include -D_FILE_OFFSET_BITS=64 -Wl,-O2 -Wl,--sort-common -Wl,--as-needed -Wl,-z,relro -Wl,-z,now -Wl,--disable-new-dtags -Wl,--gc-sections -Wl,--allow-shlib-undefined -Wl,-rpath,/home/martin/miniforge3/envs/sage-dev/lib -Wl,-rpath-link,/home/martin/miniforge3/envs/sage-dev/lib -L/home/martin/miniforge3/envs/sage-dev/lib -march=nocona -mtune=haswell -ftree-vectorize -fPIC -fstack-protector-strong -fno-plt -O2 -ffunction-sections -pipe -isystem /home/martin/miniforge3/envs/sage-dev/include -DNDEBUG -D_FORTIFY_SOURCE=2 -O2 -isystem /home/martin/miniforge3/envs/sage-dev/include -Wl,-O2 -Wl,--sort-common -Wl,--as-needed -Wl,-z,relro -Wl,-z,now -Wl,--disable-new-dtags -Wl,--gc-sections -Wl,--allow-shlib-undefined -Wl,-rpath,/home/martin/miniforge3/envs/sage-dev/lib -Wl,-rpath-link,/home/martin/miniforge3/envs/sage-dev/lib -L/home/martin/miniforge3/envs/sage-dev/lib
Sanity check compile stdout:
-----
Sanity check compile stderr:
-----
Sanity check built target output for host machine c compiler
-- Running test binary command: /home/martin/sage-trac/build/cp312/meson-private/sanity_check_for_c.exe
-----------
Sanity check: `/home/martin/sage-trac/build/cp312/meson-private/sanity_check_for_c.exe` -> 0
-- stdout:
-- stderr:
-- returncode: 0
C compiler for the host machine: /home/martin/miniforge3/envs/sage-dev/bin/x86_64-conda-linux-gnu-cc (gcc 14.3.0 "x86_64-conda-linux-gnu-cc (conda-forge gcc 14.3.0-18) 14.3.0")
C linker for the host machine: /home/martin/miniforge3/envs/sage-dev/bin/x86_64-conda-linux-gnu-cc ld.bfd 2.45.1
-----------
Detecting archiver via: `x86_64-conda-linux-gnu-ar --version` -> 0
stdout:
GNU ar (GNU Binutils) 2.45.1
Copyright (C) 2025 Free Software Foundation, Inc.
This program is free software; you may redistribute it under the terms of
the GNU General Public License version 3 or (at your option) any later version.
This program has absolutely no warranty.
-----------
-----------
Detecting compiler via: `/home/martin/miniforge3/envs/sage-dev/bin/x86_64-conda-linux-gnu-c++ --version` -> 0
stdout:
x86_64-conda-linux-gnu-c++ (conda-forge gcc 14.3.0-18) 14.3.0
Copyright (C) 2024 Free Software Foundation, Inc.
This is free software; see the source for copying conditions. There is NO
warranty; not even for MERCHANTABILITY or FITNESS FOR A PARTICULAR PURPOSE.
-----------
Running command: -cpp -x c++ -E -dM -
-----
-----------
Detecting linker via: `/home/martin/miniforge3/envs/sage-dev/bin/x86_64-conda-linux-gnu-c++ -Wl,--version -Wl,-O2 -Wl,--sort-common -Wl,--as-needed -Wl,-z,relro -Wl,-z,now -Wl,--disable-new-dtags -Wl,--gc-sections -Wl,--allow-shlib-undefined -Wl,-rpath,/home/martin/miniforge3/envs/sage-dev/lib -Wl,-rpath-link,/home/martin/miniforge3/envs/sage-dev/lib -L/home/martin/miniforge3/envs/sage-dev/lib -fvisibility-inlines-hidden -fmessage-length=0 -march=nocona -mtune=haswell -ftree-vectorize -fPIC -fstack-protector-strong -fno-plt -O2 -ffunction-sections -pipe -isystem /home/martin/miniforge3/envs/sage-dev/include -DNDEBUG -D_FORTIFY_SOURCE=2 -O2 -isystem /home/martin/miniforge3/envs/sage-dev/include` -> 0
stdout:
GNU ld (GNU Binutils) 2.45.1
Copyright (C) 2025 Free Software Foundation, Inc.
This program is free software; you may redistribute it under the terms of
the GNU General Public License version 3 or (at your option) a later version.
This program has absolutely no warranty.
-----------
stderr:
collect2 version 14.3.0
/home/martin/miniforge3/envs/sage-dev/bin/../libexec/gcc/x86_64-conda-linux-gnu/14.3.0/ld -disable-new-dtags -plugin /home/martin/miniforge3/envs/sage-dev/bin/../libexec/gcc/x86_64-conda-linux-gnu/14.3.0/liblto_plugin.so -plugin-opt=/home/martin/miniforge3/envs/sage-dev/bin/../libexec/gcc/x86_64-conda-linux-gnu/14.3.0/lto-wrapper -plugin-opt=-fresolution=/home/martin/tmp/ccTiegTX.res -plugin-opt=-pass-through=-lgcc_s -plugin-opt=-pass-through=-lgcc -plugin-opt=-pass-through=-lc -plugin-opt=-pass-through=-lgcc_s -plugin-opt=-pass-through=-lgcc --sysroot=/home/martin/miniforge3/envs/sage-dev/bin/../x86_64-conda-linux-gnu/sysroot --eh-frame-hdr -m elf_x86_64 -dynamic-linker /lib64/ld-linux-x86-64.so.2 -pie /home/martin/miniforge3/envs/sage-dev/bin/../x86_64-conda-linux-gnu/sysroot/lib/../lib/Scrt1.o /home/martin/miniforge3/envs/sage-dev/bin/../x86_64-conda-linux-gnu/sysroot/lib/../lib/crti.o /home/martin/miniforge3/envs/sage-dev/bin/../lib/gcc/x86_64-conda-linux-gnu/14.3.0/crtbeginS.o -L/home/martin/miniforge3/envs/sage-dev/lib -L/home/martin/miniforge3/envs/sage-dev/bin/../lib/gcc/x86_64-conda-linux-gnu/14.3.0 -L/home/martin/miniforge3/envs/sage-dev/bin/../lib/gcc -L/home/martin/miniforge3/envs/sage-dev/bin/../lib/gcc/x86_64-conda-linux-gnu/14.3.0/../../../../x86_64-conda-linux-gnu/lib/../lib -L/home/martin/miniforge3/envs/sage-dev/bin/../lib/gcc/x86_64-conda-linux-gnu/14.3.0/../../../../lib -L/home/martin/miniforge3/envs/sage-dev/bin/../x86_64-conda-linux-gnu/sysroot/lib/../lib -L/home/martin/miniforge3/envs/sage-dev/bin/../x86_64-conda-linux-gnu/sysroot/usr/lib/../lib -L/home/martin/miniforge3/envs/sage-dev/bin/../lib/gcc/x86_64-conda-linux-gnu/14.3.0/../../../../x86_64-conda-linux-gnu/lib -L/home/martin/miniforge3/envs/sage-dev/bin/../lib/gcc/x86_64-conda-linux-gnu/14.3.0/../../.. -L/home/martin/miniforge3/envs/sage-dev/bin/../x86_64-conda-linux-gnu/sysroot/lib -L/home/martin/miniforge3/envs/sage-dev/bin/../x86_64-conda-linux-gnu/sysroot/usr/lib --version -O2 --sort-common --as-needed -z relro -z now --disable-new-dtags --gc-sections --allow-shlib-undefined -rpath /home/martin/miniforge3/envs/sage-dev/lib -rpath-link /home/martin/miniforge3/envs/sage-dev/lib -lstdc++ -lm -lgcc_s -lgcc -lc -lgcc_s -lgcc /home/martin/miniforge3/envs/sage-dev/bin/../lib/gcc/x86_64-conda-linux-gnu/14.3.0/crtendS.o /home/martin/miniforge3/envs/sage-dev/bin/../x86_64-conda-linux-gnu/sysroot/lib/../lib/crtn.o -rpath /home/martin/miniforge3/envs/sage-dev/lib -rpath-link /home/martin/miniforge3/envs/sage-dev/lib -L /home/martin/miniforge3/envs/sage-dev/lib/stubs -L /home/martin/miniforge3/envs/sage-dev/lib
-----------
Sanity check compiler command line: /home/martin/miniforge3/envs/sage-dev/bin/x86_64-conda-linux-gnu-c++ -D_FILE_OFFSET_BITS=64 -o sanity_check_for_cpp.exe sanity_check_for_cpp.cpp -fvisibility-inlines-hidden -fmessage-length=0 -march=nocona -mtune=haswell -ftree-vectorize -fPIC -fstack-protector-strong -fno-plt -O2 -ffunction-sections -pipe -isystem /home/martin/miniforge3/envs/sage-dev/include -DNDEBUG -D_FORTIFY_SOURCE=2 -O2 -isystem /home/martin/miniforge3/envs/sage-dev/include -fvisibility-inlines-hidden -fmessage-length=0 -march=nocona -mtune=haswell -ftree-vectorize -fPIC -fstack-protector-strong -fno-plt -O2 -ffunction-sections -pipe -isystem /home/martin/miniforge3/envs/sage-dev/include -DNDEBUG -D_FORTIFY_SOURCE=2 -O2 -isystem /home/martin/miniforge3/envs/sage-dev/include -D_FILE_OFFSET_BITS=64 -Wl,-O2 -Wl,--sort-common -Wl,--as-needed -Wl,-z,relro -Wl,-z,now -Wl,--disable-new-dtags -Wl,--gc-sections -Wl,--allow-shlib-undefined -Wl,-rpath,/home/martin/miniforge3/envs/sage-dev/lib -Wl,-rpath-link,/home/martin/miniforge3/envs/sage-dev/lib -L/home/martin/miniforge3/envs/sage-dev/lib -fvisibility-inlines-hidden -fmessage-length=0 -march=nocona -mtune=haswell -ftree-vectorize -fPIC -fstack-protector-strong -fno-plt -O2 -ffunction-sections -pipe -isystem /home/martin/miniforge3/envs/sage-dev/include -DNDEBUG -D_FORTIFY_SOURCE=2 -O2 -isystem /home/martin/miniforge3/envs/sage-dev/include -Wl,-O2 -Wl,--sort-common -Wl,--as-needed -Wl,-z,relro -Wl,-z,now -Wl,--disable-new-dtags -Wl,--gc-sections -Wl,--allow-shlib-undefined -Wl,-rpath,/home/martin/miniforge3/envs/sage-dev/lib -Wl,-rpath-link,/home/martin/miniforge3/envs/sage-dev/lib -L/home/martin/miniforge3/envs/sage-dev/lib
Sanity check compile stdout:
-----
Sanity check compile stderr:
-----
Sanity check built target output for host machine cpp compiler
-- Running test binary command: /home/martin/sage-trac/build/cp312/meson-private/sanity_check_for_cpp.exe
-----------
Sanity check: `/home/martin/sage-trac/build/cp312/meson-private/sanity_check_for_cpp.exe` -> 0
-- stdout:
-- stderr:
-- returncode: 0
C++ compiler for the host machine: /home/martin/miniforge3/envs/sage-dev/bin/x86_64-conda-linux-gnu-c++ (gcc 14.3.0 "x86_64-conda-linux-gnu-c++ (conda-forge gcc 14.3.0-18) 14.3.0")
C++ linker for the host machine: /home/martin/miniforge3/envs/sage-dev/bin/x86_64-conda-linux-gnu-c++ ld.bfd 2.45.1
-----------
Detecting compiler via: `cython -V` -> 0
stdout:
Cython version 3.2.4
-----------
stderr:
Cython version 3.2.4
-----------
Sanity check transpiler command line: cython --fast-fail -o sanity_check_for_cython.c sanity_check_for_cython.pyx -3
Sanity check transpiler stdout:
-----
Sanity check transpiler stderr:
-----
Pkg-config binary missing from cross or native file, or env var undefined.
Trying a default Pkg-config fallback at pkg-config
Found pkg-config: YES (/home/martin/miniforge3/envs/sage-dev/bin/pkg-config) 0.29.2
Determining dependency 'python3' with pkg-config executable '/home/martin/miniforge3/envs/sage-dev/bin/pkg-config'
env[PKG_CONFIG_PATH]:
env[PKG_CONFIG]: /home/martin/miniforge3/envs/sage-dev/bin/pkg-config
-----------
Called: `/home/martin/miniforge3/envs/sage-dev/bin/pkg-config --modversion python3` -> 0
stdout:
3.12
-----------
env[PKG_CONFIG_PATH]:
env[PKG_CONFIG]: /home/martin/miniforge3/envs/sage-dev/bin/pkg-config
-----------
Called: `/home/martin/miniforge3/envs/sage-dev/bin/pkg-config --cflags python3` -> 0
stdout:
-I/home/martin/miniforge3/envs/sage-dev/include/python3.12
-----------
env[PKG_CONFIG_ALLOW_SYSTEM_LIBS]: 1
env[PKG_CONFIG_PATH]:
env[PKG_CONFIG]: /home/martin/miniforge3/envs/sage-dev/bin/pkg-config
-----------
Called: `/home/martin/miniforge3/envs/sage-dev/bin/pkg-config --libs python3` -> 0
stdout:
-L/home/martin/miniforge3/envs/sage-dev/lib
-----------
env[PKG_CONFIG_PATH]:
env[PKG_CONFIG]: /home/martin/miniforge3/envs/sage-dev/bin/pkg-config
-----------
Called: `/home/martin/miniforge3/envs/sage-dev/bin/pkg-config --libs python3` -> 0
stdout:
-L/home/martin/miniforge3/envs/sage-dev/lib
-----------
Run-time dependency python3 found: YES 3.12
checking compilation of transpiled source:
Sanity check compiler command line: /home/martin/miniforge3/envs/sage-dev/bin/x86_64-conda-linux-gnu-cc -D_FILE_OFFSET_BITS=64 -o sanity_check_for_cython.so sanity_check_for_cython.c -march=nocona -mtune=haswell -ftree-vectorize -fPIC -fstack-protector-strong -fno-plt -O2 -ffunction-sections -pipe -isystem /home/martin/miniforge3/envs/sage-dev/include -DNDEBUG -D_FORTIFY_SOURCE=2 -O2 -isystem /home/martin/miniforge3/envs/sage-dev/include -march=nocona -mtune=haswell -ftree-vectorize -fPIC -fstack-protector-strong -fno-plt -O2 -ffunction-sections -pipe -isystem /home/martin/miniforge3/envs/sage-dev/include -DNDEBUG -D_FORTIFY_SOURCE=2 -O2 -isystem /home/martin/miniforge3/envs/sage-dev/include -D_FILE_OFFSET_BITS=64 -fPIC -I/home/martin/miniforge3/envs/sage-dev/include/python3.12 -Wl,-O2 -Wl,--sort-common -Wl,--as-needed -Wl,-z,relro -Wl,-z,now -Wl,--disable-new-dtags -Wl,--gc-sections -Wl,--allow-shlib-undefined -Wl,-rpath,/home/martin/miniforge3/envs/sage-dev/lib -Wl,-rpath-link,/home/martin/miniforge3/envs/sage-dev/lib -L/home/martin/miniforge3/envs/sage-dev/lib -march=nocona -mtune=haswell -ftree-vectorize -fPIC -fstack-protector-strong -fno-plt -O2 -ffunction-sections -pipe -isystem /home/martin/miniforge3/envs/sage-dev/include -DNDEBUG -D_FORTIFY_SOURCE=2 -O2 -isystem /home/martin/miniforge3/envs/sage-dev/include -Wl,-O2 -Wl,--sort-common -Wl,--as-needed -Wl,-z,relro -Wl,-z,now -Wl,--disable-new-dtags -Wl,--gc-sections -Wl,--allow-shlib-undefined -Wl,-rpath,/home/martin/miniforge3/envs/sage-dev/lib -Wl,-rpath-link,/home/martin/miniforge3/envs/sage-dev/lib -L/home/martin/miniforge3/envs/sage-dev/lib -shared -Wl,--allow-shlib-undefined
Sanity check compile stdout:
-----
Sanity check compile stderr:
-----
Cython compiler for the host machine: cython (cython 3.2.4)
-----------
Detecting compiler via: `/home/martin/miniforge3/envs/sage-dev/bin/x86_64-conda-linux-gnu-cc --version` -> 0
stdout:
x86_64-conda-linux-gnu-cc (conda-forge gcc 14.3.0-18) 14.3.0
Copyright (C) 2024 Free Software Foundation, Inc.
This is free software; see the source for copying conditions. There is NO
warranty; not even for MERCHANTABILITY or FITNESS FOR A PARTICULAR PURPOSE.
-----------
Running command: -cpp -x c -E -dM -
-----
-----------
Detecting linker via: `/home/martin/miniforge3/envs/sage-dev/bin/x86_64-conda-linux-gnu-cc -Wl,--version -Wl,-O2 -Wl,--sort-common -Wl,--as-needed -Wl,-z,relro -Wl,-z,now -Wl,--disable-new-dtags -Wl,--gc-sections -Wl,--allow-shlib-undefined -Wl,-rpath,/home/martin/miniforge3/envs/sage-dev/lib -Wl,-rpath-link,/home/martin/miniforge3/envs/sage-dev/lib -L/home/martin/miniforge3/envs/sage-dev/lib -march=nocona -mtune=haswell -ftree-vectorize -fPIC -fstack-protector-strong -fno-plt -O2 -ffunction-sections -pipe -isystem /home/martin/miniforge3/envs/sage-dev/include -DNDEBUG -D_FORTIFY_SOURCE=2 -O2 -isystem /home/martin/miniforge3/envs/sage-dev/include` -> 0
stdout:
GNU ld (GNU Binutils) 2.45.1
Copyright (C) 2025 Free Software Foundation, Inc.
This program is free software; you may redistribute it under the terms of
the GNU General Public License version 3 or (at your option) a later version.
This program has absolutely no warranty.
-----------
stderr:
collect2 version 14.3.0
/home/martin/miniforge3/envs/sage-dev/bin/../libexec/gcc/x86_64-conda-linux-gnu/14.3.0/ld -disable-new-dtags -plugin /home/martin/miniforge3/envs/sage-dev/bin/../libexec/gcc/x86_64-conda-linux-gnu/14.3.0/liblto_plugin.so -plugin-opt=/home/martin/miniforge3/envs/sage-dev/bin/../libexec/gcc/x86_64-conda-linux-gnu/14.3.0/lto-wrapper -plugin-opt=-fresolution=/home/martin/tmp/cckZtMfm.res -plugin-opt=-pass-through=-lgcc -plugin-opt=-pass-through=-lgcc_s -plugin-opt=-pass-through=-lc -plugin-opt=-pass-through=-lgcc -plugin-opt=-pass-through=-lgcc_s --sysroot=/home/martin/miniforge3/envs/sage-dev/bin/../x86_64-conda-linux-gnu/sysroot --eh-frame-hdr -m elf_x86_64 -dynamic-linker /lib64/ld-linux-x86-64.so.2 -pie /home/martin/miniforge3/envs/sage-dev/bin/../x86_64-conda-linux-gnu/sysroot/lib/../lib/Scrt1.o /home/martin/miniforge3/envs/sage-dev/bin/../x86_64-conda-linux-gnu/sysroot/lib/../lib/crti.o /home/martin/miniforge3/envs/sage-dev/bin/../lib/gcc/x86_64-conda-linux-gnu/14.3.0/crtbeginS.o -L/home/martin/miniforge3/envs/sage-dev/lib -L/home/martin/miniforge3/envs/sage-dev/bin/../lib/gcc/x86_64-conda-linux-gnu/14.3.0 -L/home/martin/miniforge3/envs/sage-dev/bin/../lib/gcc -L/home/martin/miniforge3/envs/sage-dev/bin/../lib/gcc/x86_64-conda-linux-gnu/14.3.0/../../../../x86_64-conda-linux-gnu/lib/../lib -L/home/martin/miniforge3/envs/sage-dev/bin/../lib/gcc/x86_64-conda-linux-gnu/14.3.0/../../../../lib -L/home/martin/miniforge3/envs/sage-dev/bin/../x86_64-conda-linux-gnu/sysroot/lib/../lib -L/home/martin/miniforge3/envs/sage-dev/bin/../x86_64-conda-linux-gnu/sysroot/usr/lib/../lib -L/home/martin/miniforge3/envs/sage-dev/bin/../lib/gcc/x86_64-conda-linux-gnu/14.3.0/../../../../x86_64-conda-linux-gnu/lib -L/home/martin/miniforge3/envs/sage-dev/bin/../lib/gcc/x86_64-conda-linux-gnu/14.3.0/../../.. -L/home/martin/miniforge3/envs/sage-dev/bin/../x86_64-conda-linux-gnu/sysroot/lib -L/home/martin/miniforge3/envs/sage-dev/bin/../x86_64-conda-linux-gnu/sysroot/usr/lib --version -O2 --sort-common --as-needed -z relro -z now --disable-new-dtags --gc-sections --allow-shlib-undefined -rpath /home/martin/miniforge3/envs/sage-dev/lib -rpath-link /home/martin/miniforge3/envs/sage-dev/lib -lgcc --push-state --as-needed -lgcc_s --pop-state -lc -lgcc --push-state --as-needed -lgcc_s --pop-state /home/martin/miniforge3/envs/sage-dev/bin/../lib/gcc/x86_64-conda-linux-gnu/14.3.0/crtendS.o /home/martin/miniforge3/envs/sage-dev/bin/../x86_64-conda-linux-gnu/sysroot/lib/../lib/crtn.o -rpath /home/martin/miniforge3/envs/sage-dev/lib -rpath-link /home/martin/miniforge3/envs/sage-dev/lib -L /home/martin/miniforge3/envs/sage-dev/lib/stubs -L /home/martin/miniforge3/envs/sage-dev/lib
-----------
Sanity check compiler command line: /home/martin/miniforge3/envs/sage-dev/bin/x86_64-conda-linux-gnu-cc -D_FILE_OFFSET_BITS=64 -o sanity_check_for_c.exe sanity_check_for_c.c -march=nocona -mtune=haswell -ftree-vectorize -fPIC -fstack-protector-strong -fno-plt -O2 -ffunction-sections -pipe -isystem /home/martin/miniforge3/envs/sage-dev/include -DNDEBUG -D_FORTIFY_SOURCE=2 -O2 -isystem /home/martin/miniforge3/envs/sage-dev/include -march=nocona -mtune=haswell -ftree-vectorize -fPIC -fstack-protector-strong -fno-plt -O2 -ffunction-sections -pipe -isystem /home/martin/miniforge3/envs/sage-dev/include -DNDEBUG -D_FORTIFY_SOURCE=2 -O2 -isystem /home/martin/miniforge3/envs/sage-dev/include -D_FILE_OFFSET_BITS=64 -Wl,-O2 -Wl,--sort-common -Wl,--as-needed -Wl,-z,relro -Wl,-z,now -Wl,--disable-new-dtags -Wl,--gc-sections -Wl,--allow-shlib-undefined -Wl,-rpath,/home/martin/miniforge3/envs/sage-dev/lib -Wl,-rpath-link,/home/martin/miniforge3/envs/sage-dev/lib -L/home/martin/miniforge3/envs/sage-dev/lib -march=nocona -mtune=haswell -ftree-vectorize -fPIC -fstack-protector-strong -fno-plt -O2 -ffunction-sections -pipe -isystem /home/martin/miniforge3/envs/sage-dev/include -DNDEBUG -D_FORTIFY_SOURCE=2 -O2 -isystem /home/martin/miniforge3/envs/sage-dev/include -Wl,-O2 -Wl,--sort-common -Wl,--as-needed -Wl,-z,relro -Wl,-z,now -Wl,--disable-new-dtags -Wl,--gc-sections -Wl,--allow-shlib-undefined -Wl,-rpath,/home/martin/miniforge3/envs/sage-dev/lib -Wl,-rpath-link,/home/martin/miniforge3/envs/sage-dev/lib -L/home/martin/miniforge3/envs/sage-dev/lib
Sanity check compile stdout:
-----
Sanity check compile stderr:
-----
Sanity check built target output for build machine c compiler
-- Running test binary command: /home/martin/sage-trac/build/cp312/meson-private/sanity_check_for_c.exe
-----------
Sanity check: `/home/martin/sage-trac/build/cp312/meson-private/sanity_check_for_c.exe` -> 0
-- stdout:
-- stderr:
-- returncode: 0
C compiler for the build machine: /home/martin/miniforge3/envs/sage-dev/bin/x86_64-conda-linux-gnu-cc (gcc 14.3.0 "x86_64-conda-linux-gnu-cc (conda-forge gcc 14.3.0-18) 14.3.0")
C linker for the build machine: /home/martin/miniforge3/envs/sage-dev/bin/x86_64-conda-linux-gnu-cc ld.bfd 2.45.1
-----------
Detecting compiler via: `/home/martin/miniforge3/envs/sage-dev/bin/x86_64-conda-linux-gnu-c++ --version` -> 0
stdout:
x86_64-conda-linux-gnu-c++ (conda-forge gcc 14.3.0-18) 14.3.0
Copyright (C) 2024 Free Software Foundation, Inc.
This is free software; see the source for copying conditions. There is NO
warranty; not even for MERCHANTABILITY or FITNESS FOR A PARTICULAR PURPOSE.
-----------
Running command: -cpp -x c++ -E -dM -
-----
-----------
Detecting linker via: `/home/martin/miniforge3/envs/sage-dev/bin/x86_64-conda-linux-gnu-c++ -Wl,--version -Wl,-O2 -Wl,--sort-common -Wl,--as-needed -Wl,-z,relro -Wl,-z,now -Wl,--disable-new-dtags -Wl,--gc-sections -Wl,--allow-shlib-undefined -Wl,-rpath,/home/martin/miniforge3/envs/sage-dev/lib -Wl,-rpath-link,/home/martin/miniforge3/envs/sage-dev/lib -L/home/martin/miniforge3/envs/sage-dev/lib -fvisibility-inlines-hidden -fmessage-length=0 -march=nocona -mtune=haswell -ftree-vectorize -fPIC -fstack-protector-strong -fno-plt -O2 -ffunction-sections -pipe -isystem /home/martin/miniforge3/envs/sage-dev/include -DNDEBUG -D_FORTIFY_SOURCE=2 -O2 -isystem /home/martin/miniforge3/envs/sage-dev/include` -> 0
stdout:
GNU ld (GNU Binutils) 2.45.1
Copyright (C) 2025 Free Software Foundation, Inc.
This program is free software; you may redistribute it under the terms of
the GNU General Public License version 3 or (at your option) a later version.
This program has absolutely no warranty.
-----------
stderr:
collect2 version 14.3.0
/home/martin/miniforge3/envs/sage-dev/bin/../libexec/gcc/x86_64-conda-linux-gnu/14.3.0/ld -disable-new-dtags -plugin /home/martin/miniforge3/envs/sage-dev/bin/../libexec/gcc/x86_64-conda-linux-gnu/14.3.0/liblto_plugin.so -plugin-opt=/home/martin/miniforge3/envs/sage-dev/bin/../libexec/gcc/x86_64-conda-linux-gnu/14.3.0/lto-wrapper -plugin-opt=-fresolution=/home/martin/tmp/cc95Cxov.res -plugin-opt=-pass-through=-lgcc_s -plugin-opt=-pass-through=-lgcc -plugin-opt=-pass-through=-lc -plugin-opt=-pass-through=-lgcc_s -plugin-opt=-pass-through=-lgcc --sysroot=/home/martin/miniforge3/envs/sage-dev/bin/../x86_64-conda-linux-gnu/sysroot --eh-frame-hdr -m elf_x86_64 -dynamic-linker /lib64/ld-linux-x86-64.so.2 -pie /home/martin/miniforge3/envs/sage-dev/bin/../x86_64-conda-linux-gnu/sysroot/lib/../lib/Scrt1.o /home/martin/miniforge3/envs/sage-dev/bin/../x86_64-conda-linux-gnu/sysroot/lib/../lib/crti.o /home/martin/miniforge3/envs/sage-dev/bin/../lib/gcc/x86_64-conda-linux-gnu/14.3.0/crtbeginS.o -L/home/martin/miniforge3/envs/sage-dev/lib -L/home/martin/miniforge3/envs/sage-dev/bin/../lib/gcc/x86_64-conda-linux-gnu/14.3.0 -L/home/martin/miniforge3/envs/sage-dev/bin/../lib/gcc -L/home/martin/miniforge3/envs/sage-dev/bin/../lib/gcc/x86_64-conda-linux-gnu/14.3.0/../../../../x86_64-conda-linux-gnu/lib/../lib -L/home/martin/miniforge3/envs/sage-dev/bin/../lib/gcc/x86_64-conda-linux-gnu/14.3.0/../../../../lib -L/home/martin/miniforge3/envs/sage-dev/bin/../x86_64-conda-linux-gnu/sysroot/lib/../lib -L/home/martin/miniforge3/envs/sage-dev/bin/../x86_64-conda-linux-gnu/sysroot/usr/lib/../lib -L/home/martin/miniforge3/envs/sage-dev/bin/../lib/gcc/x86_64-conda-linux-gnu/14.3.0/../../../../x86_64-conda-linux-gnu/lib -L/home/martin/miniforge3/envs/sage-dev/bin/../lib/gcc/x86_64-conda-linux-gnu/14.3.0/../../.. -L/home/martin/miniforge3/envs/sage-dev/bin/../x86_64-conda-linux-gnu/sysroot/lib -L/home/martin/miniforge3/envs/sage-dev/bin/../x86_64-conda-linux-gnu/sysroot/usr/lib --version -O2 --sort-common --as-needed -z relro -z now --disable-new-dtags --gc-sections --allow-shlib-undefined -rpath /home/martin/miniforge3/envs/sage-dev/lib -rpath-link /home/martin/miniforge3/envs/sage-dev/lib -lstdc++ -lm -lgcc_s -lgcc -lc -lgcc_s -lgcc /home/martin/miniforge3/envs/sage-dev/bin/../lib/gcc/x86_64-conda-linux-gnu/14.3.0/crtendS.o /home/martin/miniforge3/envs/sage-dev/bin/../x86_64-conda-linux-gnu/sysroot/lib/../lib/crtn.o -rpath /home/martin/miniforge3/envs/sage-dev/lib -rpath-link /home/martin/miniforge3/envs/sage-dev/lib -L /home/martin/miniforge3/envs/sage-dev/lib/stubs -L /home/martin/miniforge3/envs/sage-dev/lib
-----------
Sanity check compiler command line: /home/martin/miniforge3/envs/sage-dev/bin/x86_64-conda-linux-gnu-c++ -D_FILE_OFFSET_BITS=64 -o sanity_check_for_cpp.exe sanity_check_for_cpp.cpp -fvisibility-inlines-hidden -fmessage-length=0 -march=nocona -mtune=haswell -ftree-vectorize -fPIC -fstack-protector-strong -fno-plt -O2 -ffunction-sections -pipe -isystem /home/martin/miniforge3/envs/sage-dev/include -DNDEBUG -D_FORTIFY_SOURCE=2 -O2 -isystem /home/martin/miniforge3/envs/sage-dev/include -fvisibility-inlines-hidden -fmessage-length=0 -march=nocona -mtune=haswell -ftree-vectorize -fPIC -fstack-protector-strong -fno-plt -O2 -ffunction-sections -pipe -isystem /home/martin/miniforge3/envs/sage-dev/include -DNDEBUG -D_FORTIFY_SOURCE=2 -O2 -isystem /home/martin/miniforge3/envs/sage-dev/include -D_FILE_OFFSET_BITS=64 -Wl,-O2 -Wl,--sort-common -Wl,--as-needed -Wl,-z,relro -Wl,-z,now -Wl,--disable-new-dtags -Wl,--gc-sections -Wl,--allow-shlib-undefined -Wl,-rpath,/home/martin/miniforge3/envs/sage-dev/lib -Wl,-rpath-link,/home/martin/miniforge3/envs/sage-dev/lib -L/home/martin/miniforge3/envs/sage-dev/lib -fvisibility-inlines-hidden -fmessage-length=0 -march=nocona -mtune=haswell -ftree-vectorize -fPIC -fstack-protector-strong -fno-plt -O2 -ffunction-sections -pipe -isystem /home/martin/miniforge3/envs/sage-dev/include -DNDEBUG -D_FORTIFY_SOURCE=2 -O2 -isystem /home/martin/miniforge3/envs/sage-dev/include -Wl,-O2 -Wl,--sort-common -Wl,--as-needed -Wl,-z,relro -Wl,-z,now -Wl,--disable-new-dtags -Wl,--gc-sections -Wl,--allow-shlib-undefined -Wl,-rpath,/home/martin/miniforge3/envs/sage-dev/lib -Wl,-rpath-link,/home/martin/miniforge3/envs/sage-dev/lib -L/home/martin/miniforge3/envs/sage-dev/lib
Sanity check compile stdout:
-----
Sanity check compile stderr:
-----
Sanity check built target output for build machine cpp compiler
-- Running test binary command: /home/martin/sage-trac/build/cp312/meson-private/sanity_check_for_cpp.exe
-----------
Sanity check: `/home/martin/sage-trac/build/cp312/meson-private/sanity_check_for_cpp.exe` -> 0
-- stdout:
-- stderr:
-- returncode: 0
C++ compiler for the build machine: /home/martin/miniforge3/envs/sage-dev/bin/x86_64-conda-linux-gnu-c++ (gcc 14.3.0 "x86_64-conda-linux-gnu-c++ (conda-forge gcc 14.3.0-18) 14.3.0")
C++ linker for the build machine: /home/martin/miniforge3/envs/sage-dev/bin/x86_64-conda-linux-gnu-c++ ld.bfd 2.45.1
-----------
Detecting compiler via: `cython -V` -> 0
stdout:
Cython version 3.2.4
-----------
stderr:
Cython version 3.2.4
-----------
Sanity check transpiler command line: cython --fast-fail -o sanity_check_for_cython.c sanity_check_for_cython.pyx -3
Sanity check transpiler stdout:
-----
Sanity check transpiler stderr:
-----
Pkg-config binary missing from cross or native file, or env var undefined.
Trying a default Pkg-config fallback at pkg-config
Found pkg-config: YES (/home/martin/miniforge3/envs/sage-dev/bin/pkg-config) 0.29.2
Determining dependency 'python3' with pkg-config executable '/home/martin/miniforge3/envs/sage-dev/bin/pkg-config'
env[PKG_CONFIG_PATH]:
env[PKG_CONFIG]: /home/martin/miniforge3/envs/sage-dev/bin/pkg-config
-----------
Called: `/home/martin/miniforge3/envs/sage-dev/bin/pkg-config --modversion python3` -> 0
stdout:
3.12
-----------
env[PKG_CONFIG_PATH]:
env[PKG_CONFIG]: /home/martin/miniforge3/envs/sage-dev/bin/pkg-config
-----------
Called: `/home/martin/miniforge3/envs/sage-dev/bin/pkg-config --cflags python3` -> 0
stdout:
-I/home/martin/miniforge3/envs/sage-dev/include/python3.12
-----------
env[PKG_CONFIG_ALLOW_SYSTEM_LIBS]: 1
env[PKG_CONFIG_PATH]:
env[PKG_CONFIG]: /home/martin/miniforge3/envs/sage-dev/bin/pkg-config
-----------
Called: `/home/martin/miniforge3/envs/sage-dev/bin/pkg-config --libs python3` -> 0
stdout:
-L/home/martin/miniforge3/envs/sage-dev/lib
-----------
env[PKG_CONFIG_PATH]:
env[PKG_CONFIG]: /home/martin/miniforge3/envs/sage-dev/bin/pkg-config
-----------
Called: `/home/martin/miniforge3/envs/sage-dev/bin/pkg-config --libs python3` -> 0
stdout:
-L/home/martin/miniforge3/envs/sage-dev/lib
-----------
Build-time dependency python3 found: YES 3.12
checking compilation of transpiled source:
Sanity check compiler command line: /home/martin/miniforge3/envs/sage-dev/bin/x86_64-conda-linux-gnu-cc -D_FILE_OFFSET_BITS=64 -o sanity_check_for_cython.so sanity_check_for_cython.c -march=nocona -mtune=haswell -ftree-vectorize -fPIC -fstack-protector-strong -fno-plt -O2 -ffunction-sections -pipe -isystem /home/martin/miniforge3/envs/sage-dev/include -DNDEBUG -D_FORTIFY_SOURCE=2 -O2 -isystem /home/martin/miniforge3/envs/sage-dev/include -march=nocona -mtune=haswell -ftree-vectorize -fPIC -fstack-protector-strong -fno-plt -O2 -ffunction-sections -pipe -isystem /home/martin/miniforge3/envs/sage-dev/include -DNDEBUG -D_FORTIFY_SOURCE=2 -O2 -isystem /home/martin/miniforge3/envs/sage-dev/include -D_FILE_OFFSET_BITS=64 -fPIC -I/home/martin/miniforge3/envs/sage-dev/include/python3.12 -Wl,-O2 -Wl,--sort-common -Wl,--as-needed -Wl,-z,relro -Wl,-z,now -Wl,--disable-new-dtags -Wl,--gc-sections -Wl,--allow-shlib-undefined -Wl,-rpath,/home/martin/miniforge3/envs/sage-dev/lib -Wl,-rpath-link,/home/martin/miniforge3/envs/sage-dev/lib -L/home/martin/miniforge3/envs/sage-dev/lib -march=nocona -mtune=haswell -ftree-vectorize -fPIC -fstack-protector-strong -fno-plt -O2 -ffunction-sections -pipe -isystem /home/martin/miniforge3/envs/sage-dev/include -DNDEBUG -D_FORTIFY_SOURCE=2 -O2 -isystem /home/martin/miniforge3/envs/sage-dev/include -Wl,-O2 -Wl,--sort-common -Wl,--as-needed -Wl,-z,relro -Wl,-z,now -Wl,--disable-new-dtags -Wl,--gc-sections -Wl,--allow-shlib-undefined -Wl,-rpath,/home/martin/miniforge3/envs/sage-dev/lib -Wl,-rpath-link,/home/martin/miniforge3/envs/sage-dev/lib -L/home/martin/miniforge3/envs/sage-dev/lib -shared -Wl,--allow-shlib-undefined
Sanity check compile stdout:
-----
Sanity check compile stderr:
-----
Cython compiler for the build machine: cython (cython 3.2.4)
Build machine cpu family: x86_64
Build machine cpu: x86_64
Host machine cpu family: x86_64
Host machine cpu: x86_64
Target machine cpu family: x86_64
Target machine cpu: x86_64
Program python found: YES (/home/martin/miniforge3/envs/sage-dev/bin/python3.12)
Searching for '/home/martin/miniforge3/envs/sage-dev/lib/pkgconfig' via pkgconfig lookup in LIBPC
Pkg-config binary missing from cross or native file, or env var undefined.
Trying a default Pkg-config fallback at pkg-config
Found pkg-config: YES (/home/martin/miniforge3/envs/sage-dev/bin/pkg-config) 0.29.2
Determining dependency 'python-3.12' with pkg-config executable '/home/martin/miniforge3/envs/sage-dev/bin/pkg-config'
env[PKG_CONFIG_PATH]: /home/martin/miniforge3/envs/sage-dev/lib/pkgconfig
env[PKG_CONFIG]: /home/martin/miniforge3/envs/sage-dev/bin/pkg-config
-----------
Called: `/home/martin/miniforge3/envs/sage-dev/bin/pkg-config --modversion python-3.12` -> 0
stdout:
3.12
-----------
env[PKG_CONFIG_PATH]: /home/martin/miniforge3/envs/sage-dev/lib/pkgconfig
env[PKG_CONFIG]: /home/martin/miniforge3/envs/sage-dev/bin/pkg-config
-----------
Called: `/home/martin/miniforge3/envs/sage-dev/bin/pkg-config --cflags python-3.12` -> 0
stdout:
-I/home/martin/miniforge3/envs/sage-dev/include/python3.12
-----------
env[PKG_CONFIG_ALLOW_SYSTEM_LIBS]: 1
env[PKG_CONFIG_PATH]: /home/martin/miniforge3/envs/sage-dev/lib/pkgconfig
env[PKG_CONFIG]: /home/martin/miniforge3/envs/sage-dev/bin/pkg-config
-----------
Called: `/home/martin/miniforge3/envs/sage-dev/bin/pkg-config --libs python-3.12` -> 0
stdout:
-L/home/martin/miniforge3/envs/sage-dev/lib
-----------
env[PKG_CONFIG_PATH]: /home/martin/miniforge3/envs/sage-dev/lib/pkgconfig
env[PKG_CONFIG]: /home/martin/miniforge3/envs/sage-dev/bin/pkg-config
-----------
Called: `/home/martin/miniforge3/envs/sage-dev/bin/pkg-config --libs python-3.12` -> 0
stdout:
-L/home/martin/miniforge3/envs/sage-dev/lib
-----------
Run-time dependency python found: YES 3.12
Program python (pytest) found: YES (/home/martin/miniforge3/envs/sage-dev/bin/python3.12) modules: pytest
Adding test "pytest"
Running command: /home/martin/miniforge3/envs/sage-dev/bin/python3.12 -c '
from pathlib import Path
content = "# Here so that cython creates the correct module name"
file_paths = [
'"'"'src/sage/interfaces/__init__.py'"'"',
'"'"'src/sage/crypto/block_cipher/__init__.py'"'"',
'"'"'src/sage/crypto/public_key/__init__.py'"'"',
'"'"'src/sage/logic/__init__.py'"'"',
'"'"'src/sage/parallel/__init__.py'"'"',
'"'"'src/sage/dynamics/cellular_automata/__init__.py'"'"',
'"'"'src/sage/dynamics/arithmetic_dynamics/__init__.py'"'"',
'"'"'src/sage/dynamics/__init__.py'"'"',
'"'"'src/sage/dynamics/complex_dynamics/__init__.py'"'"',
'"'"'src/sage/knots/__init__.py'"'"',
'"'"'src/sage/topology/__init__.py'"'"',
'"'"'src/sage/functions/__init__.py'"'"',
'"'"'src/sage/manifolds/subsets/__init__.py'"'"',
'"'"'src/sage/manifolds/__init__.py'"'"',
'"'"'src/sage/manifolds/differentiable/examples/__init__.py'"'"',
'"'"'src/sage/manifolds/differentiable/__init__.py'"'"',
'"'"'src/sage/coding/source_coding/__init__.py'"'"',
'"'"'src/sage/coding/guruswami_sudan/__init__.py'"'"',
'"'"'src/sage/coding/__init__.py'"'"',
'"'"'src/sage/coding/codecan/__init__.py'"'"',
'"'"'src/sage/games/__init__.py'"'"',
'"'"'src/sage/quivers/__init__.py'"'"',
'"'"'src/sage/schemes/cyclic_covers/__init__.py'"'"',
'"'"'src/sage/schemes/plane_conics/__init__.py'"'"',
'"'"'src/sage/schemes/curves/__init__.py'"'"',
'"'"'src/sage/schemes/plane_quartics/__init__.py'"'"',
'"'"'src/sage/schemes/jacobians/__init__.py'"'"',
'"'"'src/sage/schemes/toric/sheaf/__init__.py'"'"',
'"'"'src/sage/schemes/toric/__init__.py'"'"',
'"'"'src/sage/schemes/product_projective/__init__.py'"'"',
'"'"'src/sage/schemes/elliptic_curves/__init__.py'"'"',
'"'"'src/sage/schemes/riemann_surfaces/__init__.py'"'"',
'"'"'src/sage/schemes/hyperelliptic_curves/__init__.py'"'"',
'"'"'src/sage/schemes/berkovich/__init__.py'"'"',
'"'"'src/sage/schemes/generic/__init__.py'"'"',
'"'"'src/sage/schemes/projective/__init__.py'"'"',
'"'"'src/sage/schemes/__init__.py'"'"',
'"'"'src/sage/schemes/affine/__init__.py'"'"',
'"'"'src/sage/modular/hecke/__init__.py'"'"',
'"'"'src/sage/modular/pollack_stevens/__init__.py'"'"',
'"'"'src/sage/modular/overconvergent/__init__.py'"'"',
'"'"'src/sage/modular/modform/__init__.py'"'"',
'"'"'src/sage/modular/quasimodform/__init__.py'"'"',
'"'"'src/sage/modular/modsym/__init__.py'"'"',
'"'"'src/sage/modular/local_comp/__init__.py'"'"',
'"'"'src/sage/modular/quatalg/__init__.py'"'"',
'"'"'src/sage/modular/ssmod/__init__.py'"'"',
'"'"'src/sage/modular/abvar/__init__.py'"'"',
'"'"'src/sage/modular/__init__.py'"'"',
'"'"'src/sage/modular/btquotients/__init__.py'"'"',
'"'"'src/sage/modular/arithgroup/__init__.py'"'"',
'"'"'src/sage/modular/modform_hecketriangle/__init__.py'"'"',
'"'"'src/sage/combinat/cluster_algebra_quiver/__init__.py'"'"',
'"'"'src/sage/combinat/root_system/__init__.py'"'"',
'"'"'src/sage/combinat/species/__init__.py'"'"',
'"'"'src/sage/combinat/designs/__init__.py'"'"',
'"'"'src/sage/combinat/posets/__init__.py'"'"',
'"'"'src/sage/combinat/matrices/__init__.py'"'"',
'"'"'src/sage/combinat/rigged_configurations/__init__.py'"'"',
'"'"'src/sage/combinat/ncsf_qsym/__init__.py'"'"',
'"'"'src/sage/combinat/path_tableaux/__init__.py'"'"',
'"'"'src/sage/combinat/sf/__init__.py'"'"',
'"'"'src/sage/combinat/__init__.py'"'"',
'"'"'src/sage/combinat/chas/__init__.py'"'"',
'"'"'src/sage/combinat/ncsym/__init__.py'"'"',
'"'"'src/sage/combinat/words/__init__.py'"'"',
'"'"'src/sage/combinat/crystals/__init__.py'"'"',
'"'"'src/sage/tensor/modules/__init__.py'"'"',
'"'"'src/sage/tensor/__init__.py'"'"',
'"'"'src/sage/groups/matrix_gps/__init__.py'"'"',
'"'"'src/sage/groups/semimonomial_transformations/__init__.py'"'"',
'"'"'src/sage/groups/perm_gps/partn_ref2/__init__.py'"'"',
'"'"'src/sage/groups/perm_gps/partn_ref/__init__.py'"'"',
'"'"'src/sage/groups/perm_gps/__init__.py'"'"',
'"'"'src/sage/groups/__init__.py'"'"',
'"'"'src/sage/groups/affine_gps/__init__.py'"'"',
'"'"'src/sage/groups/abelian_gps/__init__.py'"'"',
'"'"'src/sage/groups/additive_abelian/__init__.py'"'"',
'"'"'src/sage/groups/lie_gps/__init__.py'"'"',
'"'"'src/sage/groups/misc_gps/__init__.py'"'"',
'"'"'src/sage/symbolic/__init__.py'"'"',
'"'"'src/sage/symbolic/integration/__init__.py'"'"',
'"'"'src/sage/lfunctions/__init__.py'"'"',
'"'"'src/sage/arith/__init__.py'"'"',
'"'"'src/sage/ext/__init__.py'"'"',
'"'"'src/sage/ext/interpreters/__init__.py'"'"',
'"'"'src/sage/categories/examples/__init__.py'"'"',
'"'"'src/sage/modules/fg_pid/__init__.py'"'"',
'"'"'src/sage/modules/__init__.py'"'"',
'"'"'src/sage/modules/with_basis/__init__.py'"'"',
'"'"'src/sage/modules/fp_graded/steenrod/__init__.py'"'"',
'"'"'src/sage/modules/fp_graded/__init__.py'"'"',
'"'"'src/sage/misc/__init__.py'"'"',
'"'"'src/sage/rings/convert/__init__.py'"'"',
'"'"'src/sage/rings/invariants/__init__.py'"'"',
'"'"'src/sage/rings/finite_rings/__init__.py'"'"',
'"'"'src/sage/rings/function_field/__init__.py'"'"',
'"'"'src/sage/rings/function_field/drinfeld_modules/__init__.py'"'"',
'"'"'src/sage/rings/semirings/__init__.py'"'"',
'"'"'src/sage/rings/number_field/__init__.py'"'"',
'"'"'src/sage/rings/padics/__init__.py'"'"',
'"'"'src/sage/rings/valuation/__init__.py'"'"',
'"'"'src/sage/rings/asymptotic/__init__.py'"'"',
'"'"'src/sage/rings/polynomial/weil/__init__.py'"'"',
'"'"'src/sage/rings/polynomial/__init__.py'"'"',
'"'"'src/sage/rings/polynomial/padics/__init__.py'"'"',
'"'"'src/sage/monoids/__init__.py'"'"',
'"'"'src/sage/matrix/__init__.py'"'"',
'"'"'src/sage/matroids/__init__.py'"'"',
'"'"'src/sage/interacts/__init__.py'"'"',
'"'"'src/sage/__init__.py'"'"',
'"'"'src/sage/plot/__init__.py'"'"',
'"'"'src/sage/plot/plot3d/__init__.py'"'"',
'"'"'src/sage/typeset/__init__.py'"'"',
'"'"'src/sage/algebras/lie_conformal_algebras/__init__.py'"'"',
'"'"'src/sage/algebras/fusion_rings/__init__.py'"'"',
'"'"'src/sage/algebras/letterplace/__init__.py'"'"',
'"'"'src/sage/algebras/quatalg/__init__.py'"'"',
'"'"'src/sage/algebras/steenrod/__init__.py'"'"',
'"'"'src/sage/algebras/finite_dimensional_algebras/__init__.py'"'"',
'"'"'src/sage/algebras/__init__.py'"'"',
'"'"'src/sage/algebras/hecke_algebras/__init__.py'"'"',
'"'"'src/sage/algebras/lie_algebras/__init__.py'"'"',
'"'"'src/sage/algebras/quantum_groups/__init__.py'"'"',
'"'"'src/sage/quadratic_forms/genera/__init__.py'"'"',
'"'"'src/sage/quadratic_forms/__init__.py'"'"',
'"'"'src/sage/game_theory/__init__.py'"'"',
'"'"'src/sage/sandpiles/__init__.py'"'"',
'"'"'src/sage/sat/__init__.py'"'"',
'"'"'src/sage/homology/__init__.py'"'"',
'"'"'src/sage/geometry/riemannian_manifolds/__init__.py'"'"',
'"'"'src/sage/geometry/hyperplane_arrangement/__init__.py'"'"',
'"'"'src/sage/geometry/triangulation/__init__.py'"'"',
'"'"'src/sage/geometry/polyhedron/modules/__init__.py'"'"',
'"'"'src/sage/geometry/polyhedron/__init__.py'"'"',
'"'"'src/sage/geometry/polyhedron/combinatorial_polyhedron/__init__.py'"'"',
'"'"'src/sage/geometry/__init__.py'"'"',
'"'"'src/sage/geometry/hyperbolic_space/__init__.py'"'"',
'"'"'src/sage/sets/__init__.py'"'"',
'"'"'src/sage/probability/__init__.py'"'"',
'"'"'src/sage/numerical/backends/__init__.py'"'"',
'"'"'src/sage/numerical/__init__.py'"'"',
'"'"'src/sage/data_structures/__init__.py'"'"',
'"'"'src/sage/graphs/graph_decompositions/__init__.py'"'"',
'"'"'src/sage/graphs/generators/__init__.py'"'"',
'"'"'src/sage/graphs/__init__.py'"'"',
'"'"'src/sage/graphs/base/__init__.py'"'"',
'"'"'src/sage/graphs/tests/__init__.py'"'"',
'"'"'src/sage/databases/__init__.py'"'"',
'"'"'src/sage/stats/hmm/__init__.py'"'"',
'"'"'src/sage/stats/__init__.py'"'"',
'"'"'src/sage/stats/distributions/__init__.py'"'"',
'"'"'src/sage/libs/mpfi/__init__.py'"'"',
'"'"'src/sage/libs/__init__.py'"'"',
'"'"'src/sage/libs/polybori/__init__.py'"'"',
'"'"'src/sage/libs/mpfr/__init__.py'"'"',
'"'"'src/sage/libs/mpc/__init__.py'"'"',
'"'"'src/sage/calculus/transforms/__init__.py'"'"',
'"'"'src/sage/calculus/__init__.py'"'"',
]
for path in file_paths:
resolved_path = Path("/home/martin/sage-trac") / path
resolved_path.parent.mkdir(parents=True, exist_ok=True)
resolved_path.write_text(content)
'
--- stdout ---
--- stderr ---
Determining dependency 'numpy' with pkg-config executable '/home/martin/miniforge3/envs/sage-dev/bin/pkg-config'
env[PKG_CONFIG_PATH]:
env[PKG_CONFIG]: /home/martin/miniforge3/envs/sage-dev/bin/pkg-config
-----------
Called: `/home/martin/miniforge3/envs/sage-dev/bin/pkg-config --modversion numpy` -> 1
stderr:
Package numpy was not found in the pkg-config search path.
Perhaps you should add the directory containing `numpy.pc'
to the PKG_CONFIG_PATH environment variable
No package 'numpy' found
-----------
numpy-config binary missing from cross or native file, or env var undefined.
Trying a default numpy-config fallback at numpy-config
numpy-config found: YES (/home/martin/miniforge3/envs/sage-dev/bin/numpy-config) 2.4.3
-----------
Called: `/home/martin/miniforge3/envs/sage-dev/bin/numpy-config --cflags` -> 0
stdout:
-I/home/martin/miniforge3/envs/sage-dev/lib/python3.12/site-packages/numpy/_core/include
-----------
Run-time dependency numpy found: YES 2.4.3
Running command: /home/martin/miniforge3/envs/sage-dev/bin/python3.12 -c 'from os.path import relpath
import cysignals
path = cysignals.__file__.replace('"'"'__init__.py'"'"', '"'"''"'"')
try:
print(relpath(path))
except Exception:
print(path)'
--- stdout ---
../../miniforge3/envs/sage-dev/lib/python3.12/site-packages/cysignals
--- stderr ---
Running command: /home/martin/miniforge3/envs/sage-dev/bin/python3.12 -c 'from os.path import relpath
import gmpy2
path = gmpy2.__file__.replace('"'"'__init__.py'"'"', '"'"''"'"')
try:
print(relpath(path))
except Exception:
print(path)'
--- stdout ---
../../miniforge3/envs/sage-dev/lib/python3.12/site-packages/gmpy2
--- stderr ---
Determining dependency 'gmp' with pkg-config executable '/home/martin/miniforge3/envs/sage-dev/bin/pkg-config'
env[PKG_CONFIG_PATH]:
env[PKG_CONFIG]: /home/martin/miniforge3/envs/sage-dev/bin/pkg-config
-----------
Called: `/home/martin/miniforge3/envs/sage-dev/bin/pkg-config --modversion gmp` -> 0
stdout:
6.3.0
-----------
env[PKG_CONFIG_PATH]:
env[PKG_CONFIG]: /home/martin/miniforge3/envs/sage-dev/bin/pkg-config
-----------
Called: `/home/martin/miniforge3/envs/sage-dev/bin/pkg-config --cflags gmp` -> 0
stdout:
-I/home/martin/miniforge3/envs/sage-dev/include
-----------
env[PKG_CONFIG_ALLOW_SYSTEM_LIBS]: 1
env[PKG_CONFIG_PATH]:
env[PKG_CONFIG]: /home/martin/miniforge3/envs/sage-dev/bin/pkg-config
-----------
Called: `/home/martin/miniforge3/envs/sage-dev/bin/pkg-config --libs gmp` -> 0
stdout:
-L/home/martin/miniforge3/envs/sage-dev/lib -lgmp
-----------
env[PKG_CONFIG_PATH]:
env[PKG_CONFIG]: /home/martin/miniforge3/envs/sage-dev/bin/pkg-config
-----------
Called: `/home/martin/miniforge3/envs/sage-dev/bin/pkg-config --libs gmp` -> 0
stdout:
-L/home/martin/miniforge3/envs/sage-dev/lib -lgmp
-----------
Running compile:
Working directory: /home/martin/sage-trac/build/cp312/meson-private/tmpjwgfk5_q
Code:
#include<stddef.h>
#include<stdio.h>
int main(void) {
printf("%ld\n", (long)(sizeof(void *)));
return 0;
}
-----------
Command line: `/home/martin/miniforge3/envs/sage-dev/bin/x86_64-conda-linux-gnu-c++ -L/home/martin/miniforge3/envs/sage-dev/lib /home/martin/sage-trac/build/cp312/meson-private/tmpjwgfk5_q/testfile.cpp -o /home/martin/sage-trac/build/cp312/meson-private/tmpjwgfk5_q/output.exe -fvisibility-inlines-hidden -fmessage-length=0 -march=nocona -mtune=haswell -ftree-vectorize -fPIC -fstack-protector-strong -fno-plt -O2 -ffunction-sections -pipe -DNDEBUG -D_FORTIFY_SOURCE=2 -O2 -D_FILE_OFFSET_BITS=64 -O0 -U_FORTIFY_SOURCE -fpermissive -Wl,-O2 -Wl,--sort-common -Wl,--as-needed -Wl,-z,relro -Wl,-z,now -Wl,--disable-new-dtags -Wl,--gc-sections -Wl,--allow-shlib-undefined -Wl,-rpath,/home/martin/miniforge3/envs/sage-dev/lib -Wl,-rpath-link,/home/martin/miniforge3/envs/sage-dev/lib` -> 0
Program stdout:
8
Program stderr:
Running compile:
Working directory: /home/martin/sage-trac/build/cp312/meson-private/tmplpdfj814
Code:
-----------
Command line: `/home/martin/miniforge3/envs/sage-dev/bin/x86_64-conda-linux-gnu-c++ /home/martin/sage-trac/build/cp312/meson-private/tmplpdfj814/testfile.cpp -o /home/martin/sage-trac/build/cp312/meson-private/tmplpdfj814/output.obj -c -fvisibility-inlines-hidden -fmessage-length=0 -march=nocona -mtune=haswell -ftree-vectorize -fPIC -fstack-protector-strong -fno-plt -O2 -ffunction-sections -pipe -DNDEBUG -D_FORTIFY_SOURCE=2 -O2 -D_FILE_OFFSET_BITS=64 -O0 -U_FORTIFY_SOURCE -fpermissive --print-search-dirs` -> 0
stdout:
install: /home/martin/miniforge3/envs/sage-dev/bin/../lib/gcc/x86_64-conda-linux-gnu/14.3.0/
programs: =/home/martin/miniforge3/envs/sage-dev/bin/../libexec/gcc/x86_64-conda-linux-gnu/14.3.0/:/home/martin/miniforge3/envs/sage-dev/bin/../libexec/gcc/:/home/martin/miniforge3/envs/sage-dev/bin/../lib/gcc/x86_64-conda-linux-gnu/14.3.0/../../../../x86_64-conda-linux-gnu/bin/x86_64-conda-linux-gnu/14.3.0/:/home/martin/miniforge3/envs/sage-dev/bin/../lib/gcc/x86_64-conda-linux-gnu/14.3.0/../../../../x86_64-conda-linux-gnu/bin/
libraries: =/home/martin/miniforge3/envs/sage-dev/bin/../lib/gcc/x86_64-conda-linux-gnu/14.3.0/:/home/martin/miniforge3/envs/sage-dev/bin/../lib/gcc/:/home/martin/miniforge3/envs/sage-dev/bin/../lib/gcc/x86_64-conda-linux-gnu/14.3.0/../../../../x86_64-conda-linux-gnu/lib/x86_64-conda-linux-gnu/14.3.0/:/home/martin/miniforge3/envs/sage-dev/bin/../lib/gcc/x86_64-conda-linux-gnu/14.3.0/../../../../x86_64-conda-linux-gnu/lib/../lib/:/home/martin/miniforge3/envs/sage-dev/bin/../lib/gcc/x86_64-conda-linux-gnu/14.3.0/../../../x86_64-conda-linux-gnu/14.3.0/:/home/martin/miniforge3/envs/sage-dev/bin/../lib/gcc/x86_64-conda-linux-gnu/14.3.0/../../../../lib/:/home/martin/miniforge3/envs/sage-dev/bin/../x86_64-conda-linux-gnu/sysroot/lib/x86_64-conda-linux-gnu/14.3.0/:/home/martin/miniforge3/envs/sage-dev/bin/../x86_64-conda-linux-gnu/sysroot/lib/../lib/:/home/martin/miniforge3/envs/sage-dev/bin/../x86_64-conda-linux-gnu/sysroot/usr/lib/x86_64-conda-linux-gnu/14.3.0/:/home/martin/miniforge3/envs/sage-dev/bin/../x86_64-conda-linux-gnu/sysroot/usr/lib/../lib/:/home/martin/miniforge3/envs/sage-dev/bin/../lib/gcc/x86_64-conda-linux-gnu/14.3.0/../../../../x86_64-conda-linux-gnu/lib/:/home/martin/miniforge3/envs/sage-dev/bin/../lib/gcc/x86_64-conda-linux-gnu/14.3.0/../../../:/home/martin/miniforge3/envs/sage-dev/bin/../x86_64-conda-linux-gnu/sysroot/lib/:/home/martin/miniforge3/envs/sage-dev/bin/../x86_64-conda-linux-gnu/sysroot/usr/lib/
-----------
Run-time dependency gmp found: YES 6.3.0
Running command: /home/martin/miniforge3/envs/sage-dev/bin/python3.12 -c 'from os.path import relpath
import cypari2
path = cypari2.__file__.replace('"'"'__init__.py'"'"', '"'"''"'"')
try:
print(relpath(path))
except Exception:
print(path)'
--- stdout ---
../../miniforge3/envs/sage-dev/lib/python3.12/site-packages/cypari2
--- stderr ---
Running compile:
Working directory: /home/martin/sage-trac/build/cp312/meson-private/tmpco5bbed_
Code:
int main(void) { return 0; }
-----------
Command line: `/home/martin/miniforge3/envs/sage-dev/bin/x86_64-conda-linux-gnu-cc -L/home/martin/miniforge3/envs/sage-dev/lib /home/martin/sage-trac/build/cp312/meson-private/tmpco5bbed_/testfile.c -o /home/martin/sage-trac/build/cp312/meson-private/tmpco5bbed_/output.exe -march=nocona -mtune=haswell -ftree-vectorize -fPIC -fstack-protector-strong -fno-plt -O2 -ffunction-sections -pipe -DNDEBUG -D_FORTIFY_SOURCE=2 -O2 -D_FILE_OFFSET_BITS=64 -O0 -U_FORTIFY_SOURCE -lpari -Wl,--allow-shlib-undefined -Wl,-O2 -Wl,--sort-common -Wl,--as-needed -Wl,-z,relro -Wl,-z,now -Wl,--disable-new-dtags -Wl,--gc-sections -Wl,--allow-shlib-undefined -Wl,-rpath,/home/martin/miniforge3/envs/sage-dev/lib -Wl,-rpath-link,/home/martin/miniforge3/envs/sage-dev/lib` -> 0
Library pari found: YES
Running compile:
Working directory: /home/martin/sage-trac/build/cp312/meson-private/tmpwy197jn6
Code:
#include <pari/pari.h>
int main(void) {
pari_init(1000000, 2);
GEN v = pari_version(), M = gel(v,1), m = gel(v,2), p = gel(v,3);
pari_printf("%ld.%ld.%ld", itos(M), itos(m), itos(p));
pari_close();
return 0;
}
-----------
Command line: `/home/martin/miniforge3/envs/sage-dev/bin/x86_64-conda-linux-gnu-cc -L/home/martin/miniforge3/envs/sage-dev/lib /home/martin/sage-trac/build/cp312/meson-private/tmpwy197jn6/testfile.c -o /home/martin/sage-trac/build/cp312/meson-private/tmpwy197jn6/output.exe -march=nocona -mtune=haswell -ftree-vectorize -fPIC -fstack-protector-strong -fno-plt -O2 -ffunction-sections -pipe -DNDEBUG -D_FORTIFY_SOURCE=2 -O2 -D_FILE_OFFSET_BITS=64 -O0 -U_FORTIFY_SOURCE -std=c17 -v -lpari -Wl,-O2 -Wl,--sort-common -Wl,--as-needed -Wl,-z,relro -Wl,-z,now -Wl,--disable-new-dtags -Wl,--gc-sections -Wl,--allow-shlib-undefined -Wl,-rpath,/home/martin/miniforge3/envs/sage-dev/lib -Wl,-rpath-link,/home/martin/miniforge3/envs/sage-dev/lib` -> 0
stderr:
Reading specs from /home/martin/miniforge3/envs/sage-dev/bin/../lib/gcc/x86_64-conda-linux-gnu/14.3.0/specs
Reading specs from /home/martin/miniforge3/envs/sage-dev/bin/../lib/gcc/x86_64-conda-linux-gnu/14.3.0/conda.specs
COLLECT_GCC=/home/martin/miniforge3/envs/sage-dev/bin/x86_64-conda-linux-gnu-cc
COLLECT_LTO_WRAPPER=/home/martin/miniforge3/envs/sage-dev/bin/../libexec/gcc/x86_64-conda-linux-gnu/14.3.0/lto-wrapper
Target: x86_64-conda-linux-gnu
Configured with: ../configure --prefix=/home/conda/feedstock_root/build_artifacts/gcc_compilers_1771374355041/_h_env_placehold_placehold_placehold_placehold_placehold_placehold_placehold_placehold_placehold_placehold_placehold_placehold_placehold_placehold_placehold_placehold_placehold_placeho --with-slibdir=/home/conda/feedstock_root/build_artifacts/gcc_compilers_1771374355041/_h_env_placehold_placehold_placehold_placehold_placehold_placehold_placehold_placehold_placehold_placehold_placehold_placehold_placehold_placehold_placehold_placehold_placehold_placeho/lib --libdir=/home/conda/feedstock_root/build_artifacts/gcc_compilers_1771374355041/_h_env_placehold_placehold_placehold_placehold_placehold_placehold_placehold_placehold_placehold_placehold_placehold_placehold_placehold_placehold_placehold_placehold_placehold_placeho/lib --mandir=/home/conda/feedstock_root/build_artifacts/gcc_compilers_1771374355041/_h_env_placehold_placehold_placehold_placehold_placehold_placehold_placehold_placehold_placehold_placehold_placehold_placehold_placehold_placehold_placehold_placehold_placehold_placeho/share/man --build=x86_64-conda-linux-gnu --host=x86_64-conda-linux-gnu --target=x86_64-conda-linux-gnu --enable-languages=c,c++,fortran,objc,obj-c++ --enable-libgomp --disable-libssp --enable-libquadmath --enable-libquadmath-support --disable-nls --disable-bootstrap --disable-multilib --enable-long-long --without-zstd --with-native-system-header-dir=/usr/include --with-gxx-include-dir=/home/conda/feedstock_root/build_artifacts/gcc_compilers_1771374355041/_h_env_placehold_placehold_placehold_placehold_placehold_placehold_placehold_placehold_placehold_placehold_placehold_placehold_placehold_placehold_placehold_placehold_placehold_placeho/lib/gcc/x86_64-conda-linux-gnu/14.3.0/include/c++ --with-gxx-libcxx-include-dir=/home/conda/feedstock_root/build_artifacts/gcc_compilers_1771374355041/_h_env_placehold_placehold_placehold_placehold_placehold_placehold_placehold_placehold_placehold_placehold_placehold_placehold_placehold_placehold_placehold_placehold_placehold_placeho/lib/gcc/x86_64-conda-linux-gnu/14.3.0/../../../../include/c++/v1 --with-pkgversion='conda-forge gcc 14.3.0-18' --with-bugurl=
https://github.com/conda-forge/ctng-compilers-feedstock/issues/new/choose --enable-libsanitizer --enable-default-pie --enable-threads=posix --enable-__cxa_atexit --with-sysroot=/home/conda/feedstock_root/build_artifacts/gcc_compilers_1771374355041/_h_env_placehold_placehold_placehold_placehold_placehold_placehold_placehold_placehold_placehold_placehold_placehold_placehold_placehold_placehold_placehold_placehold_placehold_placeho/x86_64-conda-linux-gnu/sysroot --with-build-sysroot=/home/conda/feedstock_root/build_artifacts/gcc_compilers_1771374355041/_build_env/x86_64-conda-linux-gnu/sysroot --enable-plugin --enable-lto
Thread model: posix
Supported LTO compression algorithms: zlib
gcc version 14.3.0 (conda-forge gcc 14.3.0-18)
COLLECT_GCC_OPTIONS='-L/home/martin/miniforge3/envs/sage-dev/lib' '-o' '/home/martin/sage-trac/build/cp312/meson-private/tmpwy197jn6/output.exe' '-march=nocona' '-mtune=haswell' '-ftree-vectorize' '-fPIC' '-fstack-protector-strong' '-fno-plt' '-O2' '-ffunction-sections' '-pipe' '-D' 'NDEBUG' '-D' '_FORTIFY_SOURCE=2' '-O2' '-D' '_FILE_OFFSET_BITS=64' '-O0' '-U' '_FORTIFY_SOURCE' '-std=c17' '-v' '-dumpdir' '/home/martin/sage-trac/build/cp312/meson-private/tmpwy197jn6/output-'
/home/martin/miniforge3/envs/sage-dev/bin/../libexec/gcc/x86_64-conda-linux-gnu/14.3.0/cc1 -quiet -v -iprefix /home/martin/miniforge3/envs/sage-dev/bin/../lib/gcc/x86_64-conda-linux-gnu/14.3.0/ -isysroot /home/martin/miniforge3/envs/sage-dev/bin/../x86_64-conda-linux-gnu/sysroot -D NDEBUG -D _FORTIFY_SOURCE=2 -D _FILE_OFFSET_BITS=64 -U _FORTIFY_SOURCE /home/martin/sage-trac/build/cp312/meson-private/tmpwy197jn6/testfile.c -quiet -dumpdir /home/martin/sage-trac/build/cp312/meson-private/tmpwy197jn6/output- -dumpbase testfile.c -dumpbase-ext .c -march=nocona -mtune=haswell -O2 -O2 -O0 -std=c17 -version -ftree-vectorize -fPIC -fstack-protector-strong -fno-plt -ffunction-sections -idirafter /home/martin/miniforge3/envs/sage-dev/include -o - |
/home/martin/miniforge3/envs/sage-dev/bin/../lib/gcc/x86_64-conda-linux-gnu/14.3.0/../../../../x86_64-conda-linux-gnu/bin/as -v --64 -o /home/martin/tmp/cclYNnVj.o
GNU assembler version 2.45.1 (x86_64-conda-linux-gnu) using BFD version (GNU Binutils) 2.45.1
GNU C17 (conda-forge gcc 14.3.0-18) version 14.3.0 (x86_64-conda-linux-gnu)
compiled by GNU C version 15.2.0, GMP version 6.2.1, MPFR version 4.1.0, MPC version 1.2.1, isl version isl-0.24-GMP
GGC heuristics: --param ggc-min-expand=100 --param ggc-min-heapsize=131072
ignoring nonexistent directory "/home/martin/miniforge3/envs/sage-dev/bin/../lib/gcc/x86_64-conda-linux-gnu/14.3.0/../../../../x86_64-conda-linux-gnu/include"
ignoring duplicate directory "/home/martin/miniforge3/envs/sage-dev/bin/../lib/gcc/../../lib/gcc/x86_64-conda-linux-gnu/14.3.0/include"
ignoring nonexistent directory "/home/martin/miniforge3/envs/sage-dev/bin/../x86_64-conda-linux-gnu/sysroot/usr/local/include"
ignoring duplicate directory "/home/martin/miniforge3/envs/sage-dev/bin/../lib/gcc/../../lib/gcc/x86_64-conda-linux-gnu/14.3.0/include-fixed"
ignoring nonexistent directory "/home/martin/miniforge3/envs/sage-dev/bin/../lib/gcc/../../lib/gcc/x86_64-conda-linux-gnu/14.3.0/../../../../x86_64-conda-linux-gnu/include"
#include "..." search starts here:
#include <...> search starts here:
/home/martin/miniforge3/envs/sage-dev/bin/../lib/gcc/x86_64-conda-linux-gnu/14.3.0/include
/home/martin/miniforge3/envs/sage-dev/bin/../lib/gcc/x86_64-conda-linux-gnu/14.3.0/include-fixed
/home/martin/miniforge3/envs/sage-dev/bin/../x86_64-conda-linux-gnu/sysroot/usr/include
/home/martin/miniforge3/envs/sage-dev/include
End of search list.
Compiler executable checksum: 2e4b1a9cce1e2797f9c8c15892139bae
COMPILER_PATH=/home/martin/miniforge3/envs/sage-dev/bin/../libexec/gcc/x86_64-conda-linux-gnu/14.3.0/:/home/martin/miniforge3/envs/sage-dev/bin/../libexec/gcc/:/home/martin/miniforge3/envs/sage-dev/bin/../lib/gcc/x86_64-conda-linux-gnu/14.3.0/../../../../x86_64-conda-linux-gnu/bin/
LIBRARY_PATH=/home/martin/miniforge3/envs/sage-dev/bin/../lib/gcc/x86_64-conda-linux-gnu/14.3.0/:/home/martin/miniforge3/envs/sage-dev/bin/../lib/gcc/:/home/martin/miniforge3/envs/sage-dev/bin/../lib/gcc/x86_64-conda-linux-gnu/14.3.0/../../../../x86_64-conda-linux-gnu/lib/../lib/:/home/martin/miniforge3/envs/sage-dev/bin/../lib/gcc/x86_64-conda-linux-gnu/14.3.0/../../../../lib/:/home/martin/miniforge3/envs/sage-dev/bin/../x86_64-conda-linux-gnu/sysroot/lib/../lib/:/home/martin/miniforge3/envs/sage-dev/bin/../x86_64-conda-linux-gnu/sysroot/usr/lib/../lib/:/home/martin/miniforge3/envs/sage-dev/bin/../lib/gcc/x86_64-conda-linux-gnu/14.3.0/../../../../x86_64-conda-linux-gnu/lib/:/home/martin/miniforge3/envs/sage-dev/bin/../lib/gcc/x86_64-conda-linux-gnu/14.3.0/../../../:/home/martin/miniforge3/envs/sage-dev/bin/../x86_64-conda-linux-gnu/sysroot/lib/:/home/martin/miniforge3/envs/sage-dev/bin/../x86_64-conda-linux-gnu/sysroot/usr/lib/
COLLECT_GCC_OPTIONS='-L/home/martin/miniforge3/envs/sage-dev/lib' '-o' '/home/martin/sage-trac/build/cp312/meson-private/tmpwy197jn6/output.exe' '-march=nocona' '-mtune=haswell' '-ftree-vectorize' '-fPIC' '-fstack-protector-strong' '-fno-plt' '-O2' '-ffunction-sections' '-pipe' '-D' 'NDEBUG' '-D' '_FORTIFY_SOURCE=2' '-O2' '-D' '_FILE_OFFSET_BITS=64' '-O0' '-U' '_FORTIFY_SOURCE' '-std=c17' '-v' '-dumpdir' '/home/martin/sage-trac/build/cp312/meson-private/tmpwy197jn6/output.'
/home/martin/miniforge3/envs/sage-dev/bin/../libexec/gcc/x86_64-conda-linux-gnu/14.3.0/collect2 -disable-new-dtags -plugin /home/martin/miniforge3/envs/sage-dev/bin/../libexec/gcc/x86_64-conda-linux-gnu/14.3.0/liblto_plugin.so -plugin-opt=/home/martin/miniforge3/envs/sage-dev/bin/../libexec/gcc/x86_64-conda-linux-gnu/14.3.0/lto-wrapper -plugin-opt=-fresolution=/home/martin/tmp/ccsJgMqd.res -plugin-opt=-pass-through=-lgcc -plugin-opt=-pass-through=-lgcc_s -plugin-opt=-pass-through=-lc -plugin-opt=-pass-through=-lgcc -plugin-opt=-pass-through=-lgcc_s --sysroot=/home/martin/miniforge3/envs/sage-dev/bin/../x86_64-conda-linux-gnu/sysroot --eh-frame-hdr -m elf_x86_64 -dynamic-linker /lib64/ld-linux-x86-64.so.2 -pie -o /home/martin/sage-trac/build/cp312/meson-private/tmpwy197jn6/output.exe /home/martin/miniforge3/envs/sage-dev/bin/../x86_64-conda-linux-gnu/sysroot/lib/../lib/Scrt1.o /home/martin/miniforge3/envs/sage-dev/bin/../x86_64-conda-linux-gnu/sysroot/lib/../lib/crti.o /home/martin/miniforge3/envs/sage-dev/bin/../lib/gcc/x86_64-conda-linux-gnu/14.3.0/crtbeginS.o -L/home/martin/miniforge3/envs/sage-dev/lib -L/home/martin/miniforge3/envs/sage-dev/bin/../lib/gcc/x86_64-conda-linux-gnu/14.3.0 -L/home/martin/miniforge3/envs/sage-dev/bin/../lib/gcc -L/home/martin/miniforge3/envs/sage-dev/bin/../lib/gcc/x86_64-conda-linux-gnu/14.3.0/../../../../x86_64-conda-linux-gnu/lib/../lib -L/home/martin/miniforge3/envs/sage-dev/bin/../lib/gcc/x86_64-conda-linux-gnu/14.3.0/../../../../lib -L/home/martin/miniforge3/envs/sage-dev/bin/../x86_64-conda-linux-gnu/sysroot/lib/../lib -L/home/martin/miniforge3/envs/sage-dev/bin/../x86_64-conda-linux-gnu/sysroot/usr/lib/../lib -L/home/martin/miniforge3/envs/sage-dev/bin/../lib/gcc/x86_64-conda-linux-gnu/14.3.0/../../../../x86_64-conda-linux-gnu/lib -L/home/martin/miniforge3/envs/sage-dev/bin/../lib/gcc/x86_64-conda-linux-gnu/14.3.0/../../.. -L/home/martin/miniforge3/envs/sage-dev/bin/../x86_64-conda-linux-gnu/sysroot/lib -L/home/martin/miniforge3/envs/sage-dev/bin/../x86_64-conda-linux-gnu/sysroot/usr/lib /home/martin/tmp/cclYNnVj.o -lpari -O2 --sort-common --as-needed -z relro -z now --disable-new-dtags --gc-sections --allow-shlib-undefined -rpath /home/martin/miniforge3/envs/sage-dev/lib -rpath-link /home/martin/miniforge3/envs/sage-dev/lib -lgcc --push-state --as-needed -lgcc_s --pop-state -lc -lgcc --push-state --as-needed -lgcc_s --pop-state /home/martin/miniforge3/envs/sage-dev/bin/../lib/gcc/x86_64-conda-linux-gnu/14.3.0/crtendS.o /home/martin/miniforge3/envs/sage-dev/bin/../x86_64-conda-linux-gnu/sysroot/lib/../lib/crtn.o -rpath /home/martin/miniforge3/envs/sage-dev/lib -rpath-link /home/martin/miniforge3/envs/sage-dev/lib -L /home/martin/miniforge3/envs/sage-dev/lib/stubs -L /home/martin/miniforge3/envs/sage-dev/lib
COLLECT_GCC_OPTIONS='-L/home/martin/miniforge3/envs/sage-dev/lib' '-o' '/home/martin/sage-trac/build/cp312/meson-private/tmpwy197jn6/output.exe' '-march=nocona' '-mtune=haswell' '-ftree-vectorize' '-fPIC' '-fstack-protector-strong' '-fno-plt' '-O2' '-ffunction-sections' '-pipe' '-D' 'NDEBUG' '-D' '_FORTIFY_SOURCE=2' '-O2' '-D' '_FILE_OFFSET_BITS=64' '-O0' '-U' '_FORTIFY_SOURCE' '-std=c17' '-v' '-dumpdir' '/home/martin/sage-trac/build/cp312/meson-private/tmpwy197jn6/output.'
-----------
Program stdout:
2.17.3
Program stderr:
Checking if "pari version" with dependency -lpari runs: YES
Determining dependency 'mpfr' with pkg-config executable '/home/martin/miniforge3/envs/sage-dev/bin/pkg-config'
env[PKG_CONFIG_PATH]:
env[PKG_CONFIG]: /home/martin/miniforge3/envs/sage-dev/bin/pkg-config
-----------
Called: `/home/martin/miniforge3/envs/sage-dev/bin/pkg-config --modversion mpfr` -> 0
stdout:
4.2.2
-----------
env[PKG_CONFIG_PATH]:
env[PKG_CONFIG]: /home/martin/miniforge3/envs/sage-dev/bin/pkg-config
-----------
Called: `/home/martin/miniforge3/envs/sage-dev/bin/pkg-config --cflags mpfr` -> 0
stdout:
-I/home/martin/miniforge3/envs/sage-dev/include
-----------
env[PKG_CONFIG_ALLOW_SYSTEM_LIBS]: 1
env[PKG_CONFIG_PATH]:
env[PKG_CONFIG]: /home/martin/miniforge3/envs/sage-dev/bin/pkg-config
-----------
Called: `/home/martin/miniforge3/envs/sage-dev/bin/pkg-config --libs mpfr` -> 0
stdout:
-L/home/martin/miniforge3/envs/sage-dev/lib -lmpfr -lgmp
-----------
env[PKG_CONFIG_PATH]:
env[PKG_CONFIG]: /home/martin/miniforge3/envs/sage-dev/bin/pkg-config
-----------
Called: `/home/martin/miniforge3/envs/sage-dev/bin/pkg-config --libs mpfr` -> 0
stdout:
-L/home/martin/miniforge3/envs/sage-dev/lib -lmpfr -lgmp
-----------
Run-time dependency mpfr found: YES 4.2.2
Determining dependency 'flint' with pkg-config executable '/home/martin/miniforge3/envs/sage-dev/bin/pkg-config'
env[PKG_CONFIG_PATH]:
env[PKG_CONFIG]: /home/martin/miniforge3/envs/sage-dev/bin/pkg-config
-----------
Called: `/home/martin/miniforge3/envs/sage-dev/bin/pkg-config --modversion flint` -> 0
stdout:
3.3.1
-----------
env[PKG_CONFIG_PATH]:
env[PKG_CONFIG]: /home/martin/miniforge3/envs/sage-dev/bin/pkg-config
-----------
Called: `/home/martin/miniforge3/envs/sage-dev/bin/pkg-config --cflags flint` -> 0
stdout:
-I/home/martin/miniforge3/envs/sage-dev/include
-----------
env[PKG_CONFIG_ALLOW_SYSTEM_LIBS]: 1
env[PKG_CONFIG_PATH]:
env[PKG_CONFIG]: /home/martin/miniforge3/envs/sage-dev/bin/pkg-config
-----------
Called: `/home/martin/miniforge3/envs/sage-dev/bin/pkg-config --libs flint` -> 0
stdout:
-L/home/martin/miniforge3/envs/sage-dev/lib -lflint -lgmp -lmpfr -lgmp
-----------
env[PKG_CONFIG_PATH]:
env[PKG_CONFIG]: /home/martin/miniforge3/envs/sage-dev/bin/pkg-config
-----------
Called: `/home/martin/miniforge3/envs/sage-dev/bin/pkg-config --libs flint` -> 0
stdout:
-L/home/martin/miniforge3/envs/sage-dev/lib -lflint -lgmp -lmpfr -lgmp
-----------
Run-time dependency flint found: YES 3.3.1
Determining dependency 'mkl' with pkg-config executable '/home/martin/miniforge3/envs/sage-dev/bin/pkg-config'
env[PKG_CONFIG_PATH]:
env[PKG_CONFIG]: /home/martin/miniforge3/envs/sage-dev/bin/pkg-config
-----------
Called: `/home/martin/miniforge3/envs/sage-dev/bin/pkg-config --modversion mkl` -> 1
stderr:
Package mkl was not found in the pkg-config search path.
Perhaps you should add the directory containing `mkl.pc'
to the PKG_CONFIG_PATH environment variable
No package 'mkl' found
-----------
CMake binary for host machine is not cached
CMake binary missing from cross or native file, or env var undefined.
Trying a default CMake fallback at cmake
Found CMake: /usr/bin/cmake (3.28.3)
Extracting basic cmake information
CMake Toolchain: Calling CMake once to generate the compiler state
Calling CMake (['/usr/bin/cmake']) in /home/martin/sage-trac/build/cp312/meson-private/__CMake_compiler_info__ with:
- "--trace-expand"
- "--trace-format=json-v1"
- "--no-warn-unused-cli"
- "--trace-redirect=cmake_trace.txt"
- "-G"
- "Ninja"
- "-DCMAKE_MAKE_PROGRAM=/home/martin/miniforge3/envs/sage-dev/bin/ninja"
- "-DCMAKE_TOOLCHAIN_FILE=/home/martin/sage-trac/build/cp312/meson-private/__CMake_compiler_info__/CMakeMesonTempToolchainFile.cmake"
- "."
- "-DCMAKE_PREFIX_PATH=/home/martin/miniforge3/envs/sage-dev;/home/martin/miniforge3/envs/sage-dev/x86_64-conda-linux-gnu/sysroot/usr"
CMake trace warning: add_executable() non imported executables are not supported
CMake TRACE: /home/martin/sage-trac/build/cp312/meson-private/__CMake_compiler_info__/CMakeFiles/CMakeScratch/TryCompile-QX8RTK/CMakeLists.txt:21 add_executable(['cmTC_6d4c8'])
CMake trace warning: target_link_libraries() TARGET cmTC_6d4c8 not found
CMake TRACE: /home/martin/sage-trac/build/cp312/meson-private/__CMake_compiler_info__/CMakeFiles/CMakeScratch/TryCompile-QX8RTK/CMakeLists.txt:27 target_link_libraries(['cmTC_6d4c8', ''])
CMake trace warning: add_executable() non imported executables are not supported
CMake TRACE: /home/martin/sage-trac/build/cp312/meson-private/__CMake_compiler_info__/CMakeFiles/CMakeScratch/TryCompile-IRNm8r/CMakeLists.txt:21 add_executable(['cmTC_42829'])
CMake trace warning: target_link_libraries() TARGET cmTC_42829 not found
CMake TRACE: /home/martin/sage-trac/build/cp312/meson-private/__CMake_compiler_info__/CMakeFiles/CMakeScratch/TryCompile-IRNm8r/CMakeLists.txt:27 target_link_libraries(['cmTC_42829', ''])
Try CMake generator: auto
Calling CMake (['/usr/bin/cmake']) in /home/martin/sage-trac/build/cp312/meson-private/cmake_mkl with:
- "--trace-expand"
- "--trace-format=json-v1"
- "--no-warn-unused-cli"
- "--trace-redirect=cmake_trace.txt"
- "-DCMAKE_TOOLCHAIN_FILE=/home/martin/sage-trac/build/cp312/meson-private/cmake_mkl/CMakeMesonToolchainFile.cmake"
- "."
- "-DCMAKE_PREFIX_PATH=/home/martin/miniforge3/envs/sage-dev;/home/martin/miniforge3/envs/sage-dev/x86_64-conda-linux-gnu/sysroot/usr"
-- Module search paths: ['/', '/home/martin/miniforge3/envs/sage-dev', '/home/martin/miniforge3/envs/sage-dev/bin/../x86_64-conda-linux-gnu/sysroot/usr', '/home/martin/miniforge3/envs/sage-dev/x86_64-conda-linux-gnu/sysroot/usr', '/opt', '/usr', '/usr/local']
-- CMake root: /usr/share/cmake-3.28
-- CMake architectures: ['x86_64-linux-gnu']
-- CMake lib search paths: ['lib', 'lib32', 'lib64', 'libx32', 'share', '', 'lib/x86_64-linux-gnu']
Preliminary CMake check failed. Aborting.
Run-time dependency mkl found: NO (tried pkg-config and cmake)
Determining dependency 'cblas' with pkg-config executable '/home/martin/miniforge3/envs/sage-dev/bin/pkg-config'
env[PKG_CONFIG_PATH]:
env[PKG_CONFIG]: /home/martin/miniforge3/envs/sage-dev/bin/pkg-config
-----------
Called: `/home/martin/miniforge3/envs/sage-dev/bin/pkg-config --modversion cblas` -> 0
stdout:
0.3.32
-----------
env[PKG_CONFIG_PATH]:
env[PKG_CONFIG]: /home/martin/miniforge3/envs/sage-dev/bin/pkg-config
-----------
Called: `/home/martin/miniforge3/envs/sage-dev/bin/pkg-config --cflags cblas` -> 0
stdout:
-I/home/martin/miniforge3/envs/sage-dev/include
-----------
env[PKG_CONFIG_ALLOW_SYSTEM_LIBS]: 1
env[PKG_CONFIG_PATH]:
env[PKG_CONFIG]: /home/martin/miniforge3/envs/sage-dev/bin/pkg-config
-----------
Called: `/home/martin/miniforge3/envs/sage-dev/bin/pkg-config --libs cblas` -> 0
stdout:
-L/home/martin/miniforge3/envs/sage-dev/lib -lopenblas
-----------
env[PKG_CONFIG_PATH]:
env[PKG_CONFIG]: /home/martin/miniforge3/envs/sage-dev/bin/pkg-config
-----------
Called: `/home/martin/miniforge3/envs/sage-dev/bin/pkg-config --libs cblas` -> 0
stdout:
-L/home/martin/miniforge3/envs/sage-dev/lib -lopenblas
-----------
Run-time dependency cblas found: YES 0.3.32
Determining dependency 'gsl' with pkg-config executable '/home/martin/miniforge3/envs/sage-dev/bin/pkg-config'
env[PKG_CONFIG_PATH]:
env[PKG_CONFIG]: /home/martin/miniforge3/envs/sage-dev/bin/pkg-config
-----------
Called: `/home/martin/miniforge3/envs/sage-dev/bin/pkg-config --modversion gsl` -> 0
stdout:
2.8
-----------
env[PKG_CONFIG_PATH]:
env[PKG_CONFIG]: /home/martin/miniforge3/envs/sage-dev/bin/pkg-config
-----------
Called: `/home/martin/miniforge3/envs/sage-dev/bin/pkg-config --cflags gsl` -> 0
stdout:
-I/home/martin/miniforge3/envs/sage-dev/include
-----------
env[PKG_CONFIG_ALLOW_SYSTEM_LIBS]: 1
env[PKG_CONFIG_PATH]:
env[PKG_CONFIG]: /home/martin/miniforge3/envs/sage-dev/bin/pkg-config
-----------
Called: `/home/martin/miniforge3/envs/sage-dev/bin/pkg-config --libs gsl` -> 0
stdout:
-L/home/martin/miniforge3/envs/sage-dev/lib -lgsl -lgslcblas -lm -lcblas -lm
-----------
env[PKG_CONFIG_PATH]:
env[PKG_CONFIG]: /home/martin/miniforge3/envs/sage-dev/bin/pkg-config
-----------
Called: `/home/martin/miniforge3/envs/sage-dev/bin/pkg-config --libs gsl` -> 0
stdout:
-L/home/martin/miniforge3/envs/sage-dev/lib -lgsl -lgslcblas -lm -lcblas -lm
-----------
Running compile:
Working directory: /home/martin/sage-trac/build/cp312/meson-private/tmpf5043z68
Code:
int main(void) { return 0; }
-----------
Command line: `/home/martin/miniforge3/envs/sage-dev/bin/x86_64-conda-linux-gnu-c++ -L/home/martin/miniforge3/envs/sage-dev/lib /home/martin/sage-trac/build/cp312/meson-private/tmpf5043z68/testfile.cpp -o /home/martin/sage-trac/build/cp312/meson-private/tmpf5043z68/output.exe -fvisibility-inlines-hidden -fmessage-length=0 -march=nocona -mtune=haswell -ftree-vectorize -fPIC -fstack-protector-strong -fno-plt -O2 -ffunction-sections -pipe -DNDEBUG -D_FORTIFY_SOURCE=2 -O2 -D_FILE_OFFSET_BITS=64 -O0 -U_FORTIFY_SOURCE -fpermissive -lm -Wl,--allow-shlib-undefined -Wl,-O2 -Wl,--sort-common -Wl,--as-needed -Wl,-z,relro -Wl,-z,now -Wl,--disable-new-dtags -Wl,--gc-sections -Wl,--allow-shlib-undefined -Wl,-rpath,/home/martin/miniforge3/envs/sage-dev/lib -Wl,-rpath-link,/home/martin/miniforge3/envs/sage-dev/lib` -> 0
Run-time dependency gsl found: YES 2.8
Determining dependency 'gdlib' with pkg-config executable '/home/martin/miniforge3/envs/sage-dev/bin/pkg-config'
env[PKG_CONFIG_PATH]:
env[PKG_CONFIG]: /home/martin/miniforge3/envs/sage-dev/bin/pkg-config
-----------
Called: `/home/martin/miniforge3/envs/sage-dev/bin/pkg-config --modversion gdlib` -> 0
stdout:
2.3.3
-----------
env[PKG_CONFIG_PATH]:
env[PKG_CONFIG]: /home/martin/miniforge3/envs/sage-dev/bin/pkg-config
-----------
Called: `/home/martin/miniforge3/envs/sage-dev/bin/pkg-config --cflags gdlib` -> 0
stdout:
-I/home/martin/miniforge3/envs/sage-dev/include -I/home/martin/miniforge3/envs/sage-dev/include/libpng16 -I/home/martin/miniforge3/envs/sage-dev/include -I/home/martin/miniforge3/envs/sage-dev/include/freetype2 -I/home/martin/miniforge3/envs/sage-dev/include -I/home/martin/miniforge3/envs/sage-dev/include/webp
-----------
env[PKG_CONFIG_ALLOW_SYSTEM_LIBS]: 1
env[PKG_CONFIG_PATH]:
env[PKG_CONFIG]: /home/martin/miniforge3/envs/sage-dev/bin/pkg-config
-----------
Called: `/home/martin/miniforge3/envs/sage-dev/bin/pkg-config --libs gdlib` -> 0
stdout:
-L/home/martin/miniforge3/envs/sage-dev/lib -lgd
-----------
env[PKG_CONFIG_PATH]:
env[PKG_CONFIG]: /home/martin/miniforge3/envs/sage-dev/bin/pkg-config
-----------
Called: `/home/martin/miniforge3/envs/sage-dev/bin/pkg-config --libs gdlib` -> 0
stdout:
-L/home/martin/miniforge3/envs/sage-dev/lib -lgd
-----------
Run-time dependency gdlib found: YES 2.3.3
Running compile:
Working directory: /home/martin/sage-trac/build/cp312/meson-private/tmpzbwwwhz8
Code:
int main(void) { return 0; }
-----------
Command line: `/home/martin/miniforge3/envs/sage-dev/bin/x86_64-conda-linux-gnu-cc -L/home/martin/miniforge3/envs/sage-dev/lib /home/martin/sage-trac/build/cp312/meson-private/tmpzbwwwhz8/testfile.c -o /home/martin/sage-trac/build/cp312/meson-private/tmpzbwwwhz8/output.exe -march=nocona -mtune=haswell -ftree-vectorize -fPIC -fstack-protector-strong -fno-plt -O2 -ffunction-sections -pipe -DNDEBUG -D_FORTIFY_SOURCE=2 -O2 -D_FILE_OFFSET_BITS=64 -O0 -U_FORTIFY_SOURCE -lm -Wl,--allow-shlib-undefined -Wl,-O2 -Wl,--sort-common -Wl,--as-needed -Wl,-z,relro -Wl,-z,now -Wl,--disable-new-dtags -Wl,--gc-sections -Wl,--allow-shlib-undefined -Wl,-rpath,/home/martin/miniforge3/envs/sage-dev/lib -Wl,-rpath-link,/home/martin/miniforge3/envs/sage-dev/lib` -> 0
Library m found: YES
Determining dependency 'm4ri' with pkg-config executable '/home/martin/miniforge3/envs/sage-dev/bin/pkg-config'
env[PKG_CONFIG_PATH]:
env[PKG_CONFIG]: /home/martin/miniforge3/envs/sage-dev/bin/pkg-config
-----------
Called: `/home/martin/miniforge3/envs/sage-dev/bin/pkg-config --modversion m4ri` -> 0
stdout:
20250128
-----------
env[PKG_CONFIG_PATH]:
env[PKG_CONFIG]: /home/martin/miniforge3/envs/sage-dev/bin/pkg-config
-----------
Called: `/home/martin/miniforge3/envs/sage-dev/bin/pkg-config --cflags m4ri` -> 0
stdout:
-I/home/martin/miniforge3/envs/sage-dev/include
-----------
env[PKG_CONFIG_ALLOW_SYSTEM_LIBS]: 1
env[PKG_CONFIG_PATH]:
env[PKG_CONFIG]: /home/martin/miniforge3/envs/sage-dev/bin/pkg-config
-----------
Called: `/home/martin/miniforge3/envs/sage-dev/bin/pkg-config --libs m4ri` -> 0
stdout:
-L/home/martin/miniforge3/envs/sage-dev/lib -lm4ri -lm
-----------
env[PKG_CONFIG_PATH]:
env[PKG_CONFIG]: /home/martin/miniforge3/envs/sage-dev/bin/pkg-config
-----------
Called: `/home/martin/miniforge3/envs/sage-dev/bin/pkg-config --libs m4ri` -> 0
stdout:
-L/home/martin/miniforge3/envs/sage-dev/lib -lm4ri -lm
-----------
Run-time dependency m4ri found: YES 20250128
Determining dependency 'm4rie' with pkg-config executable '/home/martin/miniforge3/envs/sage-dev/bin/pkg-config'
env[PKG_CONFIG_PATH]:
env[PKG_CONFIG]: /home/martin/miniforge3/envs/sage-dev/bin/pkg-config
-----------
Called: `/home/martin/miniforge3/envs/sage-dev/bin/pkg-config --modversion m4rie` -> 0
stdout:
20250128
-----------
env[PKG_CONFIG_PATH]:
env[PKG_CONFIG]: /home/martin/miniforge3/envs/sage-dev/bin/pkg-config
-----------
Called: `/home/martin/miniforge3/envs/sage-dev/bin/pkg-config --cflags m4rie` -> 0
stdout:
-I/home/martin/miniforge3/envs/sage-dev/include
-----------
env[PKG_CONFIG_ALLOW_SYSTEM_LIBS]: 1
env[PKG_CONFIG_PATH]:
env[PKG_CONFIG]: /home/martin/miniforge3/envs/sage-dev/bin/pkg-config
-----------
Called: `/home/martin/miniforge3/envs/sage-dev/bin/pkg-config --libs m4rie` -> 0
stdout:
-L/home/martin/miniforge3/envs/sage-dev/lib -lm4rie -lm4ri -lm
-----------
env[PKG_CONFIG_PATH]:
env[PKG_CONFIG]: /home/martin/miniforge3/envs/sage-dev/bin/pkg-config
-----------
Called: `/home/martin/miniforge3/envs/sage-dev/bin/pkg-config --libs m4rie` -> 0
stdout:
-L/home/martin/miniforge3/envs/sage-dev/lib -lm4rie -lm4ri -lm
-----------
Run-time dependency m4rie found: YES 20250128
Determining dependency 'libmtx' with pkg-config executable '/home/martin/miniforge3/envs/sage-dev/bin/pkg-config'
env[PKG_CONFIG_PATH]:
env[PKG_CONFIG]: /home/martin/miniforge3/envs/sage-dev/bin/pkg-config
-----------
Called: `/home/martin/miniforge3/envs/sage-dev/bin/pkg-config --modversion libmtx` -> 1
stderr:
Package libmtx was not found in the pkg-config search path.
Perhaps you should add the directory containing `libmtx.pc'
to the PKG_CONFIG_PATH environment variable
No package 'libmtx' found
-----------
CMake binary for host machine is cached.
Preliminary CMake check failed. Aborting.
Run-time dependency libmtx found: NO (tried pkg-config and cmake)
Running compile:
Working directory: /home/martin/sage-trac/build/cp312/meson-private/tmp43rau7i7
Code:
#ifdef __has_include
#if !__has_include("meataxe.h")
#error "Header 'meataxe.h' could not be found"
#endif
#else
#include <meataxe.h>
#endif
-----------
Command line: `/home/martin/miniforge3/envs/sage-dev/bin/x86_64-conda-linux-gnu-cc /home/martin/sage-trac/build/cp312/meson-private/tmp43rau7i7/testfile.c -E -P -march=nocona -mtune=haswell -ftree-vectorize -fPIC -fstack-protector-strong -fno-plt -O2 -ffunction-sections -pipe -DNDEBUG -D_FORTIFY_SOURCE=2 -O2 -D_FILE_OFFSET_BITS=64 -P -O0 -U_FORTIFY_SOURCE -std=c17` -> 1
stderr:
/home/martin/sage-trac/build/cp312/meson-private/tmp43rau7i7/testfile.c:4:12: error: #error "Header 'meataxe.h' could not be found"
4 | #error "Header 'meataxe.h' could not be found"
| ^~~~~
-----------
Has header "meataxe.h" : NO
Determining dependency 'libpng' with pkg-config executable '/home/martin/miniforge3/envs/sage-dev/bin/pkg-config'
env[PKG_CONFIG_PATH]:
env[PKG_CONFIG]: /home/martin/miniforge3/envs/sage-dev/bin/pkg-config
-----------
Called: `/home/martin/miniforge3/envs/sage-dev/bin/pkg-config --modversion libpng` -> 0
stdout:
1.6.58
-----------
env[PKG_CONFIG_PATH]:
env[PKG_CONFIG]: /home/martin/miniforge3/envs/sage-dev/bin/pkg-config
-----------
Called: `/home/martin/miniforge3/envs/sage-dev/bin/pkg-config --cflags libpng` -> 0
stdout:
-I/home/martin/miniforge3/envs/sage-dev/include/libpng16 -I/home/martin/miniforge3/envs/sage-dev/include
-----------
env[PKG_CONFIG_ALLOW_SYSTEM_LIBS]: 1
env[PKG_CONFIG_PATH]:
env[PKG_CONFIG]: /home/martin/miniforge3/envs/sage-dev/bin/pkg-config
-----------
Called: `/home/martin/miniforge3/envs/sage-dev/bin/pkg-config --libs libpng` -> 0
stdout:
-L/home/martin/miniforge3/envs/sage-dev/lib -lpng16
-----------
env[PKG_CONFIG_PATH]:
env[PKG_CONFIG]: /home/martin/miniforge3/envs/sage-dev/bin/pkg-config
-----------
Called: `/home/martin/miniforge3/envs/sage-dev/bin/pkg-config --libs libpng` -> 0
stdout:
-L/home/martin/miniforge3/envs/sage-dev/lib -lpng16
-----------
Run-time dependency libpng found: YES 1.6.58
Determining dependency 'zlib' with pkg-config executable '/home/martin/miniforge3/envs/sage-dev/bin/pkg-config'
env[PKG_CONFIG_PATH]:
env[PKG_CONFIG]: /home/martin/miniforge3/envs/sage-dev/bin/pkg-config
-----------
Called: `/home/martin/miniforge3/envs/sage-dev/bin/pkg-config --modversion zlib` -> 0
stdout:
1.3.2
-----------
env[PKG_CONFIG_PATH]:
env[PKG_CONFIG]: /home/martin/miniforge3/envs/sage-dev/bin/pkg-config
-----------
Called: `/home/martin/miniforge3/envs/sage-dev/bin/pkg-config --cflags zlib` -> 0
stdout:
-I/home/martin/miniforge3/envs/sage-dev/include
-----------
env[PKG_CONFIG_ALLOW_SYSTEM_LIBS]: 1
env[PKG_CONFIG_PATH]:
env[PKG_CONFIG]: /home/martin/miniforge3/envs/sage-dev/bin/pkg-config
-----------
Called: `/home/martin/miniforge3/envs/sage-dev/bin/pkg-config --libs zlib` -> 0
stdout:
-L/home/martin/miniforge3/envs/sage-dev/lib -lz
-----------
env[PKG_CONFIG_PATH]:
env[PKG_CONFIG]: /home/martin/miniforge3/envs/sage-dev/bin/pkg-config
-----------
Called: `/home/martin/miniforge3/envs/sage-dev/bin/pkg-config --libs zlib` -> 0
stdout:
-L/home/martin/miniforge3/envs/sage-dev/lib -lz
-----------
Run-time dependency zlib found: YES 1.3.2
Determining dependency 'eclib' with pkg-config executable '/home/martin/miniforge3/envs/sage-dev/bin/pkg-config'
env[PKG_CONFIG_PATH]:
env[PKG_CONFIG]: /home/martin/miniforge3/envs/sage-dev/bin/pkg-config
-----------
Called: `/home/martin/miniforge3/envs/sage-dev/bin/pkg-config --modversion eclib` -> 0
stdout:
20250627
-----------
env[PKG_CONFIG_PATH]:
env[PKG_CONFIG]: /home/martin/miniforge3/envs/sage-dev/bin/pkg-config
-----------
Called: `/home/martin/miniforge3/envs/sage-dev/bin/pkg-config --cflags eclib` -> 0
stdout:
-I/home/martin/miniforge3/envs/sage-dev/include
-----------
env[PKG_CONFIG_ALLOW_SYSTEM_LIBS]: 1
env[PKG_CONFIG_PATH]:
env[PKG_CONFIG]: /home/martin/miniforge3/envs/sage-dev/bin/pkg-config
-----------
Called: `/home/martin/miniforge3/envs/sage-dev/bin/pkg-config --libs eclib` -> 0
stdout:
-L/home/martin/miniforge3/envs/sage-dev/lib -lec
-----------
env[PKG_CONFIG_PATH]:
env[PKG_CONFIG]: /home/martin/miniforge3/envs/sage-dev/bin/pkg-config
-----------
Called: `/home/martin/miniforge3/envs/sage-dev/bin/pkg-config --libs eclib` -> 0
stdout:
-L/home/martin/miniforge3/envs/sage-dev/lib -lec
-----------
Run-time dependency eclib found: YES 20250627
Running compile:
Working directory: /home/martin/sage-trac/build/cp312/meson-private/tmp9dp7g5iy
Code:
int main(void) { return 0; }
-----------
Command line: `/home/martin/miniforge3/envs/sage-dev/bin/x86_64-conda-linux-gnu-cc -L/home/martin/miniforge3/envs/sage-dev/lib /home/martin/sage-trac/build/cp312/meson-private/tmp9dp7g5iy/testfile.c -o /home/martin/sage-trac/build/cp312/meson-private/tmp9dp7g5iy/output.exe -march=nocona -mtune=haswell -ftree-vectorize -fPIC -fstack-protector-strong -fno-plt -O2 -ffunction-sections -pipe -DNDEBUG -D_FORTIFY_SOURCE=2 -O2 -D_FILE_OFFSET_BITS=64 -O0 -U_FORTIFY_SOURCE -lecm -Wl,--allow-shlib-undefined -Wl,-O2 -Wl,--sort-common -Wl,--as-needed -Wl,-z,relro -Wl,-z,now -Wl,--disable-new-dtags -Wl,--gc-sections -Wl,--allow-shlib-undefined -Wl,-rpath,/home/martin/miniforge3/envs/sage-dev/lib -Wl,-rpath-link,/home/martin/miniforge3/envs/sage-dev/lib` -> 0
Library ecm found: YES
Determining dependency 'gmpxx' with pkg-config executable '/home/martin/miniforge3/envs/sage-dev/bin/pkg-config'
env[PKG_CONFIG_PATH]:
env[PKG_CONFIG]: /home/martin/miniforge3/envs/sage-dev/bin/pkg-config
-----------
Called: `/home/martin/miniforge3/envs/sage-dev/bin/pkg-config --modversion gmpxx` -> 0
stdout:
6.3.0
-----------
env[PKG_CONFIG_PATH]:
env[PKG_CONFIG]: /home/martin/miniforge3/envs/sage-dev/bin/pkg-config
-----------
Called: `/home/martin/miniforge3/envs/sage-dev/bin/pkg-config --cflags gmpxx` -> 0
stdout:
-I/home/martin/miniforge3/envs/sage-dev/include
-----------
env[PKG_CONFIG_ALLOW_SYSTEM_LIBS]: 1
env[PKG_CONFIG_PATH]:
env[PKG_CONFIG]: /home/martin/miniforge3/envs/sage-dev/bin/pkg-config
-----------
Called: `/home/martin/miniforge3/envs/sage-dev/bin/pkg-config --libs gmpxx` -> 0
stdout:
-L/home/martin/miniforge3/envs/sage-dev/lib -lgmpxx -lgmp
-----------
env[PKG_CONFIG_PATH]:
env[PKG_CONFIG]: /home/martin/miniforge3/envs/sage-dev/bin/pkg-config
-----------
Called: `/home/martin/miniforge3/envs/sage-dev/bin/pkg-config --libs gmpxx` -> 0
stdout:
-L/home/martin/miniforge3/envs/sage-dev/lib -lgmpxx -lgmp
-----------
Run-time dependency gmpxx found: YES 6.3.0
Determining dependency 'fflas-ffpack' with pkg-config executable '/home/martin/miniforge3/envs/sage-dev/bin/pkg-config'
env[PKG_CONFIG_PATH]:
env[PKG_CONFIG]: /home/martin/miniforge3/envs/sage-dev/bin/pkg-config
-----------
Called: `/home/martin/miniforge3/envs/sage-dev/bin/pkg-config --modversion fflas-ffpack` -> 0
stdout:
2.5.0
-----------
env[PKG_CONFIG_PATH]:
env[PKG_CONFIG]: /home/martin/miniforge3/envs/sage-dev/bin/pkg-config
-----------
Called: `/home/martin/miniforge3/envs/sage-dev/bin/pkg-config --cflags fflas-ffpack` -> 0
stdout:
-DFFLAS_COMPILED -DFFPACK_COMPILED -I/home/martin/miniforge3/envs/sage-dev/include
-----------
env[PKG_CONFIG_ALLOW_SYSTEM_LIBS]: 1
env[PKG_CONFIG_PATH]:
env[PKG_CONFIG]: /home/martin/miniforge3/envs/sage-dev/bin/pkg-config
-----------
Called: `/home/martin/miniforge3/envs/sage-dev/bin/pkg-config --libs fflas-ffpack` -> 0
stdout:
-L/home/martin/miniforge3/envs/sage-dev/lib -lfflas -lffpack -llapack -lcblas -lblas -lgivaro -lgmpxx -lgmp
-----------
env[PKG_CONFIG_PATH]:
env[PKG_CONFIG]: /home/martin/miniforge3/envs/sage-dev/bin/pkg-config
-----------
Called: `/home/martin/miniforge3/envs/sage-dev/bin/pkg-config --libs fflas-ffpack` -> 0
stdout:
-L/home/martin/miniforge3/envs/sage-dev/lib -lfflas -lffpack -llapack -lcblas -lblas -lgivaro -lgmpxx -lgmp
-----------
Run-time dependency fflas-ffpack found: YES 2.5.0
Determining dependency 'givaro' with pkg-config executable '/home/martin/miniforge3/envs/sage-dev/bin/pkg-config'
env[PKG_CONFIG_PATH]:
env[PKG_CONFIG]: /home/martin/miniforge3/envs/sage-dev/bin/pkg-config
-----------
Called: `/home/martin/miniforge3/envs/sage-dev/bin/pkg-config --modversion givaro` -> 0
stdout:
4.2.1
-----------
env[PKG_CONFIG_PATH]:
env[PKG_CONFIG]: /home/martin/miniforge3/envs/sage-dev/bin/pkg-config
-----------
Called: `/home/martin/miniforge3/envs/sage-dev/bin/pkg-config --cflags givaro` -> 0
stdout:
-I/home/martin/miniforge3/envs/sage-dev/include
-----------
env[PKG_CONFIG_ALLOW_SYSTEM_LIBS]: 1
env[PKG_CONFIG_PATH]:
env[PKG_CONFIG]: /home/martin/miniforge3/envs/sage-dev/bin/pkg-config
-----------
Called: `/home/martin/miniforge3/envs/sage-dev/bin/pkg-config --libs givaro` -> 0
stdout:
-L/home/martin/miniforge3/envs/sage-dev/lib -lgivaro -lgmpxx -lgmp
-----------
env[PKG_CONFIG_PATH]:
env[PKG_CONFIG]: /home/martin/miniforge3/envs/sage-dev/bin/pkg-config
-----------
Called: `/home/martin/miniforge3/envs/sage-dev/bin/pkg-config --libs givaro` -> 0
stdout:
-L/home/martin/miniforge3/envs/sage-dev/lib -lgivaro -lgmpxx -lgmp
-----------
Run-time dependency givaro found: YES 4.2.1
Determining dependency 'linbox' with pkg-config executable '/home/martin/miniforge3/envs/sage-dev/bin/pkg-config'
env[PKG_CONFIG_PATH]:
env[PKG_CONFIG]: /home/martin/miniforge3/envs/sage-dev/bin/pkg-config
-----------
Called: `/home/martin/miniforge3/envs/sage-dev/bin/pkg-config --modversion linbox` -> 0
stdout:
1.7.1
-----------
env[PKG_CONFIG_PATH]:
env[PKG_CONFIG]: /home/martin/miniforge3/envs/sage-dev/bin/pkg-config
-----------
Called: `/home/martin/miniforge3/envs/sage-dev/bin/pkg-config --cflags linbox` -> 0
stdout:
-DDISABLE_COMMENTATOR -pthread -DFFLAS_COMPILED -DFFPACK_COMPILED -I/home/martin/miniforge3/envs/sage-dev/include
-----------
env[PKG_CONFIG_ALLOW_SYSTEM_LIBS]: 1
env[PKG_CONFIG_PATH]:
env[PKG_CONFIG]: /home/martin/miniforge3/envs/sage-dev/bin/pkg-config
-----------
Called: `/home/martin/miniforge3/envs/sage-dev/bin/pkg-config --libs linbox` -> 0
stdout:
-L/home/martin/miniforge3/envs/sage-dev/lib -llinbox -lntl -lmpfr -liml -lflint -lfflas -lffpack -llapack -lcblas -lblas -lgivaro -lgmpxx -lgmp
-----------
env[PKG_CONFIG_PATH]:
env[PKG_CONFIG]: /home/martin/miniforge3/envs/sage-dev/bin/pkg-config
-----------
Called: `/home/martin/miniforge3/envs/sage-dev/bin/pkg-config --libs linbox` -> 0
stdout:
-L/home/martin/miniforge3/envs/sage-dev/lib -llinbox -lntl -lmpfr -liml -lflint -lfflas -lffpack -llapack -lcblas -lblas -lgivaro -lgmpxx -lgmp
-----------
Run-time dependency linbox found: YES 1.7.1
Running compile:
Working directory: /home/martin/sage-trac/build/cp312/meson-private/tmp2x_0xer3
Code:
int main(void) { return 0; }
-----------
Command line: `/home/martin/miniforge3/envs/sage-dev/bin/x86_64-conda-linux-gnu-cc -L/home/martin/miniforge3/envs/sage-dev/lib /home/martin/sage-trac/build/cp312/meson-private/tmp2x_0xer3/testfile.c -o /home/martin/sage-trac/build/cp312/meson-private/tmp2x_0xer3/output.exe -march=nocona -mtune=haswell -ftree-vectorize -fPIC -fstack-protector-strong -fno-plt -O2 -ffunction-sections -pipe -DNDEBUG -D_FORTIFY_SOURCE=2 -O2 -D_FILE_OFFSET_BITS=64 -O0 -U_FORTIFY_SOURCE -lmpc -Wl,--allow-shlib-undefined -Wl,-O2 -Wl,--sort-common -Wl,--as-needed -Wl,-z,relro -Wl,-z,now -Wl,--disable-new-dtags -Wl,--gc-sections -Wl,--allow-shlib-undefined -Wl,-rpath,/home/martin/miniforge3/envs/sage-dev/lib -Wl,-rpath-link,/home/martin/miniforge3/envs/sage-dev/lib` -> 0
Library mpc found: YES
Running compile:
Working directory: /home/martin/sage-trac/build/cp312/meson-private/tmp7u1w6y3l
Code:
int main(void) { return 0; }
-----------
Command line: `/home/martin/miniforge3/envs/sage-dev/bin/x86_64-conda-linux-gnu-cc -L/home/martin/miniforge3/envs/sage-dev/lib /home/martin/sage-trac/build/cp312/meson-private/tmp7u1w6y3l/testfile.c -o /home/martin/sage-trac/build/cp312/meson-private/tmp7u1w6y3l/output.exe -march=nocona -mtune=haswell -ftree-vectorize -fPIC -fstack-protector-strong -fno-plt -O2 -ffunction-sections -pipe -DNDEBUG -D_FORTIFY_SOURCE=2 -O2 -D_FILE_OFFSET_BITS=64 -O0 -U_FORTIFY_SOURCE -lmpfi -Wl,--allow-shlib-undefined -Wl,-O2 -Wl,--sort-common -Wl,--as-needed -Wl,-z,relro -Wl,-z,now -Wl,--disable-new-dtags -Wl,--gc-sections -Wl,--allow-shlib-undefined -Wl,-rpath,/home/martin/miniforge3/envs/sage-dev/lib -Wl,-rpath-link,/home/martin/miniforge3/envs/sage-dev/lib` -> 0
Library mpfi found: YES
Determining dependency 'libgap' with pkg-config executable '/home/martin/miniforge3/envs/sage-dev/bin/pkg-config'
env[PKG_CONFIG_PATH]:
env[PKG_CONFIG]: /home/martin/miniforge3/envs/sage-dev/bin/pkg-config
-----------
Called: `/home/martin/miniforge3/envs/sage-dev/bin/pkg-config --modversion libgap` -> 0
stdout:
4.15.1
-----------
env[PKG_CONFIG_PATH]:
env[PKG_CONFIG]: /home/martin/miniforge3/envs/sage-dev/bin/pkg-config
-----------
Called: `/home/martin/miniforge3/envs/sage-dev/bin/pkg-config --cflags libgap` -> 0
stdout:
-I/home/martin/miniforge3/envs/sage-dev/include
-----------
env[PKG_CONFIG_ALLOW_SYSTEM_LIBS]: 1
env[PKG_CONFIG_PATH]:
env[PKG_CONFIG]: /home/martin/miniforge3/envs/sage-dev/bin/pkg-config
-----------
Called: `/home/martin/miniforge3/envs/sage-dev/bin/pkg-config --libs libgap` -> 0
stdout:
-L/home/martin/miniforge3/envs/sage-dev/lib -lgap
-----------
env[PKG_CONFIG_PATH]:
env[PKG_CONFIG]: /home/martin/miniforge3/envs/sage-dev/bin/pkg-config
-----------
Called: `/home/martin/miniforge3/envs/sage-dev/bin/pkg-config --libs libgap` -> 0
stdout:
-L/home/martin/miniforge3/envs/sage-dev/lib -lgap
-----------
Run-time dependency libgap found: YES 4.15.1
Determining dependency 'Singular' with pkg-config executable '/home/martin/miniforge3/envs/sage-dev/bin/pkg-config'
env[PKG_CONFIG_PATH]:
env[PKG_CONFIG]: /home/martin/miniforge3/envs/sage-dev/bin/pkg-config
-----------
Called: `/home/martin/miniforge3/envs/sage-dev/bin/pkg-config --modversion Singular` -> 0
stdout:
4.4.1
-----------
env[PKG_CONFIG_PATH]:
env[PKG_CONFIG]: /home/martin/miniforge3/envs/sage-dev/bin/pkg-config
-----------
Called: `/home/martin/miniforge3/envs/sage-dev/bin/pkg-config --cflags Singular` -> 0
stdout:
-DSING_NDEBUG -DOM_NDEBUG -DSING_NDEBUG -DOM_NDEBUG -DSING_NDEBUG -DOM_NDEBUG -DSING_NDEBUG -DOM_NDEBUG -I/home/martin/miniforge3/envs/sage-dev/include -I/home/martin/miniforge3/envs/sage-dev/include/singular -I/home/martin/miniforge3/envs/sage-dev/include -I/home/martin/miniforge3/envs/sage-dev/include/singular -I/home/martin/miniforge3/envs/sage-dev/include/ -I/home/martin/miniforge3/envs/sage-dev/include -I/home/martin/miniforge3/envs/sage-dev/include/ -I/home/martin/miniforge3/envs/sage-dev/include
-----------
env[PKG_CONFIG_ALLOW_SYSTEM_LIBS]: 1
env[PKG_CONFIG_PATH]:
env[PKG_CONFIG]: /home/martin/miniforge3/envs/sage-dev/bin/pkg-config
-----------
Called: `/home/martin/miniforge3/envs/sage-dev/bin/pkg-config --libs Singular` -> 0
stdout:
-L/home/martin/miniforge3/envs/sage-dev/lib -lSingular -ldl -lpolys -Wl,-rpath,/home/martin/miniforge3/envs/sage-dev/lib -lflint -lmpfr -lgmp -Wl,-rpath,/home/martin/miniforge3/envs/sage-dev/lib -lgmp -ldl -lfactory -Wl,-rpath,/home/martin/miniforge3/envs/sage-dev/lib -lflint -lmpfr -lgmp -lntl -Wl,-rpath,/home/martin/miniforge3/envs/sage-dev/lib -lgmp -lomalloc -lsingular_resources
-----------
env[PKG_CONFIG_PATH]:
env[PKG_CONFIG]: /home/martin/miniforge3/envs/sage-dev/bin/pkg-config
-----------
Called: `/home/martin/miniforge3/envs/sage-dev/bin/pkg-config --libs Singular` -> 0
stdout:
-L/home/martin/miniforge3/envs/sage-dev/lib -lSingular -ldl -lpolys -Wl,-rpath,/home/martin/miniforge3/envs/sage-dev/lib -lflint -lmpfr -lgmp -Wl,-rpath,/home/martin/miniforge3/envs/sage-dev/lib -lgmp -ldl -lfactory -Wl,-rpath,/home/martin/miniforge3/envs/sage-dev/lib -lflint -lmpfr -lgmp -lntl -Wl,-rpath,/home/martin/miniforge3/envs/sage-dev/lib -lgmp -lomalloc -lsingular_resources
-----------
Running compile:
Working directory: /home/martin/sage-trac/build/cp312/meson-private/tmp70k0daf0
Code:
int main(void) { return 0; }
-----------
Command line: `/home/martin/miniforge3/envs/sage-dev/bin/x86_64-conda-linux-gnu-c++ -L/home/martin/miniforge3/envs/sage-dev/lib /home/martin/sage-trac/build/cp312/meson-private/tmp70k0daf0/testfile.cpp -o /home/martin/sage-trac/build/cp312/meson-private/tmp70k0daf0/output.exe -fvisibility-inlines-hidden -fmessage-length=0 -march=nocona -mtune=haswell -ftree-vectorize -fPIC -fstack-protector-strong -fno-plt -O2 -ffunction-sections -pipe -DNDEBUG -D_FORTIFY_SOURCE=2 -O2 -D_FILE_OFFSET_BITS=64 -O0 -U_FORTIFY_SOURCE -fpermissive -ldl -Wl,--allow-shlib-undefined -Wl,-O2 -Wl,--sort-common -Wl,--as-needed -Wl,-z,relro -Wl,-z,now -Wl,--disable-new-dtags -Wl,--gc-sections -Wl,--allow-shlib-undefined -Wl,-rpath,/home/martin/miniforge3/envs/sage-dev/lib -Wl,-rpath-link,/home/martin/miniforge3/envs/sage-dev/lib` -> 0
Run-time dependency singular found: YES 4.4.1
Running compile:
Working directory: /home/martin/sage-trac/build/cp312/meson-private/tmp48xg_y83
Code:
int main(void) { return 0; }
-----------
Command line: `/home/martin/miniforge3/envs/sage-dev/bin/x86_64-conda-linux-gnu-cc -L/home/martin/miniforge3/envs/sage-dev/lib /home/martin/sage-trac/build/cp312/meson-private/tmp48xg_y83/testfile.c -o /home/martin/sage-trac/build/cp312/meson-private/tmp48xg_y83/output.exe -march=nocona -mtune=haswell -ftree-vectorize -fPIC -fstack-protector-strong -fno-plt -O2 -ffunction-sections -pipe -DNDEBUG -D_FORTIFY_SOURCE=2 -O2 -D_FILE_OFFSET_BITS=64 -O0 -U_FORTIFY_SOURCE -lntl -Wl,--allow-shlib-undefined -Wl,-O2 -Wl,--sort-common -Wl,--as-needed -Wl,-z,relro -Wl,-z,now -Wl,--disable-new-dtags -Wl,--gc-sections -Wl,--allow-shlib-undefined -Wl,-rpath,/home/martin/miniforge3/envs/sage-dev/lib -Wl,-rpath-link,/home/martin/miniforge3/envs/sage-dev/lib` -> 0
Library ntl found: YES
Determining dependency 'boost' with pkg-config executable '/home/martin/miniforge3/envs/sage-dev/bin/pkg-config'
env[PKG_CONFIG_PATH]:
env[PKG_CONFIG]: /home/martin/miniforge3/envs/sage-dev/bin/pkg-config
-----------
Called: `/home/martin/miniforge3/envs/sage-dev/bin/pkg-config --modversion boost` -> 1
stderr:
Package boost was not found in the pkg-config search path.
Perhaps you should add the directory containing `boost.pc'
to the PKG_CONFIG_PATH environment variable
No package 'boost' found
-----------
Checking potential boost root /home/martin/miniforge3/envs/sage-dev/lib/gcc/x86_64-conda-linux-gnu/14.3.0/include
Checking potential boost root /home/martin/miniforge3/envs/sage-dev/lib/gcc/x86_64-conda-linux-gnu/14.3.0/include/c++
Checking potential boost root /home/martin/miniforge3/envs/sage-dev/lib/gcc/x86_64-conda-linux-gnu/14.3.0
Checking potential boost root /home/martin/miniforge3/envs/sage-dev/x86_64-conda-linux-gnu/sysroot/usr
Checking potential boost root /home/martin/miniforge3/envs/sage-dev
- potential library dirs: ['/home/martin/miniforge3/envs/sage-dev/lib/gcc/x86_64-conda-linux-gnu/14.3.0', '/home/martin/miniforge3/envs/sage-dev/lib/gcc', '/home/martin/miniforge3/envs/sage-dev/x86_64-conda-linux-gnu/lib', '/home/martin/miniforge3/envs/sage-dev/lib', '/home/martin/miniforge3/envs/sage-dev/x86_64-conda-linux-gnu/sysroot/lib64']
- potential include dirs: ['/home/martin/miniforge3/envs/sage-dev/include']
- found boost library dir: /home/martin/miniforge3/envs/sage-dev/lib
- found boost 1.85.0 include dir: /home/martin/miniforge3/envs/sage-dev/include
- filtered library list:
- <LIB: -M ------ ??? ? 1_85 boost_atomic /home/martin/miniforge3/envs/sage-dev/lib/libboost_atomic.so.1.85.0>
- <LIB: -M ------ ??? ? 1_85 boost_charconv /home/martin/miniforge3/envs/sage-dev/lib/libboost_charconv.so.1.85.0>
- <LIB: -M ------ ??? ? 1_85 boost_chrono /home/martin/miniforge3/envs/sage-dev/lib/libboost_chrono.so.1.85.0>
- <LIB: -M ------ ??? ? 1_85 boost_cobalt /home/martin/miniforge3/envs/sage-dev/lib/libboost_cobalt.so.1.85.0>
- <LIB: -M ------ ??? ? 1_85 boost_container /home/martin/miniforge3/envs/sage-dev/lib/libboost_container.so.1.85.0>
- <LIB: -M ------ ??? ? 1_85 boost_context /home/martin/miniforge3/envs/sage-dev/lib/libboost_context.so.1.85.0>
- <LIB: -M ------ ??? ? 1_85 boost_contract /home/martin/miniforge3/envs/sage-dev/lib/libboost_contract.so.1.85.0>
- <LIB: -M ------ ??? ? 1_85 boost_coroutine /home/martin/miniforge3/envs/sage-dev/lib/libboost_coroutine.so.1.85.0>
- <LIB: -M ------ ??? ? 1_85 boost_date_time /home/martin/miniforge3/envs/sage-dev/lib/libboost_date_time.so.1.85.0>
- <LIB: -M ------ ??? ? 1_85 boost_fiber /home/martin/miniforge3/envs/sage-dev/lib/libboost_fiber.so.1.85.0>
- <LIB: -M ------ ??? ? 1_85 boost_filesystem /home/martin/miniforge3/envs/sage-dev/lib/libboost_filesystem.so.1.85.0>
- <LIB: -M ------ ??? ? 1_85 boost_graph /home/martin/miniforge3/envs/sage-dev/lib/libboost_graph.so.1.85.0>
- <LIB: -M ------ ??? ? 1_85 boost_iostreams /home/martin/miniforge3/envs/sage-dev/lib/libboost_iostreams.so.1.85.0>
- <LIB: -M ------ ??? ? 1_85 boost_json /home/martin/miniforge3/envs/sage-dev/lib/libboost_json.so.1.85.0>
- <LIB: -M ------ ??? ? 1_85 boost_locale /home/martin/miniforge3/envs/sage-dev/lib/libboost_locale.so.1.85.0>
- <LIB: -M ------ ??? ? 1_85 boost_log /home/martin/miniforge3/envs/sage-dev/lib/libboost_log.so.1.85.0>
- <LIB: -M ------ ??? ? 1_85 boost_log_setup /home/martin/miniforge3/envs/sage-dev/lib/libboost_log_setup.so.1.85.0>
- <LIB: -M ------ ??? ? 1_85 boost_math_c99 /home/martin/miniforge3/envs/sage-dev/lib/libboost_math_c99.so.1.85.0>
- <LIB: -M ------ ??? ? 1_85 boost_math_c99f /home/martin/miniforge3/envs/sage-dev/lib/libboost_math_c99f.so.1.85.0>
- <LIB: -M ------ ??? ? 1_85 boost_math_c99l /home/martin/miniforge3/envs/sage-dev/lib/libboost_math_c99l.so.1.85.0>
- <LIB: -M ------ ??? ? 1_85 boost_math_tr1 /home/martin/miniforge3/envs/sage-dev/lib/libboost_math_tr1.so.1.85.0>
- <LIB: -M ------ ??? ? 1_85 boost_math_tr1f /home/martin/miniforge3/envs/sage-dev/lib/libboost_math_tr1f.so.1.85.0>
- <LIB: -M ------ ??? ? 1_85 boost_math_tr1l /home/martin/miniforge3/envs/sage-dev/lib/libboost_math_tr1l.so.1.85.0>
- <LIB: -M ------ ??? ? 1_85 boost_nowide /home/martin/miniforge3/envs/sage-dev/lib/libboost_nowide.so.1.85.0>
- <LIB: -M ------ ??? ? 1_85 boost_prg_exec_monitor /home/martin/miniforge3/envs/sage-dev/lib/libboost_prg_exec_monitor.so.1.85.0>
- <LIB: -M ------ ??? ? 1_85 boost_program_options /home/martin/miniforge3/envs/sage-dev/lib/libboost_program_options.so.1.85.0>
- <LIB: -M ------ ??? ? 1_85 boost_random /home/martin/miniforge3/envs/sage-dev/lib/libboost_random.so.1.85.0>
- <LIB: -M ------ ??? ? 1_85 boost_regex /home/martin/miniforge3/envs/sage-dev/lib/libboost_regex.so.1.85.0>
- <LIB: -M ------ ??? ? 1_85 boost_serialization /home/martin/miniforge3/envs/sage-dev/lib/libboost_serialization.so.1.85.0>
- <LIB: -M ------ ??? ? 1_85 boost_stacktrace_addr2line /home/martin/miniforge3/envs/sage-dev/lib/libboost_stacktrace_addr2line.so.1.85.0>
- <LIB: -M ------ ??? ? 1_85 boost_stacktrace_basic /home/martin/miniforge3/envs/sage-dev/lib/libboost_stacktrace_basic.so.1.85.0>
- <LIB: -M ------ ??? ? 1_85 boost_stacktrace_noop /home/martin/miniforge3/envs/sage-dev/lib/libboost_stacktrace_noop.so.1.85.0>
- <LIB: -M ------ ??? ? 1_85 boost_system /home/martin/miniforge3/envs/sage-dev/lib/libboost_system.so.1.85.0>
- <LIB: -M ------ ??? ? 1_85 boost_thread /home/martin/miniforge3/envs/sage-dev/lib/libboost_thread.so.1.85.0>
- <LIB: -M ------ ??? ? 1_85 boost_timer /home/martin/miniforge3/envs/sage-dev/lib/libboost_timer.so.1.85.0>
- <LIB: -M ------ ??? ? 1_85 boost_type_erasure /home/martin/miniforge3/envs/sage-dev/lib/libboost_type_erasure.so.1.85.0>
- <LIB: -M ------ ??? ? 1_85 boost_unit_test_framework /home/martin/miniforge3/envs/sage-dev/lib/libboost_unit_test_framework.so.1.85.0>
- <LIB: -M ------ ??? ? 1_85 boost_url /home/martin/miniforge3/envs/sage-dev/lib/libboost_url.so.1.85.0>
- <LIB: -M ------ ??? ? 1_85 boost_wave /home/martin/miniforge3/envs/sage-dev/lib/libboost_wave.so.1.85.0>
- <LIB: -M ------ ??? ? 1_85 boost_wserialization /home/martin/miniforge3/envs/sage-dev/lib/libboost_wserialization.so.1.85.0>
- found:
- boost_graph link=['/home/martin/miniforge3/envs/sage-dev/lib/libboost_graph.so.1.85.0'] comp=[]
- final compile args: ['-I/home/martin/miniforge3/envs/sage-dev/include', '-DBOOST_ALL_NO_LIB']
- final link args: ['/home/martin/miniforge3/envs/sage-dev/lib/libboost_graph.so.1.85.0']
Run-time dependency Boost (found: graph) for cpp found: YES 1.85.0 (/home/martin/miniforge3/envs/sage-dev)
Running compile:
Working directory: /home/martin/tmp/tmp_rbkii4i
Code:
#ifndef _OPENMP
# define _OPENMP "MESON_GET_DEFINE_UNDEFINED_SENTINEL"
#endif
"MESON_GET_DEFINE_DELIMITER_START"
_OPENMP
"MESON_GET_DEFINE_DELIMITER_END"
-----------
Command line: `/home/martin/miniforge3/envs/sage-dev/bin/x86_64-conda-linux-gnu-c++ /home/martin/tmp/tmp_rbkii4i/testfile.cpp -E -P -fopenmp -fvisibility-inlines-hidden -fmessage-length=0 -march=nocona -mtune=haswell -ftree-vectorize -fPIC -fstack-protector-strong -fno-plt -O2 -ffunction-sections -pipe -DNDEBUG -D_FORTIFY_SOURCE=2 -O2 -D_FILE_OFFSET_BITS=64 -P -O0 -U_FORTIFY_SOURCE -fpermissive` -> 0
stdout:
"MESON_GET_DEFINE_DELIMITER_START"
201511
"MESON_GET_DEFINE_DELIMITER_END"
-----------
Running compile:
Working directory: /home/martin/sage-trac/build/cp312/meson-private/tmp8gcgollw
Code:
#ifdef __has_include
#if !__has_include("omp.h")
#error "Header 'omp.h' could not be found"
#endif
#else
#include <omp.h>
#endif
-----------
Command line: `/home/martin/miniforge3/envs/sage-dev/bin/x86_64-conda-linux-gnu-c++ /home/martin/sage-trac/build/cp312/meson-private/tmp8gcgollw/testfile.cpp -E -P -fopenmp -fvisibility-inlines-hidden -fmessage-length=0 -march=nocona -mtune=haswell -ftree-vectorize -fPIC -fstack-protector-strong -fno-plt -O2 -ffunction-sections -pipe -DNDEBUG -D_FORTIFY_SOURCE=2 -O2 -D_FILE_OFFSET_BITS=64 -P -O0 -U_FORTIFY_SOURCE -fpermissive` -> 0
Run-time dependency OpenMP found: YES 4.5
Program gap found: YES (/home/martin/miniforge3/envs/sage-dev/bin/gap)
Program ecm found: YES (/home/martin/miniforge3/envs/sage-dev/bin/ecm)
Program directg found: YES (/home/martin/miniforge3/envs/sage-dev/bin/directg)
Program gentourng found: YES (/home/martin/miniforge3/envs/sage-dev/bin/gentourng)
Program geng found: YES (/home/martin/miniforge3/envs/sage-dev/bin/geng)
Program genbg found: YES (/home/martin/miniforge3/envs/sage-dev/bin/genbg)
Program gentreeg found: YES (/home/martin/miniforge3/envs/sage-dev/bin/gentreeg)
Program genktreeg found: YES (/home/martin/miniforge3/envs/sage-dev/bin/genktreeg)
Program genposetg found: YES (/home/martin/miniforge3/envs/sage-dev/bin/genposetg)
Determining dependency 'libsirocco' with pkg-config executable '/home/martin/miniforge3/envs/sage-dev/bin/pkg-config'
env[PKG_CONFIG_PATH]:
env[PKG_CONFIG]: /home/martin/miniforge3/envs/sage-dev/bin/pkg-config
-----------
Called: `/home/martin/miniforge3/envs/sage-dev/bin/pkg-config --modversion libsirocco` -> 0
stdout:
2.1.1
-----------
env[PKG_CONFIG_PATH]:
env[PKG_CONFIG]: /home/martin/miniforge3/envs/sage-dev/bin/pkg-config
-----------
Called: `/home/martin/miniforge3/envs/sage-dev/bin/pkg-config --cflags libsirocco` -> 0
stdout:
-I/home/martin/miniforge3/envs/sage-dev/include
-----------
env[PKG_CONFIG_ALLOW_SYSTEM_LIBS]: 1
env[PKG_CONFIG_PATH]:
env[PKG_CONFIG]: /home/martin/miniforge3/envs/sage-dev/bin/pkg-config
-----------
Called: `/home/martin/miniforge3/envs/sage-dev/bin/pkg-config --libs libsirocco` -> 0
stdout:
-L/home/martin/miniforge3/envs/sage-dev/lib -lsirocco
-----------
env[PKG_CONFIG_PATH]:
env[PKG_CONFIG]: /home/martin/miniforge3/envs/sage-dev/bin/pkg-config
-----------
Called: `/home/martin/miniforge3/envs/sage-dev/bin/pkg-config --libs libsirocco` -> 0
stdout:
-L/home/martin/miniforge3/envs/sage-dev/lib -lsirocco
-----------
Run-time dependency libsirocco found: YES 2.1.1
Running command: /home/martin/miniforge3/envs/sage-dev/bin/ecl --version
--- stdout ---
ECL 26.5.5
--- stderr ---
Program ecl found: YES 26.5.5 26.5.5 (/home/martin/miniforge3/envs/sage-dev/bin/ecl)
Program /home/martin/miniforge3/envs/sage-dev/bin/ecl-config found: YES (/home/martin/miniforge3/envs/sage-dev/bin/ecl-config)
Running command: /home/martin/miniforge3/envs/sage-dev/bin/ecl --norc --eval '(princ (lisp-implementation-version))' --eval '(quit)'
--- stdout ---
26.5.5
--- stderr ---
Running command: /home/martin/miniforge3/envs/sage-dev/bin/ecl-config --cflags
--- stdout ---
-Dlinux -I/home/martin/miniforge3/envs/sage-dev/include -march=nocona -mtune=haswell -ftree-vectorize -fPIC -fstack-protector-all -fno-plt -Og -g -Wall -Wextra -fvar-tracking-assignments -ffunction-sections -pipe -fno-merge-constants -isystem /home/martin/miniforge3/envs/sage-dev/include -fdebug-prefix-map=/home/conda/feedstock_root/build_artifacts/ecl_1786448161915/work=/usr/local/src/conda/ecl-26.5.5 -fdebug-prefix-map=/home/martin/miniforge3/envs/sage-dev=/usr/local/src/conda-prefix -I/home/martin/miniforge3/envs/sage-dev/include
--- stderr ---
Running command: /home/martin/miniforge3/envs/sage-dev/bin/ecl-config --libs
--- stdout ---
-Wl,--rpath,/home/martin/miniforge3/envs/sage-dev/lib -L/home/martin/miniforge3/envs/sage-dev/lib -lecl -Wl,-O2 -Wl,--sort-common -Wl,--as-needed -Wl,-z,relro -Wl,-z,now -Wl,--disable-new-dtags -Wl,--gc-sections -Wl,--allow-shlib-undefined -Wl,-rpath,/home/martin/miniforge3/envs/sage-dev/lib -Wl,-rpath-link,/home/martin/miniforge3/envs/sage-dev/lib -L/home/martin/miniforge3/envs/sage-dev/lib -Wl,--rpath,/home/martin/miniforge3/envs/sage-dev/lib -L/home/martin/miniforge3/envs/sage-dev/lib -Wl,--rpath,/home/martin/miniforge3/envs/sage-dev/lib -L/home/martin/miniforge3/envs/sage-dev/lib -Wl,--rpath,/home/martin/miniforge3/envs/sage-dev/lib -L/home/martin/miniforge3/envs/sage-dev/lib -Wl,--rpath,/home/martin/miniforge3/envs/sage-dev/lib -L/home/martin/miniforge3/envs/sage-dev/lib -lgc -lgc -lgc -lpthread -ldl -lm
--- stderr ---
Running command: /home/martin/miniforge3/envs/sage-dev/bin/ecl --eval '(require '"'"'maxima)' --eval '(quit)'
--- stdout ---
;;; Loading #P"/home/martin/miniforge3/envs/sage-dev/lib/ecl-26.5.5/maxima.fas"
;;; Loading #P"/home/martin/miniforge3/envs/sage-dev/lib/ecl-26.5.5/sb-bsd-sockets.fas"
;;; Loading #P"/home/martin/miniforge3/envs/sage-dev/lib/ecl-26.5.5/sockets.fas"
--- stderr ---
Program maxima found: YES (/home/martin/miniforge3/envs/sage-dev/bin/maxima)
Determining dependency 'libbraiding' with pkg-config executable '/home/martin/miniforge3/envs/sage-dev/bin/pkg-config'
env[PKG_CONFIG_PATH]:
env[PKG_CONFIG]: /home/martin/miniforge3/envs/sage-dev/bin/pkg-config
-----------
Called: `/home/martin/miniforge3/envs/sage-dev/bin/pkg-config --modversion libbraiding` -> 0
stdout:
1.3.2
-----------
env[PKG_CONFIG_PATH]:
env[PKG_CONFIG]: /home/martin/miniforge3/envs/sage-dev/bin/pkg-config
-----------
Called: `/home/martin/miniforge3/envs/sage-dev/bin/pkg-config --cflags libbraiding` -> 0
stdout:
-I/home/martin/miniforge3/envs/sage-dev/include
-----------
env[PKG_CONFIG_ALLOW_SYSTEM_LIBS]: 1
env[PKG_CONFIG_PATH]:
env[PKG_CONFIG]: /home/martin/miniforge3/envs/sage-dev/bin/pkg-config
-----------
Called: `/home/martin/miniforge3/envs/sage-dev/bin/pkg-config --libs libbraiding` -> 0
stdout:
-L/home/martin/miniforge3/envs/sage-dev/lib -lbraiding
-----------
env[PKG_CONFIG_PATH]:
env[PKG_CONFIG]: /home/martin/miniforge3/envs/sage-dev/bin/pkg-config
-----------
Called: `/home/martin/miniforge3/envs/sage-dev/bin/pkg-config --libs libbraiding` -> 0
stdout:
-L/home/martin/miniforge3/envs/sage-dev/lib -lbraiding
-----------
Run-time dependency libbraiding found: YES 1.3.2
Determining dependency 'highs' with pkg-config executable '/home/martin/miniforge3/envs/sage-dev/bin/pkg-config'
env[PKG_CONFIG_PATH]:
env[PKG_CONFIG]: /home/martin/miniforge3/envs/sage-dev/bin/pkg-config
-----------
Called: `/home/martin/miniforge3/envs/sage-dev/bin/pkg-config --modversion highs` -> 0
stdout:
1.14.0
-----------
env[PKG_CONFIG_PATH]:
env[PKG_CONFIG]: /home/martin/miniforge3/envs/sage-dev/bin/pkg-config
-----------
Called: `/home/martin/miniforge3/envs/sage-dev/bin/pkg-config --cflags highs` -> 0
stdout:
-I/home/martin/miniforge3/envs/sage-dev/include/highs
-----------
env[PKG_CONFIG_ALLOW_SYSTEM_LIBS]: 1
env[PKG_CONFIG_PATH]:
env[PKG_CONFIG]: /home/martin/miniforge3/envs/sage-dev/bin/pkg-config
-----------
Called: `/home/martin/miniforge3/envs/sage-dev/bin/pkg-config --libs highs` -> 0
stdout:
-L/home/martin/miniforge3/envs/sage-dev/lib -lhighs
-----------
env[PKG_CONFIG_PATH]:
env[PKG_CONFIG]: /home/martin/miniforge3/envs/sage-dev/bin/pkg-config
-----------
Called: `/home/martin/miniforge3/envs/sage-dev/bin/pkg-config --libs highs` -> 0
stdout:
-L/home/martin/miniforge3/envs/sage-dev/lib -lhighs
-----------
Run-time dependency highs found: YES 1.14.0
Running compile:
Working directory: /home/martin/sage-trac/build/cp312/meson-private/tmp2_4tb2h8
Code:
#ifdef __has_include
#if !__has_include("interfaces/highs_c_api.h")
#error "Header 'interfaces/highs_c_api.h' could not be found"
#endif
#else
#include <interfaces/highs_c_api.h>
#endif
-----------
Command line: `/home/martin/miniforge3/envs/sage-dev/bin/x86_64-conda-linux-gnu-cc -I/home/martin/miniforge3/envs/sage-dev/include/highs /home/martin/sage-trac/build/cp312/meson-private/tmp2_4tb2h8/testfile.c -E -P -march=nocona -mtune=haswell -ftree-vectorize -fPIC -fstack-protector-strong -fno-plt -O2 -ffunction-sections -pipe -DNDEBUG -D_FORTIFY_SOURCE=2 -O2 -D_FILE_OFFSET_BITS=64 -P -O0 -U_FORTIFY_SOURCE -std=c17` -> 0
Has header "interfaces/highs_c_api.h" with dependency highs: YES
Determining dependency 'bdw-gc-threaded' with pkg-config executable '/home/martin/miniforge3/envs/sage-dev/bin/pkg-config'
env[PKG_CONFIG_PATH]:
env[PKG_CONFIG]: /home/martin/miniforge3/envs/sage-dev/bin/pkg-config
-----------
Called: `/home/martin/miniforge3/envs/sage-dev/bin/pkg-config --modversion bdw-gc-threaded` -> 1
stderr:
Package bdw-gc-threaded was not found in the pkg-config search path.
Perhaps you should add the directory containing `bdw-gc-threaded.pc'
to the PKG_CONFIG_PATH environment variable
No package 'bdw-gc-threaded' found
-----------
CMake binary for host machine is cached.
Preliminary CMake check failed. Aborting.
Run-time dependency bdw-gc-threaded found: NO (tried pkg-config and cmake)
Determining dependency 'bdw-gc' with pkg-config executable '/home/martin/miniforge3/envs/sage-dev/bin/pkg-config'
env[PKG_CONFIG_PATH]:
env[PKG_CONFIG]: /home/martin/miniforge3/envs/sage-dev/bin/pkg-config
-----------
Called: `/home/martin/miniforge3/envs/sage-dev/bin/pkg-config --modversion bdw-gc` -> 0
stdout:
8.2.12
-----------
env[PKG_CONFIG_PATH]:
env[PKG_CONFIG]: /home/martin/miniforge3/envs/sage-dev/bin/pkg-config
-----------
Called: `/home/martin/miniforge3/envs/sage-dev/bin/pkg-config --cflags bdw-gc` -> 0
stdout:
-I/home/martin/miniforge3/envs/sage-dev/include
-----------
env[PKG_CONFIG_ALLOW_SYSTEM_LIBS]: 1
env[PKG_CONFIG_PATH]:
env[PKG_CONFIG]: /home/martin/miniforge3/envs/sage-dev/bin/pkg-config
-----------
Called: `/home/martin/miniforge3/envs/sage-dev/bin/pkg-config --libs bdw-gc` -> 0
stdout:
-L/home/martin/miniforge3/envs/sage-dev/lib -lgc -lpthread -ldl
-----------
env[PKG_CONFIG_PATH]:
env[PKG_CONFIG]: /home/martin/miniforge3/envs/sage-dev/bin/pkg-config
-----------
Called: `/home/martin/miniforge3/envs/sage-dev/bin/pkg-config --libs bdw-gc` -> 0
stdout:
-L/home/martin/miniforge3/envs/sage-dev/lib -lgc -lpthread -ldl
-----------
Running compile:
Working directory: /home/martin/sage-trac/build/cp312/meson-private/tmp95o0jguq
Code:
int main(void) { return 0; }
-----------
Command line: `/home/martin/miniforge3/envs/sage-dev/bin/x86_64-conda-linux-gnu-c++ -L/home/martin/miniforge3/envs/sage-dev/lib /home/martin/sage-trac/build/cp312/meson-private/tmp95o0jguq/testfile.cpp -o /home/martin/sage-trac/build/cp312/meson-private/tmp95o0jguq/output.exe -fvisibility-inlines-hidden -fmessage-length=0 -march=nocona -mtune=haswell -ftree-vectorize -fPIC -fstack-protector-strong -fno-plt -O2 -ffunction-sections -pipe -DNDEBUG -D_FORTIFY_SOURCE=2 -O2 -D_FILE_OFFSET_BITS=64 -O0 -U_FORTIFY_SOURCE -fpermissive -lpthread -Wl,--allow-shlib-undefined -Wl,-O2 -Wl,--sort-common -Wl,--as-needed -Wl,-z,relro -Wl,-z,now -Wl,--disable-new-dtags -Wl,--gc-sections -Wl,--allow-shlib-undefined -Wl,-rpath,/home/martin/miniforge3/envs/sage-dev/lib -Wl,-rpath-link,/home/martin/miniforge3/envs/sage-dev/lib` -> 0
Run-time dependency bdw-gc found: YES 8.2.12
Determining dependency 'libhomfly' with pkg-config executable '/home/martin/miniforge3/envs/sage-dev/bin/pkg-config'
env[PKG_CONFIG_PATH]:
env[PKG_CONFIG]: /home/martin/miniforge3/envs/sage-dev/bin/pkg-config
-----------
Called: `/home/martin/miniforge3/envs/sage-dev/bin/pkg-config --modversion libhomfly` -> 0
stdout:
1.04
-----------
env[PKG_CONFIG_PATH]:
env[PKG_CONFIG]: /home/martin/miniforge3/envs/sage-dev/bin/pkg-config
-----------
Called: `/home/martin/miniforge3/envs/sage-dev/bin/pkg-config --cflags libhomfly` -> 0
stdout:
-I/home/martin/miniforge3/envs/sage-dev/include
-----------
env[PKG_CONFIG_ALLOW_SYSTEM_LIBS]: 1
env[PKG_CONFIG_PATH]:
env[PKG_CONFIG]: /home/martin/miniforge3/envs/sage-dev/bin/pkg-config
-----------
Called: `/home/martin/miniforge3/envs/sage-dev/bin/pkg-config --libs libhomfly` -> 0
stdout:
-L/home/martin/miniforge3/envs/sage-dev/lib -lhomfly -lgc
-----------
env[PKG_CONFIG_PATH]:
env[PKG_CONFIG]: /home/martin/miniforge3/envs/sage-dev/bin/pkg-config
-----------
Called: `/home/martin/miniforge3/envs/sage-dev/bin/pkg-config --libs libhomfly` -> 0
stdout:
-L/home/martin/miniforge3/envs/sage-dev/lib -lhomfly -lgc
-----------
Run-time dependency libhomfly found: YES 1.04
Running compile:
Working directory: /home/martin/sage-trac/build/cp312/meson-private/tmpc_jc0sf_
Code:
int main(void) { return 0; }
-----------
Command line: `/home/martin/miniforge3/envs/sage-dev/bin/x86_64-conda-linux-gnu-cc -L/home/martin/miniforge3/envs/sage-dev/lib /home/martin/sage-trac/build/cp312/meson-private/tmpc_jc0sf_/testfile.c -o /home/martin/sage-trac/build/cp312/meson-private/tmpc_jc0sf_/output.exe -march=nocona -mtune=haswell -ftree-vectorize -fPIC -fstack-protector-strong -fno-plt -O2 -ffunction-sections -pipe -DNDEBUG -D_FORTIFY_SOURCE=2 -O2 -D_FILE_OFFSET_BITS=64 -O0 -U_FORTIFY_SOURCE -lcoxeter3 -Wl,--allow-shlib-undefined -Wl,-O2 -Wl,--sort-common -Wl,--as-needed -Wl,-z,relro -Wl,-z,now -Wl,--disable-new-dtags -Wl,--gc-sections -Wl,--allow-shlib-undefined -Wl,-rpath,/home/martin/miniforge3/envs/sage-dev/lib -Wl,-rpath-link,/home/martin/miniforge3/envs/sage-dev/lib` -> 1
stderr:
/home/martin/miniforge3/envs/sage-dev/bin/../libexec/gcc/x86_64-conda-linux-gnu/14.3.0/ld: cannot find -lcoxeter3: No such file or directory
collect2: error: ld returned 1 exit status
-----------
Running compile:
Working directory: /home/martin/sage-trac/build/cp312/meson-private/tmpt318o0gm
Code:
#include<stddef.h>
#include<stdio.h>
int main(void) {
printf("%ld\n", (long)(sizeof(void *)));
return 0;
}
-----------
Command line: `/home/martin/miniforge3/envs/sage-dev/bin/x86_64-conda-linux-gnu-cc -L/home/martin/miniforge3/envs/sage-dev/lib /home/martin/sage-trac/build/cp312/meson-private/tmpt318o0gm/testfile.c -o /home/martin/sage-trac/build/cp312/meson-private/tmpt318o0gm/output.exe -march=nocona -mtune=haswell -ftree-vectorize -fPIC -fstack-protector-strong -fno-plt -O2 -ffunction-sections -pipe -DNDEBUG -D_FORTIFY_SOURCE=2 -O2 -D_FILE_OFFSET_BITS=64 -O0 -U_FORTIFY_SOURCE -Wl,-O2 -Wl,--sort-common -Wl,--as-needed -Wl,-z,relro -Wl,-z,now -Wl,--disable-new-dtags -Wl,--gc-sections -Wl,--allow-shlib-undefined -Wl,-rpath,/home/martin/miniforge3/envs/sage-dev/lib -Wl,-rpath-link,/home/martin/miniforge3/envs/sage-dev/lib` -> 0
Program stdout:
8
Program stderr:
Running compile:
Working directory: /home/martin/sage-trac/build/cp312/meson-private/tmp1h76xfsp
Code:
-----------
Command line: `/home/martin/miniforge3/envs/sage-dev/bin/x86_64-conda-linux-gnu-cc /home/martin/sage-trac/build/cp312/meson-private/tmp1h76xfsp/testfile.c -o /home/martin/sage-trac/build/cp312/meson-private/tmp1h76xfsp/output.obj -c -march=nocona -mtune=haswell -ftree-vectorize -fPIC -fstack-protector-strong -fno-plt -O2 -ffunction-sections -pipe -DNDEBUG -D_FORTIFY_SOURCE=2 -O2 -D_FILE_OFFSET_BITS=64 -O0 -U_FORTIFY_SOURCE --print-search-dirs` -> 0
stdout:
install: /home/martin/miniforge3/envs/sage-dev/bin/../lib/gcc/x86_64-conda-linux-gnu/14.3.0/
programs: =/home/martin/miniforge3/envs/sage-dev/bin/../libexec/gcc/x86_64-conda-linux-gnu/14.3.0/:/home/martin/miniforge3/envs/sage-dev/bin/../libexec/gcc/:/home/martin/miniforge3/envs/sage-dev/bin/../lib/gcc/x86_64-conda-linux-gnu/14.3.0/../../../../x86_64-conda-linux-gnu/bin/x86_64-conda-linux-gnu/14.3.0/:/home/martin/miniforge3/envs/sage-dev/bin/../lib/gcc/x86_64-conda-linux-gnu/14.3.0/../../../../x86_64-conda-linux-gnu/bin/
libraries: =/home/martin/miniforge3/envs/sage-dev/bin/../lib/gcc/x86_64-conda-linux-gnu/14.3.0/:/home/martin/miniforge3/envs/sage-dev/bin/../lib/gcc/:/home/martin/miniforge3/envs/sage-dev/bin/../lib/gcc/x86_64-conda-linux-gnu/14.3.0/../../../../x86_64-conda-linux-gnu/lib/x86_64-conda-linux-gnu/14.3.0/:/home/martin/miniforge3/envs/sage-dev/bin/../lib/gcc/x86_64-conda-linux-gnu/14.3.0/../../../../x86_64-conda-linux-gnu/lib/../lib/:/home/martin/miniforge3/envs/sage-dev/bin/../lib/gcc/x86_64-conda-linux-gnu/14.3.0/../../../x86_64-conda-linux-gnu/14.3.0/:/home/martin/miniforge3/envs/sage-dev/bin/../lib/gcc/x86_64-conda-linux-gnu/14.3.0/../../../../lib/:/home/martin/miniforge3/envs/sage-dev/bin/../x86_64-conda-linux-gnu/sysroot/lib/x86_64-conda-linux-gnu/14.3.0/:/home/martin/miniforge3/envs/sage-dev/bin/../x86_64-conda-linux-gnu/sysroot/lib/../lib/:/home/martin/miniforge3/envs/sage-dev/bin/../x86_64-conda-linux-gnu/sysroot/usr/lib/x86_64-conda-linux-gnu/14.3.0/:/home/martin/miniforge3/envs/sage-dev/bin/../x86_64-conda-linux-gnu/sysroot/usr/lib/../lib/:/home/martin/miniforge3/envs/sage-dev/bin/../lib/gcc/x86_64-conda-linux-gnu/14.3.0/../../../../x86_64-conda-linux-gnu/lib/:/home/martin/miniforge3/envs/sage-dev/bin/../lib/gcc/x86_64-conda-linux-gnu/14.3.0/../../../:/home/martin/miniforge3/envs/sage-dev/bin/../x86_64-conda-linux-gnu/sysroot/lib/:/home/martin/miniforge3/envs/sage-dev/bin/../x86_64-conda-linux-gnu/sysroot/usr/lib/
-----------
Library coxeter3 found: NO
Determining dependency 'lcalc' with pkg-config executable '/home/martin/miniforge3/envs/sage-dev/bin/pkg-config'
env[PKG_CONFIG_PATH]:
env[PKG_CONFIG]: /home/martin/miniforge3/envs/sage-dev/bin/pkg-config
-----------
Called: `/home/martin/miniforge3/envs/sage-dev/bin/pkg-config --modversion lcalc` -> 0
stdout:
2.1.1
-----------
env[PKG_CONFIG_PATH]:
env[PKG_CONFIG]: /home/martin/miniforge3/envs/sage-dev/bin/pkg-config
-----------
Called: `/home/martin/miniforge3/envs/sage-dev/bin/pkg-config --cflags lcalc` -> 0
stdout:
-I/home/martin/miniforge3/envs/sage-dev/include
-----------
env[PKG_CONFIG_ALLOW_SYSTEM_LIBS]: 1
env[PKG_CONFIG_PATH]:
env[PKG_CONFIG]: /home/martin/miniforge3/envs/sage-dev/bin/pkg-config
-----------
Called: `/home/martin/miniforge3/envs/sage-dev/bin/pkg-config --libs lcalc` -> 0
stdout:
-L/home/martin/miniforge3/envs/sage-dev/lib -lLfunction
-----------
env[PKG_CONFIG_PATH]:
env[PKG_CONFIG]: /home/martin/miniforge3/envs/sage-dev/bin/pkg-config
-----------
Called: `/home/martin/miniforge3/envs/sage-dev/bin/pkg-config --libs lcalc` -> 0
stdout:
-L/home/martin/miniforge3/envs/sage-dev/lib -lLfunction
-----------
Run-time dependency lcalc found: YES 2.1.1
Determining dependency 'symmetrica' with pkg-config executable '/home/martin/miniforge3/envs/sage-dev/bin/pkg-config'
env[PKG_CONFIG_PATH]:
env[PKG_CONFIG]: /home/martin/miniforge3/envs/sage-dev/bin/pkg-config
-----------
Called: `/home/martin/miniforge3/envs/sage-dev/bin/pkg-config --modversion symmetrica` -> 0
stdout:
3.1.0
-----------
env[PKG_CONFIG_PATH]:
env[PKG_CONFIG]: /home/martin/miniforge3/envs/sage-dev/bin/pkg-config
-----------
Called: `/home/martin/miniforge3/envs/sage-dev/bin/pkg-config --cflags symmetrica` -> 0
stdout:
-I/home/martin/miniforge3/envs/sage-dev/include
-----------
env[PKG_CONFIG_ALLOW_SYSTEM_LIBS]: 1
env[PKG_CONFIG_PATH]:
env[PKG_CONFIG]: /home/martin/miniforge3/envs/sage-dev/bin/pkg-config
-----------
Called: `/home/martin/miniforge3/envs/sage-dev/bin/pkg-config --libs symmetrica` -> 0
stdout:
-L/home/martin/miniforge3/envs/sage-dev/lib -lsymmetrica
-----------
env[PKG_CONFIG_PATH]:
env[PKG_CONFIG]: /home/martin/miniforge3/envs/sage-dev/bin/pkg-config
-----------
Called: `/home/martin/miniforge3/envs/sage-dev/bin/pkg-config --libs symmetrica` -> 0
stdout:
-L/home/martin/miniforge3/envs/sage-dev/lib -lsymmetrica
-----------
Run-time dependency symmetrica found: YES 3.1.0
Running compile:
Working directory: /home/martin/sage-trac/build/cp312/meson-private/tmp5psnt6zc
Code:
int main(void) { return 0; }
-----------
Command line: `/home/martin/miniforge3/envs/sage-dev/bin/x86_64-conda-linux-gnu-cc -L/home/martin/miniforge3/envs/sage-dev/lib /home/martin/sage-trac/build/cp312/meson-private/tmp5psnt6zc/testfile.c -o /home/martin/sage-trac/build/cp312/meson-private/tmp5psnt6zc/output.exe -march=nocona -mtune=haswell -ftree-vectorize -fPIC -fstack-protector-strong -fno-plt -O2 -ffunction-sections -pipe -DNDEBUG -D_FORTIFY_SOURCE=2 -O2 -D_FILE_OFFSET_BITS=64 -O0 -U_FORTIFY_SOURCE -lbliss -Wl,--allow-shlib-undefined -Wl,-O2 -Wl,--sort-common -Wl,--as-needed -Wl,-z,relro -Wl,-z,now -Wl,--disable-new-dtags -Wl,--gc-sections -Wl,--allow-shlib-undefined -Wl,-rpath,/home/martin/miniforge3/envs/sage-dev/lib -Wl,-rpath-link,/home/martin/miniforge3/envs/sage-dev/lib` -> 0
Library bliss found: YES
CMake binary for host machine is cached.
Preliminary CMake check failed. Aborting.
Run-time dependency mcqd found: NO (tried cmake)
Running compile:
Working directory: /home/martin/sage-trac/build/cp312/meson-private/tmpn_gtbmoy
Code:
#ifdef __has_include
#if !__has_include("mcqd.h")
#error "Header 'mcqd.h' could not be found"
#endif
#else
#include <mcqd.h>
#endif
-----------
Command line: `/home/martin/miniforge3/envs/sage-dev/bin/x86_64-conda-linux-gnu-cc /home/martin/sage-trac/build/cp312/meson-private/tmpn_gtbmoy/testfile.c -E -P -march=nocona -mtune=haswell -ftree-vectorize -fPIC -fstack-protector-strong -fno-plt -O2 -ffunction-sections -pipe -DNDEBUG -D_FORTIFY_SOURCE=2 -O2 -D_FILE_OFFSET_BITS=64 -P -O0 -U_FORTIFY_SOURCE -std=c17` -> 1
stderr:
/home/martin/sage-trac/build/cp312/meson-private/tmpn_gtbmoy/testfile.c:4:12: error: #error "Header 'mcqd.h' could not be found"
4 | #error "Header 'mcqd.h' could not be found"
| ^~~~~
-----------
Has header "mcqd.h" : NO
Determining dependency 'libcliquer' with pkg-config executable '/home/martin/miniforge3/envs/sage-dev/bin/pkg-config'
env[PKG_CONFIG_PATH]:
env[PKG_CONFIG]: /home/martin/miniforge3/envs/sage-dev/bin/pkg-config
-----------
Called: `/home/martin/miniforge3/envs/sage-dev/bin/pkg-config --modversion libcliquer` -> 0
stdout:
1.23
-----------
env[PKG_CONFIG_PATH]:
env[PKG_CONFIG]: /home/martin/miniforge3/envs/sage-dev/bin/pkg-config
-----------
Called: `/home/martin/miniforge3/envs/sage-dev/bin/pkg-config --cflags libcliquer` -> 0
stdout:
-I/home/martin/miniforge3/envs/sage-dev/include
-----------
env[PKG_CONFIG_ALLOW_SYSTEM_LIBS]: 1
env[PKG_CONFIG_PATH]:
env[PKG_CONFIG]: /home/martin/miniforge3/envs/sage-dev/bin/pkg-config
-----------
Called: `/home/martin/miniforge3/envs/sage-dev/bin/pkg-config --libs libcliquer` -> 0
stdout:
-L/home/martin/miniforge3/envs/sage-dev/lib -lcliquer
-----------
env[PKG_CONFIG_PATH]:
env[PKG_CONFIG]: /home/martin/miniforge3/envs/sage-dev/bin/pkg-config
-----------
Called: `/home/martin/miniforge3/envs/sage-dev/bin/pkg-config --libs libcliquer` -> 0
stdout:
-L/home/martin/miniforge3/envs/sage-dev/lib -lcliquer
-----------
Run-time dependency libcliquer found: YES 1.23
Determining dependency 'libplanarity' with pkg-config executable '/home/martin/miniforge3/envs/sage-dev/bin/pkg-config'
env[PKG_CONFIG_PATH]:
env[PKG_CONFIG]: /home/martin/miniforge3/envs/sage-dev/bin/pkg-config
-----------
Called: `/home/martin/miniforge3/envs/sage-dev/bin/pkg-config --modversion libplanarity` -> 0
stdout:
4.0.1.0
-----------
env[PKG_CONFIG_PATH]:
env[PKG_CONFIG]: /home/martin/miniforge3/envs/sage-dev/bin/pkg-config
-----------
Called: `/home/martin/miniforge3/envs/sage-dev/bin/pkg-config --cflags libplanarity` -> 0
stdout:
-I/home/martin/miniforge3/envs/sage-dev/include
-----------
env[PKG_CONFIG_ALLOW_SYSTEM_LIBS]: 1
env[PKG_CONFIG_PATH]:
env[PKG_CONFIG]: /home/martin/miniforge3/envs/sage-dev/bin/pkg-config
-----------
Called: `/home/martin/miniforge3/envs/sage-dev/bin/pkg-config --libs libplanarity` -> 0
stdout:
-L/home/martin/miniforge3/envs/sage-dev/lib -lplanarity
-----------
env[PKG_CONFIG_PATH]:
env[PKG_CONFIG]: /home/martin/miniforge3/envs/sage-dev/bin/pkg-config
-----------
Called: `/home/martin/miniforge3/envs/sage-dev/bin/pkg-config --libs libplanarity` -> 0
stdout:
-L/home/martin/miniforge3/envs/sage-dev/lib -lplanarity
-----------
Run-time dependency libplanarity found: YES 4.0.1.0
Running compile:
Working directory: /home/martin/sage-trac/build/cp312/meson-private/tmphvkmmap7
Code:
#ifdef __has_include
#if !__has_include("planarity/graphLib.h")
#error "Header 'planarity/graphLib.h' could not be found"
#endif
#else
#include <planarity/graphLib.h>
#endif
-----------
Command line: `/home/martin/miniforge3/envs/sage-dev/bin/x86_64-conda-linux-gnu-cc -I/home/martin/miniforge3/envs/sage-dev/include /home/martin/sage-trac/build/cp312/meson-private/tmphvkmmap7/testfile.c -E -P -march=nocona -mtune=haswell -ftree-vectorize -fPIC -fstack-protector-strong -fno-plt -O2 -ffunction-sections -pipe -DNDEBUG -D_FORTIFY_SOURCE=2 -O2 -D_FILE_OFFSET_BITS=64 -P -O0 -U_FORTIFY_SOURCE -std=c17` -> 0
Has header "planarity/graphLib.h" with dependency libplanarity: YES
Running compile:
Working directory: /home/martin/sage-trac/build/cp312/meson-private/tmporwj_c8d
Code:
#ifdef __has_include
#if !__has_include("treedec/combinations.hpp")
#error "Header 'treedec/combinations.hpp' could not be found"
#endif
#else
#include <treedec/combinations.hpp>
#endif
-----------
Command line: `/home/martin/miniforge3/envs/sage-dev/bin/x86_64-conda-linux-gnu-cc /home/martin/sage-trac/build/cp312/meson-private/tmporwj_c8d/testfile.c -E -P -march=nocona -mtune=haswell -ftree-vectorize -fPIC -fstack-protector-strong -fno-plt -O2 -ffunction-sections -pipe -DNDEBUG -D_FORTIFY_SOURCE=2 -O2 -D_FILE_OFFSET_BITS=64 -P -O0 -U_FORTIFY_SOURCE -std=c17` -> 1
stderr:
/home/martin/sage-trac/build/cp312/meson-private/tmporwj_c8d/testfile.c:4:12: error: #error "Header 'treedec/combinations.hpp' could not be found"
4 | #error "Header 'treedec/combinations.hpp' could not be found"
| ^~~~~
-----------
Has header "treedec/combinations.hpp" : NO
Running compile:
Working directory: /home/martin/sage-trac/build/cp312/meson-private/tmpe_8u2fpb
Code:
int main(void) { return 0; }
-----------
Command line: `/home/martin/miniforge3/envs/sage-dev/bin/x86_64-conda-linux-gnu-cc -L/home/martin/miniforge3/envs/sage-dev/lib /home/martin/sage-trac/build/cp312/meson-private/tmpe_8u2fpb/testfile.c -o /home/martin/sage-trac/build/cp312/meson-private/tmpe_8u2fpb/output.exe -march=nocona -mtune=haswell -ftree-vectorize -fPIC -fstack-protector-strong -fno-plt -O2 -ffunction-sections -pipe -DNDEBUG -D_FORTIFY_SOURCE=2 -O2 -D_FILE_OFFSET_BITS=64 -O0 -U_FORTIFY_SOURCE -lrw -Wl,--allow-shlib-undefined -Wl,-O2 -Wl,--sort-common -Wl,--as-needed -Wl,-z,relro -Wl,-z,now -Wl,--disable-new-dtags -Wl,--gc-sections -Wl,--allow-shlib-undefined -Wl,-rpath,/home/martin/miniforge3/envs/sage-dev/lib -Wl,-rpath-link,/home/martin/miniforge3/envs/sage-dev/lib` -> 0
Library rw found: YES
Running compile:
Working directory: /home/martin/sage-trac/build/cp312/meson-private/tmpjxrng04y
Code:
int main(void) { return 0; }
-----------
Command line: `/home/martin/miniforge3/envs/sage-dev/bin/x86_64-conda-linux-gnu-cc -L/home/martin/miniforge3/envs/sage-dev/lib /home/martin/sage-trac/build/cp312/meson-private/tmpjxrng04y/testfile.c -o /home/martin/sage-trac/build/cp312/meson-private/tmpjxrng04y/output.exe -march=nocona -mtune=haswell -ftree-vectorize -fPIC -fstack-protector-strong -fno-plt -O2 -ffunction-sections -pipe -DNDEBUG -D_FORTIFY_SOURCE=2 -O2 -D_FILE_OFFSET_BITS=64 -O0 -U_FORTIFY_SOURCE -liml -Wl,--allow-shlib-undefined -Wl,-O2 -Wl,--sort-common -Wl,--as-needed -Wl,-z,relro -Wl,-z,now -Wl,--disable-new-dtags -Wl,--gc-sections -Wl,--allow-shlib-undefined -Wl,-rpath,/home/martin/miniforge3/envs/sage-dev/lib -Wl,-rpath-link,/home/martin/miniforge3/envs/sage-dev/lib` -> 0
Library iml found: YES
Running compile:
Working directory: /home/martin/sage-trac/build/cp312/meson-private/tmpk0hjecx1
Code:
int main(void) { return 0; }
-----------
Command line: `/home/martin/miniforge3/envs/sage-dev/bin/x86_64-conda-linux-gnu-cc -L/home/martin/miniforge3/envs/sage-dev/lib /home/martin/sage-trac/build/cp312/meson-private/tmpk0hjecx1/testfile.c -o /home/martin/sage-trac/build/cp312/meson-private/tmpk0hjecx1/output.exe -march=nocona -mtune=haswell -ftree-vectorize -fPIC -fstack-protector-strong -fno-plt -O2 -ffunction-sections -pipe -DNDEBUG -D_FORTIFY_SOURCE=2 -O2 -D_FILE_OFFSET_BITS=64 -O0 -U_FORTIFY_SOURCE -lglpk -Wl,--allow-shlib-undefined -Wl,-O2 -Wl,--sort-common -Wl,--as-needed -Wl,-z,relro -Wl,-z,now -Wl,--disable-new-dtags -Wl,--gc-sections -Wl,--allow-shlib-undefined -Wl,-rpath,/home/martin/miniforge3/envs/sage-dev/lib -Wl,-rpath-link,/home/martin/miniforge3/envs/sage-dev/lib` -> 0
Library glpk found: YES
Determining dependency 'brial' with pkg-config executable '/home/martin/miniforge3/envs/sage-dev/bin/pkg-config'
env[PKG_CONFIG_PATH]:
env[PKG_CONFIG]: /home/martin/miniforge3/envs/sage-dev/bin/pkg-config
-----------
Called: `/home/martin/miniforge3/envs/sage-dev/bin/pkg-config --modversion brial` -> 0
stdout:
1.2.15
-----------
env[PKG_CONFIG_PATH]:
env[PKG_CONFIG]: /home/martin/miniforge3/envs/sage-dev/bin/pkg-config
-----------
Called: `/home/martin/miniforge3/envs/sage-dev/bin/pkg-config --cflags brial` -> 0
stdout:
-I/home/martin/miniforge3/envs/sage-dev/include
-----------
env[PKG_CONFIG_ALLOW_SYSTEM_LIBS]: 1
env[PKG_CONFIG_PATH]:
env[PKG_CONFIG]: /home/martin/miniforge3/envs/sage-dev/bin/pkg-config
-----------
Called: `/home/martin/miniforge3/envs/sage-dev/bin/pkg-config --libs brial` -> 0
stdout:
-L/home/martin/miniforge3/envs/sage-dev/lib -lbrial_groebner -lbrial -lpng16 -lm4ri -lm
-----------
env[PKG_CONFIG_PATH]:
env[PKG_CONFIG]: /home/martin/miniforge3/envs/sage-dev/bin/pkg-config
-----------
Called: `/home/martin/miniforge3/envs/sage-dev/bin/pkg-config --libs brial` -> 0
stdout:
-L/home/martin/miniforge3/envs/sage-dev/lib -lbrial_groebner -lbrial -lpng16 -lm4ri -lm
-----------
Run-time dependency brial found: YES 1.2.15
Running compile:
Working directory: /home/martin/sage-trac/build/cp312/meson-private/tmpavw5tuhz
Code:
int main(void) { return 0; }
-----------
Command line: `/home/martin/miniforge3/envs/sage-dev/bin/x86_64-conda-linux-gnu-cc -L/home/martin/miniforge3/envs/sage-dev/lib /home/martin/sage-trac/build/cp312/meson-private/tmpavw5tuhz/testfile.c -o /home/martin/sage-trac/build/cp312/meson-private/tmpavw5tuhz/output.exe -march=nocona -mtune=haswell -ftree-vectorize -fPIC -fstack-protector-strong -fno-plt -O2 -ffunction-sections -pipe -DNDEBUG -D_FORTIFY_SOURCE=2 -O2 -D_FILE_OFFSET_BITS=64 -O0 -U_FORTIFY_SOURCE -lbrial_groebner -Wl,--allow-shlib-undefined -Wl,-O2 -Wl,--sort-common -Wl,--as-needed -Wl,-z,relro -Wl,-z,now -Wl,--disable-new-dtags -Wl,--gc-sections -Wl,--allow-shlib-undefined -Wl,-rpath,/home/martin/miniforge3/envs/sage-dev/lib -Wl,-rpath-link,/home/martin/miniforge3/envs/sage-dev/lib` -> 0
Library brial_groebner found: YES
Configuring kernel.json using configuration
Configuring config.py using configuration
Build targets in project: 574
SageMath 10.10.beta10
User defined options
Native files : /home/martin/sage-trac/build/cp312/meson-python-native-file.ini
b_ndebug : if-release
b_vscrt : md
build-docs : False
buildtype : release
default_library: static
Failed to guess install tag for /usr/local/share/share/jupyter/kernels/sagemath/logo.svg
Failed to guess install tag for /usr/local/share/share/jupyter/kernels/sagemath/logo-64x64.png
Failed to guess install tag for /usr/local/share/share/jupyter/kernels/sagemath/kernel.json
Failed to guess install tag for /home/martin/miniforge3/envs/sage-dev/lib/python3.12/site-packages/sage/config.py
Failed to guess install tag for /home/martin/miniforge3/envs/sage-dev/lib/python3.12/site-packages/sage/dummy
Failed to guess install tag for /home/martin/miniforge3/envs/sage-dev/lib/python3.12/site-packages/sage/dummy
Failed to guess install tag for /home/martin/miniforge3/envs/sage-dev/lib/python3.12/site-packages/sage/dummy
Failed to guess install tag for /home/martin/miniforge3/envs/sage-dev/lib/python3.12/site-packages/sage/dummy
Failed to guess install tag for /home/martin/miniforge3/envs/sage-dev/lib/python3.12/site-packages/sage/dummy
Failed to guess install tag for /home/martin/miniforge3/envs/sage-dev/lib/python3.12/site-packages/sage/dummy
Failed to guess install tag for /home/martin/miniforge3/envs/sage-dev/lib/python3.12/site-packages/sage/dummy
Failed to guess install tag for /home/martin/miniforge3/envs/sage-dev/lib/python3.12/site-packages/sage/dummy
Failed to guess install tag for /home/martin/miniforge3/envs/sage-dev/lib/python3.12/site-packages/sage/dummy
Failed to guess install tag for /home/martin/miniforge3/envs/sage-dev/lib/python3.12/site-packages/sage/dummy
Failed to guess install tag for /home/martin/miniforge3/envs/sage-dev/lib/python3.12/site-packages/sage/dummy
Failed to guess install tag for /home/martin/miniforge3/envs/sage-dev/lib/python3.12/site-packages/sage/dummy
Failed to guess install tag for /home/martin/miniforge3/envs/sage-dev/lib/python3.12/site-packages/sage/dummy
Failed to guess install tag for /home/martin/miniforge3/envs/sage-dev/lib/python3.12/site-packages/sage/dummy
Failed to guess install tag for /home/martin/miniforge3/envs/sage-dev/lib/python3.12/site-packages/sage/dummy
Failed to guess install tag for /home/martin/miniforge3/envs/sage-dev/lib/python3.12/site-packages/sage/dummy
Failed to guess install tag for /home/martin/miniforge3/envs/sage-dev/lib/python3.12/site-packages/sage/libs/dummy
Failed to guess install tag for /home/martin/miniforge3/envs/sage-dev/lib/python3.12/site-packages/sage/libs/dummy
Failed to guess install tag for /home/martin/miniforge3/envs/sage-dev/lib/python3.12/site-packages/sage/libs/dummy
Failed to guess install tag for /home/martin/miniforge3/envs/sage-dev/lib/python3.12/site-packages/sage/libs/dummy
Failed to guess install tag for /home/martin/miniforge3/envs/sage-dev/lib/python3.12/site-packages/sage/libs/dummy
Failed to guess install tag for /home/martin/miniforge3/envs/sage-dev/lib/python3.12/site-packages/sage/libs/dummy
Failed to guess install tag for /home/martin/miniforge3/envs/sage-dev/lib/python3.12/site-packages/sage/libs/dummy
Failed to guess install tag for /home/martin/miniforge3/envs/sage-dev/lib/python3.12/site-packages/sage/libs/dummy
Failed to guess install tag for /home/martin/miniforge3/envs/sage-dev/lib/python3.12/site-packages/sage/libs/dummy
Failed to guess install tag for /home/martin/miniforge3/envs/sage-dev/lib/python3.12/site-packages/sage/structure/dummy
Failed to guess install tag for /home/martin/miniforge3/envs/sage-dev/lib/python3.12/site-packages/sage/algebras/dummy
Failed to guess install tag for /home/martin/miniforge3/envs/sage-dev/lib/python3.12/site-packages/sage/algebras/dummy
Failed to guess install tag for /home/martin/miniforge3/envs/sage-dev/lib/python3.12/site-packages/sage/algebras/dummy
Failed to guess install tag for /home/martin/miniforge3/envs/sage-dev/lib/python3.12/site-packages/sage/algebras/dummy
Failed to guess install tag for /home/martin/miniforge3/envs/sage-dev/lib/python3.12/site-packages/sage/coding/dummy
Failed to guess install tag for /home/martin/miniforge3/envs/sage-dev/lib/python3.12/site-packages/sage/coding/dummy
Failed to guess install tag for /home/martin/miniforge3/envs/sage-dev/lib/python3.12/site-packages/sage/combinat/dummy
Failed to guess install tag for /home/martin/miniforge3/envs/sage-dev/lib/python3.12/site-packages/sage/combinat/dummy
Failed to guess install tag for /home/martin/miniforge3/envs/sage-dev/lib/python3.12/site-packages/sage/combinat/dummy
Failed to guess install tag for /home/martin/miniforge3/envs/sage-dev/lib/python3.12/site-packages/sage/combinat/dummy
Failed to guess install tag for /home/martin/miniforge3/envs/sage-dev/lib/python3.12/site-packages/sage/combinat/dummy
Failed to guess install tag for /home/martin/miniforge3/envs/sage-dev/lib/python3.12/site-packages/sage/combinat/dummy
Failed to guess install tag for /home/martin/miniforge3/envs/sage-dev/lib/python3.12/site-packages/sage/combinat/dummy
Failed to guess install tag for /home/martin/miniforge3/envs/sage-dev/lib/python3.12/site-packages/sage/crypto/dummy
Failed to guess install tag for /home/martin/miniforge3/envs/sage-dev/lib/python3.12/site-packages/sage/crypto/dummy
Failed to guess install tag for /home/martin/miniforge3/envs/sage-dev/lib/python3.12/site-packages/sage/crypto/dummy
Failed to guess install tag for /home/martin/miniforge3/envs/sage-dev/lib/python3.12/site-packages/sage/geometry/dummy
Failed to guess install tag for /home/martin/miniforge3/envs/sage-dev/lib/python3.12/site-packages/sage/geometry/dummy
Failed to guess install tag for /home/martin/miniforge3/envs/sage-dev/lib/python3.12/site-packages/sage/geometry/polyhedron/dummy
Failed to guess install tag for /home/martin/miniforge3/envs/sage-dev/lib/python3.12/site-packages/sage/geometry/dummy
Failed to guess install tag for /home/martin/miniforge3/envs/sage-dev/lib/python3.12/site-packages/sage/groups/dummy
Failed to guess install tag for /home/martin/miniforge3/envs/sage-dev/lib/python3.12/site-packages/sage/groups/dummy
Failed to guess install tag for /home/martin/miniforge3/envs/sage-dev/lib/python3.12/site-packages/sage/groups/dummy
Failed to guess install tag for /home/martin/miniforge3/envs/sage-dev/lib/python3.12/site-packages/sage/groups/dummy
Failed to guess install tag for /home/martin/miniforge3/envs/sage-dev/lib/python3.12/site-packages/sage/groups/dummy
Failed to guess install tag for /home/martin/miniforge3/envs/sage-dev/lib/python3.12/site-packages/sage/modular/dummy
Failed to guess install tag for /home/martin/miniforge3/envs/sage-dev/lib/python3.12/site-packages/sage/modular/dummy
Failed to guess install tag for /home/martin/miniforge3/envs/sage-dev/lib/python3.12/site-packages/sage/modular/dummy
Failed to guess install tag for /home/martin/miniforge3/envs/sage-dev/lib/python3.12/site-packages/sage/modular/dummy
Failed to guess install tag for /home/martin/miniforge3/envs/sage-dev/lib/python3.12/site-packages/sage/modular/dummy
Failed to guess install tag for /home/martin/miniforge3/envs/sage-dev/lib/python3.12/site-packages/sage/modular/dummy
Failed to guess install tag for /home/martin/miniforge3/envs/sage-dev/lib/python3.12/site-packages/sage/modular/dummy
Failed to guess install tag for /home/martin/miniforge3/envs/sage-dev/lib/python3.12/site-packages/sage/modular/dummy
Failed to guess install tag for /home/martin/miniforge3/envs/sage-dev/lib/python3.12/site-packages/sage/modular/dummy
Failed to guess install tag for /home/martin/miniforge3/envs/sage-dev/lib/python3.12/site-packages/sage/modular/dummy
Failed to guess install tag for /home/martin/miniforge3/envs/sage-dev/lib/python3.12/site-packages/sage/modules/dummy
Failed to guess install tag for /home/martin/miniforge3/envs/sage-dev/lib/python3.12/site-packages/sage/modules/dummy
Failed to guess install tag for /home/martin/miniforge3/envs/sage-dev/lib/python3.12/site-packages/sage/quadratic_forms/dummy
Failed to guess install tag for /home/martin/miniforge3/envs/sage-dev/lib/python3.12/site-packages/sage/rings/dummy
Failed to guess install tag for /home/martin/miniforge3/envs/sage-dev/lib/python3.12/site-packages/sage/rings/function_field/dummy
Failed to guess install tag for /home/martin/miniforge3/envs/sage-dev/lib/python3.12/site-packages/sage/rings/dummy
Failed to guess install tag for /home/martin/miniforge3/envs/sage-dev/lib/python3.12/site-packages/sage/rings/polynomial/dummy
Failed to guess install tag for /home/martin/miniforge3/envs/sage-dev/lib/python3.12/site-packages/sage/rings/dummy
Failed to guess install tag for /home/martin/miniforge3/envs/sage-dev/lib/python3.12/site-packages/sage/schemes/dummy
Failed to guess install tag for /home/martin/miniforge3/envs/sage-dev/lib/python3.12/site-packages/sage/schemes/dummy
Failed to guess install tag for /home/martin/miniforge3/envs/sage-dev/lib/python3.12/site-packages/sage/schemes/dummy
Failed to guess install tag for /home/martin/miniforge3/envs/sage-dev/lib/python3.12/site-packages/sage/schemes/dummy
Failed to guess install tag for /home/martin/miniforge3/envs/sage-dev/lib/python3.12/site-packages/sage/schemes/dummy
Failed to guess install tag for /home/martin/miniforge3/envs/sage-dev/lib/python3.12/site-packages/sage/schemes/dummy
Failed to guess install tag for /home/martin/miniforge3/envs/sage-dev/lib/python3.12/site-packages/sage/schemes/dummy
Failed to guess install tag for /home/martin/miniforge3/envs/sage-dev/lib/python3.12/site-packages/sage/schemes/dummy
Failed to guess install tag for /home/martin/miniforge3/envs/sage-dev/lib/python3.12/site-packages/sage/schemes/dummy
Failed to guess install tag for /home/martin/miniforge3/envs/sage-dev/lib/python3.12/site-packages/sage/schemes/dummy
Failed to guess install tag for /home/martin/miniforge3/envs/sage-dev/lib/python3.12/site-packages/sage/schemes/dummy
Failed to guess install tag for /home/martin/miniforge3/envs/sage-dev/lib/python3.12/site-packages/sage/schemes/dummy
Failed to guess install tag for /home/martin/miniforge3/envs/sage-dev/lib/python3.12/site-packages/sage/schemes/toric/dummy
Failed to guess install tag for /home/martin/miniforge3/envs/sage-dev/lib/python3.12/site-packages/sage/symbolic/dummy
Failed to guess install tag for /home/martin/miniforge3/envs/sage-dev/lib/python3.12/site-packages/sage/tests/dummy
Failed to guess install tag for /home/martin/miniforge3/envs/sage-dev/lib/python3.12/site-packages/sage/tests/dummy
Failed to guess install tag for /home/martin/miniforge3/envs/sage-dev/lib/python3.12/site-packages/sage/dynamics/dummy
Failed to guess install tag for /home/martin/miniforge3/envs/sage-dev/lib/python3.12/site-packages/sage/sat/dummy
Found ninja-1.13.2 at /home/martin/miniforge3/envs/sage-dev/bin/ninja
Running compile:
Working directory: /home/martin/tmp/tmp7ye2hnm5
Code:
int i = static_cast<int>(0);
-----------
Command line: `/home/martin/miniforge3/envs/sage-dev/bin/x86_64-conda-linux-gnu-c++ /home/martin/tmp/tmp7ye2hnm5/testfile.cpp -o /home/martin/tmp/tmp7ye2hnm5/output.obj -D_FILE_OFFSET_BITS=64 -c -std=c++17` -> 0
Compiler accepts -std=c++17: YES
Running compile:
Working directory: /home/martin/tmp/tmpo2ut1o4y
Code:
int i = static_cast<int>(0);
-----------
Command line: `/home/martin/miniforge3/envs/sage-dev/bin/x86_64-conda-linux-gnu-c++ /home/martin/tmp/tmpo2ut1o4y/testfile.cpp -o /home/martin/tmp/tmpo2ut1o4y/output.obj -D_FILE_OFFSET_BITS=64 -c -std=c++11` -> 0
Compiler accepts -std=c++11: YES
Failed to guess install tag for /usr/local/share/share/jupyter/kernels/sagemath/logo.svg
Failed to guess install tag for /usr/local/share/share/jupyter/kernels/sagemath/logo-64x64.png
Failed to guess install tag for /usr/local/share/share/jupyter/kernels/sagemath/kernel.json
Failed to guess install tag for /home/martin/miniforge3/envs/sage-dev/lib/python3.12/site-packages/sage/config.py
Failed to guess install tag for /home/martin/miniforge3/envs/sage-dev/lib/python3.12/site-packages/sage/dummy
Failed to guess install tag for /home/martin/miniforge3/envs/sage-dev/lib/python3.12/site-packages/sage/dummy
Failed to guess install tag for /home/martin/miniforge3/envs/sage-dev/lib/python3.12/site-packages/sage/dummy
Failed to guess install tag for /home/martin/miniforge3/envs/sage-dev/lib/python3.12/site-packages/sage/dummy
Failed to guess install tag for /home/martin/miniforge3/envs/sage-dev/lib/python3.12/site-packages/sage/dummy
Failed to guess install tag for /home/martin/miniforge3/envs/sage-dev/lib/python3.12/site-packages/sage/dummy
Failed to guess install tag for /home/martin/miniforge3/envs/sage-dev/lib/python3.12/site-packages/sage/dummy
Failed to guess install tag for /home/martin/miniforge3/envs/sage-dev/lib/python3.12/site-packages/sage/dummy
Failed to guess install tag for /home/martin/miniforge3/envs/sage-dev/lib/python3.12/site-packages/sage/dummy
Failed to guess install tag for /home/martin/miniforge3/envs/sage-dev/lib/python3.12/site-packages/sage/dummy
Failed to guess install tag for /home/martin/miniforge3/envs/sage-dev/lib/python3.12/site-packages/sage/dummy
Failed to guess install tag for /home/martin/miniforge3/envs/sage-dev/lib/python3.12/site-packages/sage/dummy
Failed to guess install tag for /home/martin/miniforge3/envs/sage-dev/lib/python3.12/site-packages/sage/dummy
Failed to guess install tag for /home/martin/miniforge3/envs/sage-dev/lib/python3.12/site-packages/sage/dummy
Failed to guess install tag for /home/martin/miniforge3/envs/sage-dev/lib/python3.12/site-packages/sage/dummy
Failed to guess install tag for /home/martin/miniforge3/envs/sage-dev/lib/python3.12/site-packages/sage/dummy
Failed to guess install tag for /home/martin/miniforge3/envs/sage-dev/lib/python3.12/site-packages/sage/libs/dummy
Failed to guess install tag for /home/martin/miniforge3/envs/sage-dev/lib/python3.12/site-packages/sage/libs/dummy
Failed to guess install tag for /home/martin/miniforge3/envs/sage-dev/lib/python3.12/site-packages/sage/libs/dummy
Failed to guess install tag for /home/martin/miniforge3/envs/sage-dev/lib/python3.12/site-packages/sage/libs/dummy
Failed to guess install tag for /home/martin/miniforge3/envs/sage-dev/lib/python3.12/site-packages/sage/libs/dummy
Failed to guess install tag for /home/martin/miniforge3/envs/sage-dev/lib/python3.12/site-packages/sage/libs/dummy
Failed to guess install tag for /home/martin/miniforge3/envs/sage-dev/lib/python3.12/site-packages/sage/libs/dummy
Failed to guess install tag for /home/martin/miniforge3/envs/sage-dev/lib/python3.12/site-packages/sage/libs/dummy
Failed to guess install tag for /home/martin/miniforge3/envs/sage-dev/lib/python3.12/site-packages/sage/libs/dummy
Failed to guess install tag for /home/martin/miniforge3/envs/sage-dev/lib/python3.12/site-packages/sage/structure/dummy
Failed to guess install tag for /home/martin/miniforge3/envs/sage-dev/lib/python3.12/site-packages/sage/algebras/dummy
Failed to guess install tag for /home/martin/miniforge3/envs/sage-dev/lib/python3.12/site-packages/sage/algebras/dummy
Failed to guess install tag for /home/martin/miniforge3/envs/sage-dev/lib/python3.12/site-packages/sage/algebras/dummy
Failed to guess install tag for /home/martin/miniforge3/envs/sage-dev/lib/python3.12/site-packages/sage/algebras/dummy
Failed to guess install tag for /home/martin/miniforge3/envs/sage-dev/lib/python3.12/site-packages/sage/coding/dummy
Failed to guess install tag for /home/martin/miniforge3/envs/sage-dev/lib/python3.12/site-packages/sage/coding/dummy
Failed to guess install tag for /home/martin/miniforge3/envs/sage-dev/lib/python3.12/site-packages/sage/combinat/dummy
Failed to guess install tag for /home/martin/miniforge3/envs/sage-dev/lib/python3.12/site-packages/sage/combinat/dummy
Failed to guess install tag for /home/martin/miniforge3/envs/sage-dev/lib/python3.12/site-packages/sage/combinat/dummy
Failed to guess install tag for /home/martin/miniforge3/envs/sage-dev/lib/python3.12/site-packages/sage/combinat/dummy
Failed to guess install tag for /home/martin/miniforge3/envs/sage-dev/lib/python3.12/site-packages/sage/combinat/dummy
Failed to guess install tag for /home/martin/miniforge3/envs/sage-dev/lib/python3.12/site-packages/sage/combinat/dummy
Failed to guess install tag for /home/martin/miniforge3/envs/sage-dev/lib/python3.12/site-packages/sage/combinat/dummy
Failed to guess install tag for /home/martin/miniforge3/envs/sage-dev/lib/python3.12/site-packages/sage/crypto/dummy
Failed to guess install tag for /home/martin/miniforge3/envs/sage-dev/lib/python3.12/site-packages/sage/crypto/dummy
Failed to guess install tag for /home/martin/miniforge3/envs/sage-dev/lib/python3.12/site-packages/sage/crypto/dummy
Failed to guess install tag for /home/martin/miniforge3/envs/sage-dev/lib/python3.12/site-packages/sage/geometry/dummy
Failed to guess install tag for /home/martin/miniforge3/envs/sage-dev/lib/python3.12/site-packages/sage/geometry/dummy
Failed to guess install tag for /home/martin/miniforge3/envs/sage-dev/lib/python3.12/site-packages/sage/geometry/polyhedron/dummy
Failed to guess install tag for /home/martin/miniforge3/envs/sage-dev/lib/python3.12/site-packages/sage/geometry/dummy
Failed to guess install tag for /home/martin/miniforge3/envs/sage-dev/lib/python3.12/site-packages/sage/groups/dummy
Failed to guess install tag for /home/martin/miniforge3/envs/sage-dev/lib/python3.12/site-packages/sage/groups/dummy
Failed to guess install tag for /home/martin/miniforge3/envs/sage-dev/lib/python3.12/site-packages/sage/groups/dummy
Failed to guess install tag for /home/martin/miniforge3/envs/sage-dev/lib/python3.12/site-packages/sage/groups/dummy
Failed to guess install tag for /home/martin/miniforge3/envs/sage-dev/lib/python3.12/site-packages/sage/groups/dummy
Failed to guess install tag for /home/martin/miniforge3/envs/sage-dev/lib/python3.12/site-packages/sage/modular/dummy
Failed to guess install tag for /home/martin/miniforge3/envs/sage-dev/lib/python3.12/site-packages/sage/modular/dummy
Failed to guess install tag for /home/martin/miniforge3/envs/sage-dev/lib/python3.12/site-packages/sage/modular/dummy
Failed to guess install tag for /home/martin/miniforge3/envs/sage-dev/lib/python3.12/site-packages/sage/modular/dummy
Failed to guess install tag for /home/martin/miniforge3/envs/sage-dev/lib/python3.12/site-packages/sage/modular/dummy
Failed to guess install tag for /home/martin/miniforge3/envs/sage-dev/lib/python3.12/site-packages/sage/modular/dummy
Failed to guess install tag for /home/martin/miniforge3/envs/sage-dev/lib/python3.12/site-packages/sage/modular/dummy
Failed to guess install tag for /home/martin/miniforge3/envs/sage-dev/lib/python3.12/site-packages/sage/modular/dummy
Failed to guess install tag for /home/martin/miniforge3/envs/sage-dev/lib/python3.12/site-packages/sage/modular/dummy
Failed to guess install tag for /home/martin/miniforge3/envs/sage-dev/lib/python3.12/site-packages/sage/modular/dummy
Failed to guess install tag for /home/martin/miniforge3/envs/sage-dev/lib/python3.12/site-packages/sage/modules/dummy
Failed to guess install tag for /home/martin/miniforge3/envs/sage-dev/lib/python3.12/site-packages/sage/modules/dummy
Failed to guess install tag for /home/martin/miniforge3/envs/sage-dev/lib/python3.12/site-packages/sage/quadratic_forms/dummy
Failed to guess install tag for /home/martin/miniforge3/envs/sage-dev/lib/python3.12/site-packages/sage/rings/dummy
Failed to guess install tag for /home/martin/miniforge3/envs/sage-dev/lib/python3.12/site-packages/sage/rings/function_field/dummy
Failed to guess install tag for /home/martin/miniforge3/envs/sage-dev/lib/python3.12/site-packages/sage/rings/dummy
Failed to guess install tag for /home/martin/miniforge3/envs/sage-dev/lib/python3.12/site-packages/sage/rings/polynomial/dummy
Failed to guess install tag for /home/martin/miniforge3/envs/sage-dev/lib/python3.12/site-packages/sage/rings/dummy
Failed to guess install tag for /home/martin/miniforge3/envs/sage-dev/lib/python3.12/site-packages/sage/schemes/dummy
Failed to guess install tag for /home/martin/miniforge3/envs/sage-dev/lib/python3.12/site-packages/sage/schemes/dummy
Failed to guess install tag for /home/martin/miniforge3/envs/sage-dev/lib/python3.12/site-packages/sage/schemes/dummy
Failed to guess install tag for /home/martin/miniforge3/envs/sage-dev/lib/python3.12/site-packages/sage/schemes/dummy
Failed to guess install tag for /home/martin/miniforge3/envs/sage-dev/lib/python3.12/site-packages/sage/schemes/dummy
Failed to guess install tag for /home/martin/miniforge3/envs/sage-dev/lib/python3.12/site-packages/sage/schemes/dummy
Failed to guess install tag for /home/martin/miniforge3/envs/sage-dev/lib/python3.12/site-packages/sage/schemes/dummy
Failed to guess install tag for /home/martin/miniforge3/envs/sage-dev/lib/python3.12/site-packages/sage/schemes/dummy
Failed to guess install tag for /home/martin/miniforge3/envs/sage-dev/lib/python3.12/site-packages/sage/schemes/dummy
Failed to guess install tag for /home/martin/miniforge3/envs/sage-dev/lib/python3.12/site-packages/sage/schemes/dummy
Failed to guess install tag for /home/martin/miniforge3/envs/sage-dev/lib/python3.12/site-packages/sage/schemes/dummy
Failed to guess install tag for /home/martin/miniforge3/envs/sage-dev/lib/python3.12/site-packages/sage/schemes/dummy
Failed to guess install tag for /home/martin/miniforge3/envs/sage-dev/lib/python3.12/site-packages/sage/schemes/toric/dummy
Failed to guess install tag for /home/martin/miniforge3/envs/sage-dev/lib/python3.12/site-packages/sage/symbolic/dummy
Failed to guess install tag for /home/martin/miniforge3/envs/sage-dev/lib/python3.12/site-packages/sage/tests/dummy
Failed to guess install tag for /home/martin/miniforge3/envs/sage-dev/lib/python3.12/site-packages/sage/tests/dummy
Failed to guess install tag for /home/martin/miniforge3/envs/sage-dev/lib/python3.12/site-packages/sage/dynamics/dummy
Failed to guess install tag for /home/martin/miniforge3/envs/sage-dev/lib/python3.12/site-packages/sage/sat/dummy
Failed to guess install tag for /usr/local/share/share/jupyter/kernels/sagemath/logo.svg
Failed to guess install tag for /usr/local/share/share/jupyter/kernels/sagemath/logo-64x64.png
Failed to guess install tag for /usr/local/share/share/jupyter/kernels/sagemath/kernel.json
Failed to guess install tag for /home/martin/miniforge3/envs/sage-dev/lib/python3.12/site-packages/sage/config.py
Failed to guess install tag for /home/martin/miniforge3/envs/sage-dev/lib/python3.12/site-packages/sage/dummy
Failed to guess install tag for /home/martin/miniforge3/envs/sage-dev/lib/python3.12/site-packages/sage/dummy
Failed to guess install tag for /home/martin/miniforge3/envs/sage-dev/lib/python3.12/site-packages/sage/dummy
Failed to guess install tag for /home/martin/miniforge3/envs/sage-dev/lib/python3.12/site-packages/sage/dummy
Failed to guess install tag for /home/martin/miniforge3/envs/sage-dev/lib/python3.12/site-packages/sage/dummy
Failed to guess install tag for /home/martin/miniforge3/envs/sage-dev/lib/python3.12/site-packages/sage/dummy
Failed to guess install tag for /home/martin/miniforge3/envs/sage-dev/lib/python3.12/site-packages/sage/dummy
Failed to guess install tag for /home/martin/miniforge3/envs/sage-dev/lib/python3.12/site-packages/sage/dummy
Failed to guess install tag for /home/martin/miniforge3/envs/sage-dev/lib/python3.12/site-packages/sage/dummy
Failed to guess install tag for /home/martin/miniforge3/envs/sage-dev/lib/python3.12/site-packages/sage/dummy
Failed to guess install tag for /home/martin/miniforge3/envs/sage-dev/lib/python3.12/site-packages/sage/dummy
Failed to guess install tag for /home/martin/miniforge3/envs/sage-dev/lib/python3.12/site-packages/sage/dummy
Failed to guess install tag for /home/martin/miniforge3/envs/sage-dev/lib/python3.12/site-packages/sage/dummy
Failed to guess install tag for /home/martin/miniforge3/envs/sage-dev/lib/python3.12/site-packages/sage/dummy
Failed to guess install tag for /home/martin/miniforge3/envs/sage-dev/lib/python3.12/site-packages/sage/dummy
Failed to guess install tag for /home/martin/miniforge3/envs/sage-dev/lib/python3.12/site-packages/sage/dummy
Failed to guess install tag for /home/martin/miniforge3/envs/sage-dev/lib/python3.12/site-packages/sage/libs/dummy
Failed to guess install tag for /home/martin/miniforge3/envs/sage-dev/lib/python3.12/site-packages/sage/libs/dummy
Failed to guess install tag for /home/martin/miniforge3/envs/sage-dev/lib/python3.12/site-packages/sage/libs/dummy
Failed to guess install tag for /home/martin/miniforge3/envs/sage-dev/lib/python3.12/site-packages/sage/libs/dummy
Failed to guess install tag for /home/martin/miniforge3/envs/sage-dev/lib/python3.12/site-packages/sage/libs/dummy
Failed to guess install tag for /home/martin/miniforge3/envs/sage-dev/lib/python3.12/site-packages/sage/libs/dummy
Failed to guess install tag for /home/martin/miniforge3/envs/sage-dev/lib/python3.12/site-packages/sage/libs/dummy
Failed to guess install tag for /home/martin/miniforge3/envs/sage-dev/lib/python3.12/site-packages/sage/libs/dummy
Failed to guess install tag for /home/martin/miniforge3/envs/sage-dev/lib/python3.12/site-packages/sage/libs/dummy
Failed to guess install tag for /home/martin/miniforge3/envs/sage-dev/lib/python3.12/site-packages/sage/structure/dummy
Failed to guess install tag for /home/martin/miniforge3/envs/sage-dev/lib/python3.12/site-packages/sage/algebras/dummy
Failed to guess install tag for /home/martin/miniforge3/envs/sage-dev/lib/python3.12/site-packages/sage/algebras/dummy
Failed to guess install tag for /home/martin/miniforge3/envs/sage-dev/lib/python3.12/site-packages/sage/algebras/dummy
Failed to guess install tag for /home/martin/miniforge3/envs/sage-dev/lib/python3.12/site-packages/sage/algebras/dummy
Failed to guess install tag for /home/martin/miniforge3/envs/sage-dev/lib/python3.12/site-packages/sage/coding/dummy
Failed to guess install tag for /home/martin/miniforge3/envs/sage-dev/lib/python3.12/site-packages/sage/coding/dummy
Failed to guess install tag for /home/martin/miniforge3/envs/sage-dev/lib/python3.12/site-packages/sage/combinat/dummy
Failed to guess install tag for /home/martin/miniforge3/envs/sage-dev/lib/python3.12/site-packages/sage/combinat/dummy
Failed to guess install tag for /home/martin/miniforge3/envs/sage-dev/lib/python3.12/site-packages/sage/combinat/dummy
Failed to guess install tag for /home/martin/miniforge3/envs/sage-dev/lib/python3.12/site-packages/sage/combinat/dummy
Failed to guess install tag for /home/martin/miniforge3/envs/sage-dev/lib/python3.12/site-packages/sage/combinat/dummy
Failed to guess install tag for /home/martin/miniforge3/envs/sage-dev/lib/python3.12/site-packages/sage/combinat/dummy
Failed to guess install tag for /home/martin/miniforge3/envs/sage-dev/lib/python3.12/site-packages/sage/combinat/dummy
Failed to guess install tag for /home/martin/miniforge3/envs/sage-dev/lib/python3.12/site-packages/sage/crypto/dummy
Failed to guess install tag for /home/martin/miniforge3/envs/sage-dev/lib/python3.12/site-packages/sage/crypto/dummy
Failed to guess install tag for /home/martin/miniforge3/envs/sage-dev/lib/python3.12/site-packages/sage/crypto/dummy
Failed to guess install tag for /home/martin/miniforge3/envs/sage-dev/lib/python3.12/site-packages/sage/geometry/dummy
Failed to guess install tag for /home/martin/miniforge3/envs/sage-dev/lib/python3.12/site-packages/sage/geometry/dummy
Failed to guess install tag for /home/martin/miniforge3/envs/sage-dev/lib/python3.12/site-packages/sage/geometry/polyhedron/dummy
Failed to guess install tag for /home/martin/miniforge3/envs/sage-dev/lib/python3.12/site-packages/sage/geometry/dummy
Failed to guess install tag for /home/martin/miniforge3/envs/sage-dev/lib/python3.12/site-packages/sage/groups/dummy
Failed to guess install tag for /home/martin/miniforge3/envs/sage-dev/lib/python3.12/site-packages/sage/groups/dummy
Failed to guess install tag for /home/martin/miniforge3/envs/sage-dev/lib/python3.12/site-packages/sage/groups/dummy
Failed to guess install tag for /home/martin/miniforge3/envs/sage-dev/lib/python3.12/site-packages/sage/groups/dummy
Failed to guess install tag for /home/martin/miniforge3/envs/sage-dev/lib/python3.12/site-packages/sage/groups/dummy
Failed to guess install tag for /home/martin/miniforge3/envs/sage-dev/lib/python3.12/site-packages/sage/modular/dummy
Failed to guess install tag for /home/martin/miniforge3/envs/sage-dev/lib/python3.12/site-packages/sage/modular/dummy
Failed to guess install tag for /home/martin/miniforge3/envs/sage-dev/lib/python3.12/site-packages/sage/modular/dummy
Failed to guess install tag for /home/martin/miniforge3/envs/sage-dev/lib/python3.12/site-packages/sage/modular/dummy
Failed to guess install tag for /home/martin/miniforge3/envs/sage-dev/lib/python3.12/site-packages/sage/modular/dummy
Failed to guess install tag for /home/martin/miniforge3/envs/sage-dev/lib/python3.12/site-packages/sage/modular/dummy
Failed to guess install tag for /home/martin/miniforge3/envs/sage-dev/lib/python3.12/site-packages/sage/modular/dummy
Failed to guess install tag for /home/martin/miniforge3/envs/sage-dev/lib/python3.12/site-packages/sage/modular/dummy
Failed to guess install tag for /home/martin/miniforge3/envs/sage-dev/lib/python3.12/site-packages/sage/modular/dummy
Failed to guess install tag for /home/martin/miniforge3/envs/sage-dev/lib/python3.12/site-packages/sage/modular/dummy
Failed to guess install tag for /home/martin/miniforge3/envs/sage-dev/lib/python3.12/site-packages/sage/modules/dummy
Failed to guess install tag for /home/martin/miniforge3/envs/sage-dev/lib/python3.12/site-packages/sage/modules/dummy
Failed to guess install tag for /home/martin/miniforge3/envs/sage-dev/lib/python3.12/site-packages/sage/quadratic_forms/dummy
Failed to guess install tag for /home/martin/miniforge3/envs/sage-dev/lib/python3.12/site-packages/sage/rings/dummy
Failed to guess install tag for /home/martin/miniforge3/envs/sage-dev/lib/python3.12/site-packages/sage/rings/function_field/dummy
Failed to guess install tag for /home/martin/miniforge3/envs/sage-dev/lib/python3.12/site-packages/sage/rings/dummy
Failed to guess install tag for /home/martin/miniforge3/envs/sage-dev/lib/python3.12/site-packages/sage/rings/polynomial/dummy
Failed to guess install tag for /home/martin/miniforge3/envs/sage-dev/lib/python3.12/site-packages/sage/rings/dummy
Failed to guess install tag for /home/martin/miniforge3/envs/sage-dev/lib/python3.12/site-packages/sage/schemes/dummy
Failed to guess install tag for /home/martin/miniforge3/envs/sage-dev/lib/python3.12/site-packages/sage/schemes/dummy
Failed to guess install tag for /home/martin/miniforge3/envs/sage-dev/lib/python3.12/site-packages/sage/schemes/dummy
Failed to guess install tag for /home/martin/miniforge3/envs/sage-dev/lib/python3.12/site-packages/sage/schemes/dummy
Failed to guess install tag for /home/martin/miniforge3/envs/sage-dev/lib/python3.12/site-packages/sage/schemes/dummy
Failed to guess install tag for /home/martin/miniforge3/envs/sage-dev/lib/python3.12/site-packages/sage/schemes/dummy
Failed to guess install tag for /home/martin/miniforge3/envs/sage-dev/lib/python3.12/site-packages/sage/schemes/dummy
Failed to guess install tag for /home/martin/miniforge3/envs/sage-dev/lib/python3.12/site-packages/sage/schemes/dummy
Failed to guess install tag for /home/martin/miniforge3/envs/sage-dev/lib/python3.12/site-packages/sage/schemes/dummy
Failed to guess install tag for /home/martin/miniforge3/envs/sage-dev/lib/python3.12/site-packages/sage/schemes/dummy
Failed to guess install tag for /home/martin/miniforge3/envs/sage-dev/lib/python3.12/site-packages/sage/schemes/dummy
Failed to guess install tag for /home/martin/miniforge3/envs/sage-dev/lib/python3.12/site-packages/sage/schemes/dummy
Failed to guess install tag for /home/martin/miniforge3/envs/sage-dev/lib/python3.12/site-packages/sage/schemes/toric/dummy
Failed to guess install tag for /home/martin/miniforge3/envs/sage-dev/lib/python3.12/site-packages/sage/symbolic/dummy
Failed to guess install tag for /home/martin/miniforge3/envs/sage-dev/lib/python3.12/site-packages/sage/tests/dummy
Failed to guess install tag for /home/martin/miniforge3/envs/sage-dev/lib/python3.12/site-packages/sage/tests/dummy
Failed to guess install tag for /home/martin/miniforge3/envs/sage-dev/lib/python3.12/site-packages/sage/dynamics/dummy
Failed to guess install tag for /home/martin/miniforge3/envs/sage-dev/lib/python3.12/site-packages/sage/sat/dummy
Failed to guess install tag for /usr/local/share/share/jupyter/kernels/sagemath/logo.svg
Failed to guess install tag for /usr/local/share/share/jupyter/kernels/sagemath/logo-64x64.png
Failed to guess install tag for /usr/local/share/share/jupyter/kernels/sagemath/kernel.json
Failed to guess install tag for /home/martin/miniforge3/envs/sage-dev/lib/python3.12/site-packages/sage/config.py
Failed to guess install tag for /home/martin/miniforge3/envs/sage-dev/lib/python3.12/site-packages/sage/dummy
Failed to guess install tag for /home/martin/miniforge3/envs/sage-dev/lib/python3.12/site-packages/sage/dummy
Failed to guess install tag for /home/martin/miniforge3/envs/sage-dev/lib/python3.12/site-packages/sage/dummy
Failed to guess install tag for /home/martin/miniforge3/envs/sage-dev/lib/python3.12/site-packages/sage/dummy
Failed to guess install tag for /home/martin/miniforge3/envs/sage-dev/lib/python3.12/site-packages/sage/dummy
Failed to guess install tag for /home/martin/miniforge3/envs/sage-dev/lib/python3.12/site-packages/sage/dummy
Failed to guess install tag for /home/martin/miniforge3/envs/sage-dev/lib/python3.12/site-packages/sage/dummy
Failed to guess install tag for /home/martin/miniforge3/envs/sage-dev/lib/python3.12/site-packages/sage/dummy
Failed to guess install tag for /home/martin/miniforge3/envs/sage-dev/lib/python3.12/site-packages/sage/dummy
Failed to guess install tag for /home/martin/miniforge3/envs/sage-dev/lib/python3.12/site-packages/sage/dummy
Failed to guess install tag for /home/martin/miniforge3/envs/sage-dev/lib/python3.12/site-packages/sage/dummy
Failed to guess install tag for /home/martin/miniforge3/envs/sage-dev/lib/python3.12/site-packages/sage/dummy
Failed to guess install tag for /home/martin/miniforge3/envs/sage-dev/lib/python3.12/site-packages/sage/dummy
Failed to guess install tag for /home/martin/miniforge3/envs/sage-dev/lib/python3.12/site-packages/sage/dummy
Failed to guess install tag for /home/martin/miniforge3/envs/sage-dev/lib/python3.12/site-packages/sage/dummy
Failed to guess install tag for /home/martin/miniforge3/envs/sage-dev/lib/python3.12/site-packages/sage/dummy
Failed to guess install tag for /home/martin/miniforge3/envs/sage-dev/lib/python3.12/site-packages/sage/libs/dummy
Failed to guess install tag for /home/martin/miniforge3/envs/sage-dev/lib/python3.12/site-packages/sage/libs/dummy
Failed to guess install tag for /home/martin/miniforge3/envs/sage-dev/lib/python3.12/site-packages/sage/libs/dummy
Failed to guess install tag for /home/martin/miniforge3/envs/sage-dev/lib/python3.12/site-packages/sage/libs/dummy
Failed to guess install tag for /home/martin/miniforge3/envs/sage-dev/lib/python3.12/site-packages/sage/libs/dummy
Failed to guess install tag for /home/martin/miniforge3/envs/sage-dev/lib/python3.12/site-packages/sage/libs/dummy
Failed to guess install tag for /home/martin/miniforge3/envs/sage-dev/lib/python3.12/site-packages/sage/libs/dummy
Failed to guess install tag for /home/martin/miniforge3/envs/sage-dev/lib/python3.12/site-packages/sage/libs/dummy
Failed to guess install tag for /home/martin/miniforge3/envs/sage-dev/lib/python3.12/site-packages/sage/libs/dummy
Failed to guess install tag for /home/martin/miniforge3/envs/sage-dev/lib/python3.12/site-packages/sage/structure/dummy
Failed to guess install tag for /home/martin/miniforge3/envs/sage-dev/lib/python3.12/site-packages/sage/algebras/dummy
Failed to guess install tag for /home/martin/miniforge3/envs/sage-dev/lib/python3.12/site-packages/sage/algebras/dummy
Failed to guess install tag for /home/martin/miniforge3/envs/sage-dev/lib/python3.12/site-packages/sage/algebras/dummy
Failed to guess install tag for /home/martin/miniforge3/envs/sage-dev/lib/python3.12/site-packages/sage/algebras/dummy
Failed to guess install tag for /home/martin/miniforge3/envs/sage-dev/lib/python3.12/site-packages/sage/coding/dummy
Failed to guess install tag for /home/martin/miniforge3/envs/sage-dev/lib/python3.12/site-packages/sage/coding/dummy
Failed to guess install tag for /home/martin/miniforge3/envs/sage-dev/lib/python3.12/site-packages/sage/combinat/dummy
Failed to guess install tag for /home/martin/miniforge3/envs/sage-dev/lib/python3.12/site-packages/sage/combinat/dummy
Failed to guess install tag for /home/martin/miniforge3/envs/sage-dev/lib/python3.12/site-packages/sage/combinat/dummy
Failed to guess install tag for /home/martin/miniforge3/envs/sage-dev/lib/python3.12/site-packages/sage/combinat/dummy
Failed to guess install tag for /home/martin/miniforge3/envs/sage-dev/lib/python3.12/site-packages/sage/combinat/dummy
Failed to guess install tag for /home/martin/miniforge3/envs/sage-dev/lib/python3.12/site-packages/sage/combinat/dummy
Failed to guess install tag for /home/martin/miniforge3/envs/sage-dev/lib/python3.12/site-packages/sage/combinat/dummy
Failed to guess install tag for /home/martin/miniforge3/envs/sage-dev/lib/python3.12/site-packages/sage/crypto/dummy
Failed to guess install tag for /home/martin/miniforge3/envs/sage-dev/lib/python3.12/site-packages/sage/crypto/dummy
Failed to guess install tag for /home/martin/miniforge3/envs/sage-dev/lib/python3.12/site-packages/sage/crypto/dummy
Failed to guess install tag for /home/martin/miniforge3/envs/sage-dev/lib/python3.12/site-packages/sage/geometry/dummy
Failed to guess install tag for /home/martin/miniforge3/envs/sage-dev/lib/python3.12/site-packages/sage/geometry/dummy
Failed to guess install tag for /home/martin/miniforge3/envs/sage-dev/lib/python3.12/site-packages/sage/geometry/polyhedron/dummy
Failed to guess install tag for /home/martin/miniforge3/envs/sage-dev/lib/python3.12/site-packages/sage/geometry/dummy
Failed to guess install tag for /home/martin/miniforge3/envs/sage-dev/lib/python3.12/site-packages/sage/groups/dummy
Failed to guess install tag for /home/martin/miniforge3/envs/sage-dev/lib/python3.12/site-packages/sage/groups/dummy
Failed to guess install tag for /home/martin/miniforge3/envs/sage-dev/lib/python3.12/site-packages/sage/groups/dummy
Failed to guess install tag for /home/martin/miniforge3/envs/sage-dev/lib/python3.12/site-packages/sage/groups/dummy
Failed to guess install tag for /home/martin/miniforge3/envs/sage-dev/lib/python3.12/site-packages/sage/groups/dummy
Failed to guess install tag for /home/martin/miniforge3/envs/sage-dev/lib/python3.12/site-packages/sage/modular/dummy
Failed to guess install tag for /home/martin/miniforge3/envs/sage-dev/lib/python3.12/site-packages/sage/modular/dummy
Failed to guess install tag for /home/martin/miniforge3/envs/sage-dev/lib/python3.12/site-packages/sage/modular/dummy
Failed to guess install tag for /home/martin/miniforge3/envs/sage-dev/lib/python3.12/site-packages/sage/modular/dummy
Failed to guess install tag for /home/martin/miniforge3/envs/sage-dev/lib/python3.12/site-packages/sage/modular/dummy
Failed to guess install tag for /home/martin/miniforge3/envs/sage-dev/lib/python3.12/site-packages/sage/modular/dummy
Failed to guess install tag for /home/martin/miniforge3/envs/sage-dev/lib/python3.12/site-packages/sage/modular/dummy
Failed to guess install tag for /home/martin/miniforge3/envs/sage-dev/lib/python3.12/site-packages/sage/modular/dummy
Failed to guess install tag for /home/martin/miniforge3/envs/sage-dev/lib/python3.12/site-packages/sage/modular/dummy
Failed to guess install tag for /home/martin/miniforge3/envs/sage-dev/lib/python3.12/site-packages/sage/modular/dummy
Failed to guess install tag for /home/martin/miniforge3/envs/sage-dev/lib/python3.12/site-packages/sage/modules/dummy
Failed to guess install tag for /home/martin/miniforge3/envs/sage-dev/lib/python3.12/site-packages/sage/modules/dummy
Failed to guess install tag for /home/martin/miniforge3/envs/sage-dev/lib/python3.12/site-packages/sage/quadratic_forms/dummy
Failed to guess install tag for /home/martin/miniforge3/envs/sage-dev/lib/python3.12/site-packages/sage/rings/dummy
Failed to guess install tag for /home/martin/miniforge3/envs/sage-dev/lib/python3.12/site-packages/sage/rings/function_field/dummy
Failed to guess install tag for /home/martin/miniforge3/envs/sage-dev/lib/python3.12/site-packages/sage/rings/dummy
Failed to guess install tag for /home/martin/miniforge3/envs/sage-dev/lib/python3.12/site-packages/sage/rings/polynomial/dummy
Failed to guess install tag for /home/martin/miniforge3/envs/sage-dev/lib/python3.12/site-packages/sage/rings/dummy
Failed to guess install tag for /home/martin/miniforge3/envs/sage-dev/lib/python3.12/site-packages/sage/schemes/dummy
Failed to guess install tag for /home/martin/miniforge3/envs/sage-dev/lib/python3.12/site-packages/sage/schemes/dummy
Failed to guess install tag for /home/martin/miniforge3/envs/sage-dev/lib/python3.12/site-packages/sage/schemes/dummy
Failed to guess install tag for /home/martin/miniforge3/envs/sage-dev/lib/python3.12/site-packages/sage/schemes/dummy
Failed to guess install tag for /home/martin/miniforge3/envs/sage-dev/lib/python3.12/site-packages/sage/schemes/dummy
Failed to guess install tag for /home/martin/miniforge3/envs/sage-dev/lib/python3.12/site-packages/sage/schemes/dummy
Failed to guess install tag for /home/martin/miniforge3/envs/sage-dev/lib/python3.12/site-packages/sage/schemes/dummy
Failed to guess install tag for /home/martin/miniforge3/envs/sage-dev/lib/python3.12/site-packages/sage/schemes/dummy
Failed to guess install tag for /home/martin/miniforge3/envs/sage-dev/lib/python3.12/site-packages/sage/schemes/dummy
Failed to guess install tag for /home/martin/miniforge3/envs/sage-dev/lib/python3.12/site-packages/sage/schemes/dummy
Failed to guess install tag for /home/martin/miniforge3/envs/sage-dev/lib/python3.12/site-packages/sage/schemes/dummy
Failed to guess install tag for /home/martin/miniforge3/envs/sage-dev/lib/python3.12/site-packages/sage/schemes/dummy
Failed to guess install tag for /home/martin/miniforge3/envs/sage-dev/lib/python3.12/site-packages/sage/schemes/toric/dummy
Failed to guess install tag for /home/martin/miniforge3/envs/sage-dev/lib/python3.12/site-packages/sage/symbolic/dummy
Failed to guess install tag for /home/martin/miniforge3/envs/sage-dev/lib/python3.12/site-packages/sage/tests/dummy
Failed to guess install tag for /home/martin/miniforge3/envs/sage-dev/lib/python3.12/site-packages/sage/tests/dummy
Failed to guess install tag for /home/martin/miniforge3/envs/sage-dev/lib/python3.12/site-packages/sage/dynamics/dummy
Failed to guess install tag for /home/martin/miniforge3/envs/sage-dev/lib/python3.12/site-packages/sage/sat/dummy
Failed to guess install tag for /usr/local/share/share/jupyter/kernels/sagemath/logo.svg
Failed to guess install tag for /usr/local/share/share/jupyter/kernels/sagemath/logo-64x64.png
Failed to guess install tag for /usr/local/share/share/jupyter/kernels/sagemath/kernel.json
Failed to guess install tag for /home/martin/miniforge3/envs/sage-dev/lib/python3.12/site-packages/sage/config.py
Failed to guess install tag for /home/martin/miniforge3/envs/sage-dev/lib/python3.12/site-packages/sage/dummy
Failed to guess install tag for /home/martin/miniforge3/envs/sage-dev/lib/python3.12/site-packages/sage/dummy
Failed to guess install tag for /home/martin/miniforge3/envs/sage-dev/lib/python3.12/site-packages/sage/dummy
Failed to guess install tag for /home/martin/miniforge3/envs/sage-dev/lib/python3.12/site-packages/sage/dummy
Failed to guess install tag for /home/martin/miniforge3/envs/sage-dev/lib/python3.12/site-packages/sage/dummy
Failed to guess install tag for /home/martin/miniforge3/envs/sage-dev/lib/python3.12/site-packages/sage/dummy
Failed to guess install tag for /home/martin/miniforge3/envs/sage-dev/lib/python3.12/site-packages/sage/dummy
Failed to guess install tag for /home/martin/miniforge3/envs/sage-dev/lib/python3.12/site-packages/sage/dummy
Failed to guess install tag for /home/martin/miniforge3/envs/sage-dev/lib/python3.12/site-packages/sage/dummy
Failed to guess install tag for /home/martin/miniforge3/envs/sage-dev/lib/python3.12/site-packages/sage/dummy
Failed to guess install tag for /home/martin/miniforge3/envs/sage-dev/lib/python3.12/site-packages/sage/dummy
Failed to guess install tag for /home/martin/miniforge3/envs/sage-dev/lib/python3.12/site-packages/sage/dummy
Failed to guess install tag for /home/martin/miniforge3/envs/sage-dev/lib/python3.12/site-packages/sage/dummy
Failed to guess install tag for /home/martin/miniforge3/envs/sage-dev/lib/python3.12/site-packages/sage/dummy
Failed to guess install tag for /home/martin/miniforge3/envs/sage-dev/lib/python3.12/site-packages/sage/dummy
Failed to guess install tag for /home/martin/miniforge3/envs/sage-dev/lib/python3.12/site-packages/sage/dummy
Failed to guess install tag for /home/martin/miniforge3/envs/sage-dev/lib/python3.12/site-packages/sage/libs/dummy
Failed to guess install tag for /home/martin/miniforge3/envs/sage-dev/lib/python3.12/site-packages/sage/libs/dummy
Failed to guess install tag for /home/martin/miniforge3/envs/sage-dev/lib/python3.12/site-packages/sage/libs/dummy
Failed to guess install tag for /home/martin/miniforge3/envs/sage-dev/lib/python3.12/site-packages/sage/libs/dummy
Failed to guess install tag for /home/martin/miniforge3/envs/sage-dev/lib/python3.12/site-packages/sage/libs/dummy
Failed to guess install tag for /home/martin/miniforge3/envs/sage-dev/lib/python3.12/site-packages/sage/libs/dummy
Failed to guess install tag for /home/martin/miniforge3/envs/sage-dev/lib/python3.12/site-packages/sage/libs/dummy
Failed to guess install tag for /home/martin/miniforge3/envs/sage-dev/lib/python3.12/site-packages/sage/libs/dummy
Failed to guess install tag for /home/martin/miniforge3/envs/sage-dev/lib/python3.12/site-packages/sage/libs/dummy
Failed to guess install tag for /home/martin/miniforge3/envs/sage-dev/lib/python3.12/site-packages/sage/structure/dummy
Failed to guess install tag for /home/martin/miniforge3/envs/sage-dev/lib/python3.12/site-packages/sage/algebras/dummy
Failed to guess install tag for /home/martin/miniforge3/envs/sage-dev/lib/python3.12/site-packages/sage/algebras/dummy
Failed to guess install tag for /home/martin/miniforge3/envs/sage-dev/lib/python3.12/site-packages/sage/algebras/dummy
Failed to guess install tag for /home/martin/miniforge3/envs/sage-dev/lib/python3.12/site-packages/sage/algebras/dummy
Failed to guess install tag for /home/martin/miniforge3/envs/sage-dev/lib/python3.12/site-packages/sage/coding/dummy
Failed to guess install tag for /home/martin/miniforge3/envs/sage-dev/lib/python3.12/site-packages/sage/coding/dummy
Failed to guess install tag for /home/martin/miniforge3/envs/sage-dev/lib/python3.12/site-packages/sage/combinat/dummy
Failed to guess install tag for /home/martin/miniforge3/envs/sage-dev/lib/python3.12/site-packages/sage/combinat/dummy
Failed to guess install tag for /home/martin/miniforge3/envs/sage-dev/lib/python3.12/site-packages/sage/combinat/dummy
Failed to guess install tag for /home/martin/miniforge3/envs/sage-dev/lib/python3.12/site-packages/sage/combinat/dummy
Failed to guess install tag for /home/martin/miniforge3/envs/sage-dev/lib/python3.12/site-packages/sage/combinat/dummy
Failed to guess install tag for /home/martin/miniforge3/envs/sage-dev/lib/python3.12/site-packages/sage/combinat/dummy
Failed to guess install tag for /home/martin/miniforge3/envs/sage-dev/lib/python3.12/site-packages/sage/combinat/dummy
Failed to guess install tag for /home/martin/miniforge3/envs/sage-dev/lib/python3.12/site-packages/sage/crypto/dummy
Failed to guess install tag for /home/martin/miniforge3/envs/sage-dev/lib/python3.12/site-packages/sage/crypto/dummy
Failed to guess install tag for /home/martin/miniforge3/envs/sage-dev/lib/python3.12/site-packages/sage/crypto/dummy
Failed to guess install tag for /home/martin/miniforge3/envs/sage-dev/lib/python3.12/site-packages/sage/geometry/dummy
Failed to guess install tag for /home/martin/miniforge3/envs/sage-dev/lib/python3.12/site-packages/sage/geometry/dummy
Failed to guess install tag for /home/martin/miniforge3/envs/sage-dev/lib/python3.12/site-packages/sage/geometry/polyhedron/dummy
Failed to guess install tag for /home/martin/miniforge3/envs/sage-dev/lib/python3.12/site-packages/sage/geometry/dummy
Failed to guess install tag for /home/martin/miniforge3/envs/sage-dev/lib/python3.12/site-packages/sage/groups/dummy
Failed to guess install tag for /home/martin/miniforge3/envs/sage-dev/lib/python3.12/site-packages/sage/groups/dummy
Failed to guess install tag for /home/martin/miniforge3/envs/sage-dev/lib/python3.12/site-packages/sage/groups/dummy
Failed to guess install tag for /home/martin/miniforge3/envs/sage-dev/lib/python3.12/site-packages/sage/groups/dummy
Failed to guess install tag for /home/martin/miniforge3/envs/sage-dev/lib/python3.12/site-packages/sage/groups/dummy
Failed to guess install tag for /home/martin/miniforge3/envs/sage-dev/lib/python3.12/site-packages/sage/modular/dummy
Failed to guess install tag for /home/martin/miniforge3/envs/sage-dev/lib/python3.12/site-packages/sage/modular/dummy
Failed to guess install tag for /home/martin/miniforge3/envs/sage-dev/lib/python3.12/site-packages/sage/modular/dummy
Failed to guess install tag for /home/martin/miniforge3/envs/sage-dev/lib/python3.12/site-packages/sage/modular/dummy
Failed to guess install tag for /home/martin/miniforge3/envs/sage-dev/lib/python3.12/site-packages/sage/modular/dummy
Failed to guess install tag for /home/martin/miniforge3/envs/sage-dev/lib/python3.12/site-packages/sage/modular/dummy
Failed to guess install tag for /home/martin/miniforge3/envs/sage-dev/lib/python3.12/site-packages/sage/modular/dummy
Failed to guess install tag for /home/martin/miniforge3/envs/sage-dev/lib/python3.12/site-packages/sage/modular/dummy
Failed to guess install tag for /home/martin/miniforge3/envs/sage-dev/lib/python3.12/site-packages/sage/modular/dummy
Failed to guess install tag for /home/martin/miniforge3/envs/sage-dev/lib/python3.12/site-packages/sage/modular/dummy
Failed to guess install tag for /home/martin/miniforge3/envs/sage-dev/lib/python3.12/site-packages/sage/modules/dummy
Failed to guess install tag for /home/martin/miniforge3/envs/sage-dev/lib/python3.12/site-packages/sage/modules/dummy
Failed to guess install tag for /home/martin/miniforge3/envs/sage-dev/lib/python3.12/site-packages/sage/quadratic_forms/dummy
Failed to guess install tag for /home/martin/miniforge3/envs/sage-dev/lib/python3.12/site-packages/sage/rings/dummy
Failed to guess install tag for /home/martin/miniforge3/envs/sage-dev/lib/python3.12/site-packages/sage/rings/function_field/dummy
Failed to guess install tag for /home/martin/miniforge3/envs/sage-dev/lib/python3.12/site-packages/sage/rings/dummy
Failed to guess install tag for /home/martin/miniforge3/envs/sage-dev/lib/python3.12/site-packages/sage/rings/polynomial/dummy
Failed to guess install tag for /home/martin/miniforge3/envs/sage-dev/lib/python3.12/site-packages/sage/rings/dummy
Failed to guess install tag for /home/martin/miniforge3/envs/sage-dev/lib/python3.12/site-packages/sage/schemes/dummy
Failed to guess install tag for /home/martin/miniforge3/envs/sage-dev/lib/python3.12/site-packages/sage/schemes/dummy
Failed to guess install tag for /home/martin/miniforge3/envs/sage-dev/lib/python3.12/site-packages/sage/schemes/dummy
Failed to guess install tag for /home/martin/miniforge3/envs/sage-dev/lib/python3.12/site-packages/sage/schemes/dummy
Failed to guess install tag for /home/martin/miniforge3/envs/sage-dev/lib/python3.12/site-packages/sage/schemes/dummy
Failed to guess install tag for /home/martin/miniforge3/envs/sage-dev/lib/python3.12/site-packages/sage/schemes/dummy
Failed to guess install tag for /home/martin/miniforge3/envs/sage-dev/lib/python3.12/site-packages/sage/schemes/dummy
Failed to guess install tag for /home/martin/miniforge3/envs/sage-dev/lib/python3.12/site-packages/sage/schemes/dummy
Failed to guess install tag for /home/martin/miniforge3/envs/sage-dev/lib/python3.12/site-packages/sage/schemes/dummy
Failed to guess install tag for /home/martin/miniforge3/envs/sage-dev/lib/python3.12/site-packages/sage/schemes/dummy
Failed to guess install tag for /home/martin/miniforge3/envs/sage-dev/lib/python3.12/site-packages/sage/schemes/dummy
Failed to guess install tag for /home/martin/miniforge3/envs/sage-dev/lib/python3.12/site-packages/sage/schemes/dummy
Failed to guess install tag for /home/martin/miniforge3/envs/sage-dev/lib/python3.12/site-packages/sage/schemes/toric/dummy
Failed to guess install tag for /home/martin/miniforge3/envs/sage-dev/lib/python3.12/site-packages/sage/symbolic/dummy
Failed to guess install tag for /home/martin/miniforge3/envs/sage-dev/lib/python3.12/site-packages/sage/tests/dummy
Failed to guess install tag for /home/martin/miniforge3/envs/sage-dev/lib/python3.12/site-packages/sage/tests/dummy
Failed to guess install tag for /home/martin/miniforge3/envs/sage-dev/lib/python3.12/site-packages/sage/dynamics/dummy
Failed to guess install tag for /home/martin/miniforge3/envs/sage-dev/lib/python3.12/site-packages/sage/sat/dummy
###################
mamba list
###################
List of packages in environment: "/home/martin/miniforge3/envs/sage-dev"
Name Version Build Channel
───────────────────────────────────────────────────────────────────────────────────
4ti2 1.6.15 h4181bf9_0 conda-forge
Farama-Notifications 0.0.4 pypi_0 pypi
_libgcc_mutex 0.1 conda_forge conda-forge
_openmp_mutex 4.5 20_gnu conda-forge
_python_abi3_support 1.0 hd8ed1ab_2 conda-forge
_r-mutex 1.0.1 anacondar_1 conda-forge
absl-py 2.4.0 pypi_0 pypi
accessible-pygments 0.0.5 pyhd8ed1ab_1 conda-forge
alabaster 1.0.0 pyhd8ed1ab_1 conda-forge
alsa-lib 1.2.15.3 hb03c661_0 conda-forge
annotated-types 0.7.0 pyhd8ed1ab_1 conda-forge
appdirs 1.4.4 pyhd8ed1ab_1 conda-forge
archspec 0.2.5 pyhd8ed1ab_0 conda-forge
arpack 3.9.1 nompi_hf03ea27_102 conda-forge
asttokens 3.0.1 pyhd8ed1ab_0 conda-forge
attrs 26.1.0 pyhcf101f3_0 conda-forge
autoconf 2.72 pl5321hbb4ee43_1 conda-forge
automake 1.17 pl5321ha770c72_0 conda-forge
babel 2.18.0 pyhcf101f3_1 conda-forge
backports 1.0 pyhd8ed1ab_5 conda-forge
backports.tarfile 1.2.0 pyhcf101f3_2 conda-forge
backports.zstd 1.3.0 py312h90b7ffd_0 conda-forge
bdw-gc 8.2.12 h54a6638_0 conda-forge
beautifulsoup4 4.14.3 pyha770c72_0 conda-forge
binutils 2.45.1 default_h4852527_102 conda-forge
binutils_impl_linux-64 2.45.1 default_hfdba357_102 conda-forge
binutils_linux-64 2.45.1 default_h4852527_102 conda-forge
blas 2.306 openblas conda-forge
blas-devel 3.11.0 6_h1ea3ea9_openblas conda-forge
bleach 6.3.0 pyhcf101f3_1 conda-forge
bleach-with-css 6.3.0 hbca2aae_1 conda-forge
bliss 0.77 h00ab1b0_1 conda-forge
boltons 25.0.0 pyhd8ed1ab_0 conda-forge
boost-cpp 1.85.0 h3c6214e_4 conda-forge
brotli 1.2.0 hed03a55_1 conda-forge
brotli-bin 1.2.0 hb03c661_1 conda-forge
brotli-python 1.2.0 py312hdb49522_1 conda-forge
bwidget 1.10.1 ha770c72_1 conda-forge
bzip2 1.0.8 hda65f42_9 conda-forge
c-ares 1.34.6 hb03c661_0 conda-forge
c-compiler 1.11.0 h4d9bdce_0 conda-forge
ca-certificates 2026.4.22 hbd8a1cb_0 conda-forge
cachecontrol 0.14.3 pyha770c72_0 conda-forge
cachecontrol-with-filecache 0.14.3 pyhd8ed1ab_0 conda-forge
cairo 1.18.4 h3394656_0 conda-forge
cddlib 1!0.94n h91791ec_0 conda-forge
certifi 2026.4.22 pyhd8ed1ab_0 conda-forge
cffi 2.1.1 py312h703531f_3 conda-forge
charset-normalizer 3.4.7 pyhd8ed1ab_0 conda-forge
clarabel 0.11.1 pypi_0 pypi
click 8.2.1 pyh707e725_0 conda-forge
click-default-group 1.2.4 pyhd8ed1ab_1 conda-forge
cliquer 1.23 hb03c661_0 conda-forge
cloudpickle 3.1.2 pypi_0 pypi
colorama 0.4.6 pyhd8ed1ab_1 conda-forge
comm 0.2.3 pyhe01879c_0 conda-forge
conda 26.3.2 py312h7900ff3_1 conda-forge
conda-gcc-specs 14.3.0 he8ccf15_18 conda-forge
conda-libmamba-solver 26.4.0 pyhd8ed1ab_0 conda-forge
conda-lock 4.0.0 pyha191276_0 conda-forge
conda-package-handling 2.4.0 pyh7900ff3_2 conda-forge
conda-package-streaming 0.12.0 pyhd8ed1ab_0 conda-forge
conda-recipe-manager 0.10.2 pyhd8ed1ab_0 conda-forge
conda-souschef 3.0.1 pyhd8ed1ab_0 conda-forge
contourpy 1.3.3 py312h0a2e395_4 conda-forge
conway-polynomials 0.10 pyhd8ed1ab_1 conda-forge
coverage 7.13.5 py312h8a5da7c_0 conda-forge
cpp-expected 1.3.1 h171cf75_0 conda-forge
cpython 3.12.13 py312hd8ed1ab_0 conda-forge
crashtest 0.4.1 pyhd8ed1ab_1 conda-forge
cryptography 47.0.0 py312ha4b625e_0 conda-forge
cuda-bindings 12.9.4 pypi_0 pypi
cuda-pathfinder 1.4.2 pypi_0 pypi
curl 8.18.0 h4e3cde8_0 conda-forge
cvxpy 1.8.0 pypi_0 pypi
cxx-compiler 1.11.0 hfcd1e18_0 conda-forge
cycler 0.12.1 pyhcf101f3_2 conda-forge
cypari2 2.2.4 py312h8892d45_2 conda-forge
cyrus-sasl 2.1.28 hd9c7081_0 conda-forge
cysignals 1.12.6 py312h1289d80_2 conda-forge
cython 3.2.4 py312h68e6be4_0 conda-forge
dbus 1.13.6 h5008d03_3 conda-forge
debugpy 1.8.20 py312h8285ef7_0 conda-forge
decorator 5.2.1 pyhd8ed1ab_0 conda-forge
defusedxml 0.7.1 pyhd8ed1ab_0 conda-forge
deprecated 1.3.1 pyhd8ed1ab_1 conda-forge
distlib 0.4.0 pyhd8ed1ab_0 conda-forge
distro 1.9.0 pyhd8ed1ab_1 conda-forge
dm-tree 0.1.9 pypi_0 pypi
docutils 0.22.4 pyhd8ed1ab_0 conda-forge
dot2tex 2.11.3 pyhd8ed1ab_1 conda-forge
double-conversion 3.3.1 h5888daf_0 conda-forge
dulwich 0.24.10 py312h0ccc70a_1 conda-forge
ecl 26.5.5 h1b6f47c_1 conda-forge
eclib 20250627 h163b5c9_2 conda-forge
ecm 7.0.6 h90cbb55_0 conda-forge
ecos 2.0.14 pypi_0 pypi
eigen 3.4.0 h171cf75_1 conda-forge
ensureconda 1.6.0 pyhcf101f3_0 conda-forge
evalidate 2.0.5 pyhe01879c_0 conda-forge
exceptiongroup 1.3.1 pyhd8ed1ab_0 conda-forge
execnet 2.1.2 pyhd8ed1ab_0 conda-forge
executing 2.2.1 pyhd8ed1ab_0 conda-forge
expat 2.7.5 hecca717_0 conda-forge
fflas-ffpack 2.5.0 h87ef935_2 conda-forge
filelock 3.29.0 pyhd8ed1ab_0 conda-forge
flake8 7.3.0 pyhd8ed1ab_0 conda-forge
flake8-rst-docstrings 0.4.0 pyhd8ed1ab_0 conda-forge
fmt 11.2.0 h07f6e7f_0 conda-forge
font-ttf-dejavu-sans-mono 2.37 hab24e00_0 conda-forge
font-ttf-inconsolata 3.000 h77eed37_0 conda-forge
font-ttf-source-code-pro 2.038 h77eed37_0 conda-forge
font-ttf-ubuntu 0.83 h77eed37_3 conda-forge
fontconfig 2.17.1 h27c8c51_0 conda-forge
fonts-conda-ecosystem 1 0 conda-forge
fonts-conda-forge 1 hc364b38_1 conda-forge
fonttools 4.62.1 py312h8a5da7c_0 conda-forge
fortran-compiler 1.11.0 h9bea470_0 conda-forge
fplll 5.5.0 hd20a173_0 conda-forge
fpylll 0.6.4 py312hdf8828e_2 conda-forge
freetype 2.14.3 ha770c72_0 conda-forge
fribidi 1.0.16 hb03c661_0 conda-forge
frozendict 2.4.7 py312h4c3975b_0 conda-forge
fsspec 2026.2.0 pypi_0 pypi
furo 2025.12.19 pyhd8ed1ab_1 conda-forge
gap 4.15.1 hb4e56ec_2 conda-forge
gap-core 4.15.1 h60ec763_2 conda-forge
gap-defaults 4.15.1 ha770c72_2 conda-forge
gcc 14.3.0 h0dff253_18 conda-forge
gcc_impl_linux-64 14.3.0 hbdf3cc3_18 conda-forge
gcc_linux-64 14.3.0 h50e9bb6_24 conda-forge
gf2x 1.3.0 h55551d5_3 conda-forge
gfan 0.6.2 hb86e20a_1003 conda-forge
gfortran 14.3.0 h76987e4_18 conda-forge
gfortran_impl_linux-64 14.3.0 h1a219da_18 conda-forge
gfortran_linux-64 14.3.0 h6b77fdb_24 conda-forge
gitdb 4.0.12 pyhd8ed1ab_0 conda-forge
gitpython 3.1.49 pyhd8ed1ab_0 conda-forge
givaro 4.2.1 hb397f18_1 conda-forge
glpk 5.0 h445213a_0 conda-forge
gmp 6.3.0 hac33072_2 conda-forge
gmpy2 2.3.0 py312hcaba1f9_1 conda-forge
graphite2 1.3.14 hecca717_2 conda-forge
grayskull 3.1.0 pyhcf101f3_0 conda-forge
gsl 2.8 hbf7d49c_1 conda-forge
gxx 14.3.0 h76987e4_18 conda-forge
gxx_impl_linux-64 14.3.0 h2185e75_18 conda-forge
gxx_linux-64 14.3.0 h8a413ad_24 conda-forge
gymnasium 1.2.2 pypi_0 pypi
h2 4.3.0 pyhcf101f3_0 conda-forge
harfbuzz 11.0.0 h76408a6_0 conda-forge
highs 1.14.0 h171cf75_0 conda-forge
highspy 1.12.0 pypi_0 pypi
hpack 4.1.0 pyhd8ed1ab_0 conda-forge
hyperframe 6.1.0 pyhd8ed1ab_0 conda-forge
icu 75.1 he02047a_0 conda-forge
idna 3.13 pyhcf101f3_0 conda-forge
igraph 0.10.16 h98b0679_0 conda-forge
imagesize 2.0.0 pyhd8ed1ab_0 conda-forge
iml 1.0.5 h623f65a_1004 conda-forge
importlib-metadata 8.8.0 pyhcf101f3_0 conda-forge
importlib_resources 7.1.0 pyhd8ed1ab_0 conda-forge
iniconfig 2.3.0 pyhd8ed1ab_0 conda-forge
ipykernel 7.2.0 pyha191276_1 conda-forge
ipython 9.13.0 pyh53cf698_0 conda-forge
ipython_pygments_lexers 1.1.1 pyhd8ed1ab_0 conda-forge
ipywidgets 8.1.8 pyhd8ed1ab_0 conda-forge
jaraco.classes 3.4.0 pyhcf101f3_3 conda-forge
jaraco.context 6.1.2 pyhcf101f3_0 conda-forge
jaraco.functools 4.4.0 pyhcf101f3_1 conda-forge
jedi 0.19.2 pyhd8ed1ab_1 conda-forge
jeepney 0.9.0 pyhd8ed1ab_0 conda-forge
jinja2 3.1.6 pyhcf101f3_1 conda-forge
joblib 1.5.3 pypi_0 pypi
jsonpatch 1.33 pyhd8ed1ab_1 conda-forge
jsonpointer 3.1.1 pyhcf101f3_0 conda-forge
jsonschema 4.26.0 pyhcf101f3_0 conda-forge
jsonschema-specifications 2025.9.1 pyhcf101f3_0 conda-forge
jupyter-sphinx 0.5.3 pyha770c72_5 conda-forge
jupyter_client 8.8.0 pyhcf101f3_0 conda-forge
jupyter_core 5.9.1 pyhc90fa1f_0 conda-forge
jupyterlab_pygments 0.3.0 pyhd8ed1ab_2 conda-forge
jupyterlab_widgets 3.0.16 pyhcf101f3_1 conda-forge
kernel-headers_linux-64 6.12.0 he073ed8_6 conda-forge
keyring 25.7.0 pyha804496_0 conda-forge
keyutils 1.6.3 hb9d3cd8_0 conda-forge
kiwisolver 1.5.0 py312h0a2e395_0 conda-forge
krb5 1.21.3 h659f571_0 conda-forge
latte-integrale 1.7.6 h8c2df61_1 conda-forge
lcalc 2.1.1 h9cf73fc_0 conda-forge
lcms2 2.19.1 h0c24ade_0 conda-forge
ld_impl_linux-64 2.45.1 default_hbd61a6d_102 conda-forge
lerc 4.1.0 hdb68285_0 conda-forge
libarchive 3.8.1 gpl_h98cc613_100 conda-forge
libblas 3.11.0 6_h4a7cf45_openblas conda-forge
libboost 1.85.0 h0ccab89_4 conda-forge
libboost-devel 1.85.0 h00ab1b0_4 conda-forge
libboost-headers 1.85.0 ha770c72_4 conda-forge
libbraiding 1.3.2 hecca717_0 conda-forge
libbrial 1.2.15 hf69d4a9_0 conda-forge
libbrotlicommon 1.2.0 hb03c661_1 conda-forge
libbrotlidec 1.2.0 hb03c661_1 conda-forge
libbrotlienc 1.2.0 hb03c661_1 conda-forge
libcblas 3.11.0 6_h0358290_openblas conda-forge
libclang-cpp20.1 20.1.8 default_h99862b1_15 conda-forge
libclang13 21.1.0 default_h746c552_1 conda-forge
libcups 2.3.3 hb8b1518_5 conda-forge
libcurl 8.18.0 h4e3cde8_0 conda-forge
libdeflate 1.25 h17f619e_0 conda-forge
libdrm 2.4.125 hb03c661_1 conda-forge
libedit 3.1.20250104 pl5321h7949ede_0 conda-forge
libegl 1.7.0 ha4b6fd6_2 conda-forge
libev 4.33 hd590300_2 conda-forge
libexpat 2.7.5 hecca717_0 conda-forge
libffi 3.7.0 h81df57d_1 conda-forge
libflint 3.3.1 h9a6c01d_1 conda-forge
libfreetype 2.14.3 ha770c72_0 conda-forge
libfreetype6 2.14.3 h73754d4_0 conda-forge
libgcc 15.2.0 he0feb66_18 conda-forge
libgcc-devel_linux-64 14.3.0 hf649bbc_118 conda-forge
libgcc-ng 15.2.0 h69a702a_18 conda-forge
libgd 2.3.3 h6f5c62b_11 conda-forge
libgfortran 15.2.0 h69a702a_18 conda-forge
libgfortran-ng 15.2.0 h69a702a_18 conda-forge
libgfortran5 15.2.0 h68bc16d_18 conda-forge
libgl 1.7.0 ha4b6fd6_2 conda-forge
libglib 2.84.0 h2ff4ddf_0 conda-forge
libglvnd 1.7.0 ha4b6fd6_2 conda-forge
libglx 1.7.0 ha4b6fd6_2 conda-forge
libgomp 15.2.0 he0feb66_18 conda-forge
libhomfly 1.04 hb03c661_1 conda-forge
libiconv 1.18 h3b78370_2 conda-forge
libjpeg-turbo 3.1.4.1 hb03c661_0 conda-forge
liblapack 3.11.0 6_h47877c9_openblas conda-forge
liblapacke 3.11.0 6_h6ae95b6_openblas conda-forge
libllvm20 20.1.8 hecd9e04_0 conda-forge
libllvm21 21.1.0 hecd9e04_0 conda-forge
liblzma 5.8.3 hb03c661_0 conda-forge
liblzma-devel 5.8.3 hb03c661_0 conda-forge
libmamba 2.3.2 hae34dd5_2 conda-forge
libmambapy 2.3.2 py312h0240237_2 conda-forge
libnghttp2 1.68.1 h877daf1_0 conda-forge
libnsl 2.0.1 hb9d3cd8_1 conda-forge
libntlm 1.8 hb9d3cd8_0 conda-forge
libopenblas 0.3.32 pthreads_h94d23a6_0 conda-forge
libopengl 1.7.0 ha4b6fd6_2 conda-forge
libpciaccess 0.18 hb9d3cd8_0 conda-forge
libpng 1.6.58 h421ea60_0 conda-forge
libpq 17.7 h5c52fec_1 conda-forge
libsanitizer 14.3.0 h8f1669f_18 conda-forge
libsemigroups 2.7.4 h5fb1983_0 conda-forge
libsodium 1.0.20 h4ab18f5_0 conda-forge
libsolv 0.7.37 h9463b59_0 conda-forge
libsqlite 3.53.0 h0c1763c_0 conda-forge
libssh2 1.11.1 hcf80075_0 conda-forge
libstdcxx 15.2.0 h934c35e_18 conda-forge
libstdcxx-devel_linux-64 14.3.0 h9f08a49_118 conda-forge
libstdcxx-ng 15.2.0 hdf11a46_18 conda-forge
libtiff 4.7.1 h9d88235_1 conda-forge
libuuid 2.42.1 h5347b49_0 conda-forge
libwebp-base 1.6.0 hd42ef1d_0 conda-forge
libxcb 1.17.0 h8a09558_0 conda-forge
libxcrypt 4.4.36 hd590300_1 conda-forge
libxkbcommon 1.11.0 he8b52b9_0 conda-forge
libxml2 2.13.9 h04c0eec_0 conda-forge
libxslt 1.1.43 h7a3aeb2_0 conda-forge
libzlib 1.3.2 h25fd6f3_2 conda-forge
linbox 1.7.1 h700e6c1_3 conda-forge
line_profiler 5.0.0 pypi_0 pypi
lrcalc 2.1 hecca717_8 conda-forge
lrslib 73.a he8b4956_0 conda-forge
lz4 4.4.5 pypi_0 pypi
lz4-c 1.10.0 h5888daf_1 conda-forge
lzo 2.10 h280c20c_1002 conda-forge
m4 1.4.21 hb03c661_0 conda-forge
m4ri 20250128 h36e74d4_0 conda-forge
m4rie 20250128 h36e74d4_0 conda-forge
make 4.4.1 hb9d3cd8_2 conda-forge
markupsafe 3.0.3 py312h8a5da7c_1 conda-forge
matplotlib 3.10.9 py312h7900ff3_0 conda-forge
matplotlib-base 3.10.9 py312he3d6523_0 conda-forge
matplotlib-inline 0.2.1 pyhd8ed1ab_0 conda-forge
maxima 5.49.0 h0673e8f_1 conda-forge
mccabe 0.7.0 pyhd8ed1ab_1 conda-forge
memory-allocator 0.2.0 py312h4c3975b_1 conda-forge
menuinst 2.4.2 py312h7900ff3_0 conda-forge
meson 1.12.0 pyhcf101f3_0 conda-forge
meson-python 0.19.0 pyh7e86bf3_2 conda-forge
mistune 3.2.0 pyhcf101f3_0 conda-forge
more-itertools 11.0.2 pyhcf101f3_0 conda-forge
mpc 1.4.0 he0a73b1_0 conda-forge
mpfi 1.5.4 h9f54685_1001 conda-forge
mpfr 4.2.2 he0a73b1_0 conda-forge
mpmath 1.4.1 pyhd8ed1ab_0 conda-forge
msgpack-python 1.1.2 py312hd9148b4_1 conda-forge
munkres 1.1.4 pyhd8ed1ab_1 conda-forge
mysql-common 9.0.1 h266115a_6 conda-forge
mysql-libs 9.0.1 he0572af_6 conda-forge
nauty 2.9.1 hb03c661_0 conda-forge
nbclient 0.10.4 pyhd8ed1ab_0 conda-forge
nbconvert 7.17.1 hb502eef_0 conda-forge
nbconvert-core 7.17.1 pyhcf101f3_0 conda-forge
nbconvert-pandoc 7.17.1 h08b4883_0 conda-forge
nbformat 5.10.4 pyhd8ed1ab_1 conda-forge
ncurses 6.6 hdb14827_0 conda-forge
nest-asyncio 1.6.0 pyhd8ed1ab_1 conda-forge
networkx 3.6.1 pyhcf101f3_0 conda-forge
ninja 1.13.2 h171cf75_0 conda-forge
nlohmann_json-abi 3.12.0 h0f90c79_1 conda-forge
ntl 11.6.0 h2d42b61_0 conda-forge
numpy 2.4.3 py312h33ff503_0 conda-forge
nvidia-cublas-cu12 12.8.4.1 pypi_0 pypi
nvidia-cuda-cupti-cu12 12.8.90 pypi_0 pypi
nvidia-cuda-nvrtc-cu12 12.8.93 pypi_0 pypi
nvidia-cuda-runtime-cu12 12.8.90 pypi_0 pypi
nvidia-cudnn-cu12 9.10.2.21 pypi_0 pypi
nvidia-cufft-cu12 11.3.3.83 pypi_0 pypi
nvidia-cufile-cu12 1.13.1.3 pypi_0 pypi
nvidia-curand-cu12 10.3.9.90 pypi_0 pypi
nvidia-cusolver-cu12 11.7.3.90 pypi_0 pypi
nvidia-cusparse-cu12 12.5.8.93 pypi_0 pypi
nvidia-cusparselt-cu12 0.7.1 pypi_0 pypi
nvidia-nccl-cu12 2.27.5 pypi_0 pypi
nvidia-nvjitlink-cu12 12.8.93 pypi_0 pypi
nvidia-nvshmem-cu12 3.4.5 pypi_0 pypi
nvidia-nvtx-cu12 12.8.90 pypi_0 pypi
openblas 0.3.32 pthreads_h6ec200e_0 conda-forge
openjpeg 2.5.4 h55fea9a_0 conda-forge
openldap 2.6.10 he970967_0 conda-forge
openssl 3.6.2 h35e630c_0 conda-forge
optas 1.0.3 pypi_0 pypi
ormsgpack 1.12.2 pypi_0 pypi
osqp 1.1.0 pypi_0 pypi
packaging 26.2 pyhc364b38_0 conda-forge
paganini 1.5.0 pypi_0 pypi
palp 2.21 hb03c661_0 conda-forge
pandas 3.0.1 pypi_0 pypi
pandoc 3.9.0.2 ha770c72_0 conda-forge
pandocfilters 1.5.0 pyhd8ed1ab_0 conda-forge
pango 1.56.3 h9ac818e_1 conda-forge
pari 2.17.3 hab59ada_0_pthread conda-forge
pari-elldata 0.0.20161017 0 conda-forge
pari-galdata 0.0.20180411 0 conda-forge
pari-seadata 0.0.20090618 0 conda-forge
pari-seadata-small 0.0.20090618 0 conda-forge
parso 0.8.6 pyhcf101f3_0 conda-forge
pcre2 10.44 hc749103_2 conda-forge
perl 5.32.1 7_hd590300_perl5 conda-forge
pexpect 4.9.0 pyhd8ed1ab_1 conda-forge
pickleshare 0.7.5 pyhd8ed1ab_1004 conda-forge
pillow 12.2.0 py312h50c33e8_0 conda-forge
pip 26.0.1 pyh8b19718_0 conda-forge
pixman 0.46.4 h54a6638_1 conda-forge
pkg-config 0.29.2 h4bc722e_1009 conda-forge
pkgconfig 1.6.0 pyhd8ed1ab_0 conda-forge
pkginfo 1.12.1.2 pyhd8ed1ab_0 conda-forge
planarity 4.0.1.0 hb03c661_0 conda-forge
platformdirs 4.9.6 pyhcf101f3_0 conda-forge
pluggy 1.6.0 pyhf9edf01_1 conda-forge
ppl 1.2 h6ec01c2_1006 conda-forge
pplpy 0.9.0 py312hb0053b8_0 conda-forge
primecount 8.2 h530483c_0 conda-forge
primecountpy 0.2.1 py312h1289d80_0 conda-forge
primesieve 12.13 h54a6638_1 conda-forge
progressbar2 4.5.0 pyhd8ed1ab_1 conda-forge
prompt-toolkit 3.0.52 pyha770c72_0 conda-forge
protobuf 7.34.0 pypi_0 pypi
psutil 7.2.2 py312h5253ce2_0 conda-forge
pthread-stubs 0.4 hb9d3cd8_1002 conda-forge
ptyprocess 0.7.0 pyhd8ed1ab_1 conda-forge
pure_eval 0.2.3 pyhd8ed1ab_1 conda-forge
pyarrow 23.0.1 pypi_0 pypi
pybind11-abi 4 hd8ed1ab_3 conda-forge
pycodestyle 2.14.0 pyhd8ed1ab_0 conda-forge
pycosat 0.6.6 py312h4c3975b_3 conda-forge
pycparser 2.22 pyh29332c3_1 conda-forge
pydantic 2.13.3 pyhcf101f3_0 conda-forge
pydantic-core 2.46.3 py312h868fb18_0 conda-forge
pyflakes 3.4.0 pyhd8ed1ab_0 conda-forge
pygame 2.6.1 pypi_0 pypi
pygithub 2.9.1 pyhd8ed1ab_0 conda-forge
pygments 2.20.0 pyhd8ed1ab_0 conda-forge
pyjwt 2.12.1 pyhcf101f3_0 conda-forge
pynacl 1.6.2 py312h4c3975b_0 conda-forge
pyparsing 3.3.2 pyhcf101f3_0 conda-forge
pyproject-metadata 0.11.0 pyhd8ed1ab_0 conda-forge
pyproject_hooks 1.2.0 pyhd8ed1ab_1 conda-forge
pyside6 6.9.0 py312h91f0f75_0 conda-forge
pysocks 1.7.1 pyha55dd90_7 conda-forge
pytest 9.0.3 pyhc364b38_1 conda-forge
pytest-xdist 3.8.0 pyhd8ed1ab_0 conda-forge
python 3.12.9 h9e4cc4f_1_cpython conda-forge
python-build 1.4.4 pyhc364b38_0 conda-forge
python-dateutil 2.9.0.post0 pyhe01879c_2 conda-forge
python-fastjsonschema 2.21.2 pyhe01879c_0 conda-forge
python-gil 3.12.13 hd8ed1ab_0 conda-forge
python-installer 0.7.0 pyhff2d567_1 conda-forge
python-lrcalc 2.1 py312h1289d80_8 conda-forge
python-symengine 0.14.1 py312h9d513f5_1 conda-forge
python-utils 3.9.1 pyhff2d567_1 conda-forge
python_abi 3.12 8_cp312 conda-forge
pytz 2026.1.post1 pyhcf101f3_0 conda-forge
pyyaml 6.0.3 py312h8a5da7c_1 conda-forge
pyzmq 27.1.0 py312hda471dd_2 conda-forge
qd 2.3.22 h2cc385e_1004 conda-forge
qhull 2020.2 h434a139_5 conda-forge
qt6-main 6.9.0 h6441bc3_0 conda-forge
r-base 4.2.3 h764d534_18 conda-forge
r-lattice 0.22_6 r42h57805ef_0 conda-forge
rapidfuzz 3.14.5 py312h1289d80_0 conda-forge
ray 2.54.0 pypi_0 pypi
readline 8.3 h853b02a_0 conda-forge
referencing 0.37.0 pyhcf101f3_0 conda-forge
reproc 14.2.7.post0 hb03c661_0 conda-forge
reproc-cpp 14.2.7.post0 hecca717_0 conda-forge
requests 2.33.1 pyhcf101f3_1 conda-forge
requests-toolbelt 1.0.0 pyhd8ed1ab_1 conda-forge
restructuredtext_lint 2.0.2 pyhd8ed1ab_0 conda-forge
roman-numerals 4.1.0 pyhd8ed1ab_0 conda-forge
roman-numerals-py 3.1.0 pyhd8ed1ab_0 conda-forge
rpds-py 0.30.0 py312h868fb18_0 conda-forge
rpy2 3.5.11 py312r42hc7c0aa3_3 conda-forge
ruamel.yaml 0.18.17 py312h5253ce2_2 conda-forge
ruamel.yaml.clib 0.2.15 py312h5253ce2_1 conda-forge
ruamel.yaml.jinja2 0.2.7 pyhd8ed1ab_1 conda-forge
ruff 0.15.11 h7805a7d_0 conda-forge
rw 0.9 hd590300_2 conda-forge
sage-docbuild 10.9b9 pypi_0 pypi
sagemath 10.10b3 pypi_0 pypi
sagemath-db-elliptic-curves 0.8.1 hecc5488_0 conda-forge
sagemath-db-graphs 20210214 hd8ed1ab_0 conda-forge
sagemath-db-polytopes 20170220 1 conda-forge
scipy 1.17.1 py312h54fa4ab_0 conda-forge
scs 3.2.11 pypi_0 pypi
secretstorage 3.4.1 py312h7900ff3_0 conda-forge
sed 4.10 h19d0853_0 conda-forge
semver 3.0.4 pyhcf101f3_1 conda-forge
setuptools 82.0.1 pyh332efcf_0 conda-forge
shellingham 1.5.4 pyhd8ed1ab_2 conda-forge
simdjson 4.0.7 hb700be7_0 conda-forge
simplegeneric 0.8.1 pyhd8ed1ab_2 conda-forge
singular 4.4.1.p5 h0d6ddee_0 conda-forge
sirocco 2.1.1 ha2cd14c_0 conda-forge
six 1.17.0 pyhe01879c_1 conda-forge
smmap 5.0.3 pyhd8ed1ab_0 conda-forge
snowballstemmer 3.0.1 pyhd8ed1ab_0 conda-forge
soupsieve 2.8.3 pyhd8ed1ab_0 conda-forge
sphinx 9.1.0 pyhd8ed1ab_0 conda-forge
sphinx-basic-ng 1.0.0b2 pyhd8ed1ab_3 conda-forge
sphinx-copybutton 0.5.2 pyhd8ed1ab_1 conda-forge
sphinx-inline-tabs 2025.12.21.14 pyhd8ed1ab_0 conda-forge
sphinxcontrib-applehelp 2.0.0 pyhd8ed1ab_1 conda-forge
sphinxcontrib-devhelp 2.0.0 pyhd8ed1ab_1 conda-forge
sphinxcontrib-htmlhelp 2.1.0 pyhd8ed1ab_1 conda-forge
sphinxcontrib-jsmath 1.0.1 pyhd8ed1ab_1 conda-forge
sphinxcontrib-qthelp 2.0.0 pyhd8ed1ab_1 conda-forge
sphinxcontrib-serializinghtml 1.1.10 pyhd8ed1ab_1 conda-forge
sqlite 3.53.0 hbc0de68_0 conda-forge
stack_data 0.6.3 pyhd8ed1ab_1 conda-forge
stdlib-list 0.12.0 pyhd8ed1ab_0 conda-forge
symengine 0.14.0 h0508f04_2 conda-forge
symmetrica 3.1.0 hb03c661_0 conda-forge
sympow 2.023.7 h0416e17_0 conda-forge
sympy 1.14.0 pyh2585a3b_106 conda-forge
sysroot_linux-64 2.39 hc4b9eeb_6 conda-forge
tachyon 0.99b6 hba7d16a_1002 conda-forge
tensorboardX 2.6.4 pypi_0 pypi
tinycss2 1.4.0 pyhd8ed1ab_0 conda-forge
tk 8.6.13 noxft_h366c992_103 conda-forge
tktable 2.10 h5a7a40f_8 conda-forge
toml 0.10.2 pyhd8ed1ab_1 conda-forge
tomli 2.4.1 pyhcf101f3_0 conda-forge
tomli-w 1.2.0 pyhd8ed1ab_0 conda-forge
tomlkit 0.14.0 pyha770c72_0 conda-forge
torch 2.10.0 pypi_0 pypi
tornado 6.5.5 py312h4c3975b_0 conda-forge
tqdm 4.67.3 pyh8f84b5b_0 conda-forge
traitlets 5.14.3 pyhd8ed1ab_1 conda-forge
triton 3.6.0 pypi_0 pypi
trove-classifiers 2026.4.28.13 pyhd8ed1ab_0 conda-forge
truststore 0.10.4 pyhcf101f3_0 conda-forge
ty 0.0.33 h4e94fc0_0 conda-forge
typing-extensions 4.15.0 h396c80c_0 conda-forge
typing-inspection 0.4.2 pyhcf101f3_2 conda-forge
typing_extensions 4.15.0 pyhcf101f3_0 conda-forge
tzdata 2025c hc9c84f9_1 conda-forge
tzlocal 5.3.1 pyh8f84b5b_0 conda-forge
unicodedata2 17.0.1 py312h4c3975b_0 conda-forge
urllib3 2.6.3 pyhd8ed1ab_0 conda-forge
usainboltz 0.2.1 pypi_0 pypi
uv 0.11.8 h29f5ae7_0 conda-forge
virtualenv 20.39.0 pyhcf101f3_0 conda-forge
wayland 1.23.1 h3e06ad9_0 conda-forge
wcwidth 0.6.0 pyhd8ed1ab_0 conda-forge
webencodings 0.5.1 pyhd8ed1ab_3 conda-forge
wheel 0.47.0 pyhd8ed1ab_0 conda-forge
widgetsnbextension 4.0.15 pyhd8ed1ab_0 conda-forge
wrapt 2.1.2 py312h4c3975b_0 conda-forge
xcb-util 0.4.1 h4f16b4b_2 conda-forge
xcb-util-cursor 0.1.6 hb03c661_0 conda-forge
xcb-util-image 0.4.0 hb711507_2 conda-forge
xcb-util-keysyms 0.4.1 hb711507_0 conda-forge
xcb-util-renderutil 0.3.10 hb711507_0 conda-forge
xcb-util-wm 0.4.2 hb711507_0 conda-forge
xkeyboard-config 2.47 hb03c661_0 conda-forge
xorg-libice 1.1.2 hb9d3cd8_0 conda-forge
xorg-libsm 1.2.6 he73a12e_0 conda-forge
xorg-libx11 1.8.13 he1eb515_0 conda-forge
xorg-libxau 1.0.12 hb03c661_1 conda-forge
xorg-libxcomposite 0.4.7 hb03c661_0 conda-forge
xorg-libxcursor 1.2.3 hb9d3cd8_0 conda-forge
xorg-libxdamage 1.1.6 hb9d3cd8_0 conda-forge
xorg-libxdmcp 1.1.5 hb03c661_1 conda-forge
xorg-libxext 1.3.7 hb03c661_0 conda-forge
xorg-libxfixes 6.0.2 hb03c661_0 conda-forge
xorg-libxi 1.8.2 hb9d3cd8_0 conda-forge
xorg-libxrandr 1.5.5 hb03c661_0 conda-forge
xorg-libxrender 0.9.12 hb9d3cd8_0 conda-forge
xorg-libxt 1.3.1 hb9d3cd8_0 conda-forge
xorg-libxtst 1.2.5 hb9d3cd8_3 conda-forge
xorg-libxxf86vm 1.1.7 hb03c661_0 conda-forge
xz 5.8.3 ha02ee65_0 conda-forge
xz-gpl-tools 5.8.3 ha02ee65_0 conda-forge
xz-tools 5.8.3 hb03c661_0 conda-forge
yaml 0.2.5 h280c20c_3 conda-forge
yaml-cpp 0.8.0 h3f2d84a_0 conda-forge
zeromq 4.3.5 h387f397_9 conda-forge
zipp 3.23.1 pyhcf101f3_0 conda-forge
zlib 1.3.2 h25fd6f3_2 conda-forge
zlib-ng 2.3.3 hceb46e0_1 conda-forge
zstandard 0.25.0 py312h5253ce2_1 conda-forge
zstd 1.5.7 hb78ec9c_6 conda-forge