sage 5.6.beta1 build error (mercurial-2.2.2.p0) on OS X 10.8.2

185 views
Skip to first unread message

Robert Zeier

unread,
Dec 30, 2012, 1:11:14 PM12/30/12
to sage-...@googlegroups.com
I am trying to build sage 5.6.beta1 from source,
but mercurial does not build. (The same problem
also applies to sage 5.5) Xcode 4.5.2 is installed.
I change the PATH variable due to macports.
The following build options are used:

PATH=/usr/bin:/bin:/usr/sbin:/sbin:/usr/local/bin:/opt/X11/bin
export SAGE_PARALLEL_SPKG_BUILD="no"
export MAKE="make -j8"
export SAGE64="yes"
export SAGE_CHECK="yes"
caffeinate -s make

Please find below a larger part of the logfile
for the failed build of sage 5.6.beta1.

Thanks!

Best regards,

Robert Zeier


C compiler: gcc
C compiler version:
Es werden eingebaute Spezifikationen verwendet.
COLLECT_GCC=gcc
COLLECT_LTO_WRAPPER=/opt/sage/sage-5.6.beta1/local/libexec/gcc/x86_64-apple-darwin12.2.1/4.6.3/lto-wrapper
Ziel: x86_64-apple-darwin12.2.1
Konfiguriert mit: ../src/configure
--prefix=/opt/sage/sage-5.6.beta1/local
--with-local-prefix=/opt/sage/sage-5.6.beta1/local
--with-gmp=/opt/sage/sage-5.6.beta1/local
--with-mpfr=/opt/sage/sage-5.6.beta1/local
--with-mpc=/opt/sage/sage-5.6.beta1/local --with-system-zlib
--disable-multilib --enable-checking=yes
Thread-Modell: posix
gcc-Version 4.6.3 (GCC)
****************************************************
Compiling Mercurial as 64-bit
patching file mercurial/scmutil.py
running install
running build
running build_mo
warning: hgbuildmo: could not find msgfmt executable, no translations
will be built

running build_ext
building 'mercurial.base85' extension
creating build
creating build/temp.macosx-10.8-x86_64-2.7
creating build/temp.macosx-10.8-x86_64-2.7/mercurial
gcc -DNDEBUG -g -O3 -Wall -Wstrict-prototypes -O2 -g -m64
-I/opt/sage/sage-5.6.beta1/local/include/python2.7 -c mercurial/base85.c
-o build/temp.macosx-10.8-x86_64-2.7/mercurial/base85.o
creating build/lib.macosx-10.8-x86_64-2.7
creating build/lib.macosx-10.8-x86_64-2.7/mercurial
gcc -bundle -undefined dynamic_lookup
-L/opt/sage/sage-5.6.beta1/local/lib -O2 -g -m64
build/temp.macosx-10.8-x86_64-2.7/mercurial/base85.o -o
build/lib.macosx-10.8-x86_64-2.7/mercurial/base85.so
building 'mercurial.bdiff' extension
gcc -DNDEBUG -g -O3 -Wall -Wstrict-prototypes -O2 -g -m64
-I/opt/sage/sage-5.6.beta1/local/include/python2.7 -c mercurial/bdiff.c
-o build/temp.macosx-10.8-x86_64-2.7/mercurial/bdiff.o
gcc -bundle -undefined dynamic_lookup
-L/opt/sage/sage-5.6.beta1/local/lib -O2 -g -m64
build/temp.macosx-10.8-x86_64-2.7/mercurial/bdiff.o -o
build/lib.macosx-10.8-x86_64-2.7/mercurial/bdiff.so
building 'mercurial.diffhelpers' extension
gcc -DNDEBUG -g -O3 -Wall -Wstrict-prototypes -O2 -g -m64
-I/opt/sage/sage-5.6.beta1/local/include/python2.7 -c
mercurial/diffhelpers.c -o
build/temp.macosx-10.8-x86_64-2.7/mercurial/diffhelpers.o
gcc -bundle -undefined dynamic_lookup
-L/opt/sage/sage-5.6.beta1/local/lib -O2 -g -m64
build/temp.macosx-10.8-x86_64-2.7/mercurial/diffhelpers.o -o
build/lib.macosx-10.8-x86_64-2.7/mercurial/diffhelpers.so
building 'mercurial.mpatch' extension
gcc -DNDEBUG -g -O3 -Wall -Wstrict-prototypes -O2 -g -m64
-I/opt/sage/sage-5.6.beta1/local/include/python2.7 -c mercurial/mpatch.c
-o build/temp.macosx-10.8-x86_64-2.7/mercurial/mpatch.o
gcc -bundle -undefined dynamic_lookup
-L/opt/sage/sage-5.6.beta1/local/lib -O2 -g -m64
build/temp.macosx-10.8-x86_64-2.7/mercurial/mpatch.o -o
build/lib.macosx-10.8-x86_64-2.7/mercurial/mpatch.so
building 'mercurial.parsers' extension
gcc -DNDEBUG -g -O3 -Wall -Wstrict-prototypes -O2 -g -m64
-I/opt/sage/sage-5.6.beta1/local/include/python2.7 -c
mercurial/parsers.c -o build/temp.macosx-10.8-x86_64-2.7/mercurial/parsers.o
mercurial/parsers.c: In Funktion »module_init«:
mercurial/parsers.c:1157:2: Warnung: Dereferenzierung eines
Type-Pun-Zeigers verletzt strict-aliasing-Regeln [-Wstrict-aliasing]
gcc -bundle -undefined dynamic_lookup
-L/opt/sage/sage-5.6.beta1/local/lib -O2 -g -m64
build/temp.macosx-10.8-x86_64-2.7/mercurial/parsers.o -o
build/lib.macosx-10.8-x86_64-2.7/mercurial/parsers.so
building 'mercurial.osutil' extension
gcc -DNDEBUG -g -O3 -Wall -Wstrict-prototypes -O2 -g -m64
-I/opt/sage/sage-5.6.beta1/local/include/python2.7 -c mercurial/osutil.c
-o build/temp.macosx-10.8-x86_64-2.7/mercurial/osutil.o
In file included from
/System/Library/Frameworks/Foundation.framework/Headers/NSObject.h:5:0,
from /usr/include/os/object.h:74,
from /usr/include/dispatch/dispatch.h:48,
from
/System/Library/Frameworks/CoreFoundation.framework/Headers/CFMessagePort.h:11,
from
/System/Library/Frameworks/CoreFoundation.framework/Headers/CoreFoundation.h:68,
from
/System/Library/Frameworks/CoreServices.framework/Frameworks/CarbonCore.framework/Headers/CarbonCore.h:18,
from
/System/Library/Frameworks/CoreServices.framework/Frameworks/AE.framework/Headers/AE.h:20,
from
/System/Library/Frameworks/CoreServices.framework/Headers/CoreServices.h:18,
from
/System/Library/Frameworks/ApplicationServices.framework/Headers/ApplicationServices.h:24,
from mercurial/osutil.c:523:
/System/Library/Frameworks/Foundation.framework/Headers/NSObjCRuntime.h:409:1:
Fehler: verirrtes »@« im Programm
/System/Library/Frameworks/Foundation.framework/Headers/NSObjCRuntime.h:409:2:
Fehler: unbekannter Typname: »class«
/System/Library/Frameworks/Foundation.framework/Headers/NSObjCRuntime.h:411:28:
Fehler: expected »=«, »,«, »;«, »asm« or »__attribute__« before »*« token
/System/Library/Frameworks/Foundation.framework/Headers/NSObjCRuntime.h:412:44:
Fehler: expected declaration specifiers or »...« before »NSString«
/System/Library/Frameworks/Foundation.framework/Headers/NSObjCRuntime.h:414:28:
Fehler: expected »=«, »,«, »;«, »asm« or »__attribute__« before »*« token
/System/Library/Frameworks/Foundation.framework/Headers/NSObjCRuntime.h:415:43:
Fehler: expected declaration specifiers or »...« before »NSString«
/System/Library/Frameworks/Foundation.framework/Headers/NSObjCRuntime.h:417:28:
Fehler: expected »=«, »,«, »;«, »asm« or »__attribute__« before »*« token
/System/Library/Frameworks/Foundation.framework/Headers/NSObjCRuntime.h:418:28:
Fehler: expected »=«, »,«, »;«, »asm« or »__attribute__« before »*« token
/System/Library/Frameworks/Foundation.framework/Headers/NSObjCRuntime.h:422:30:
Fehler: expected declaration specifiers or »...« before »NSString«
/System/Library/Frameworks/Foundation.framework/Headers/NSObjCRuntime.h:423:31:
Fehler: expected declaration specifiers or »...« before »NSString«
In file included from
/System/Library/Frameworks/Foundation.framework/Headers/NSObject.h:6:0,
from /usr/include/os/object.h:74,
from /usr/include/dispatch/dispatch.h:48,
from
/System/Library/Frameworks/CoreFoundation.framework/Headers/CFMessagePort.h:11,
from
/System/Library/Frameworks/CoreFoundation.framework/Headers/CoreFoundation.h:68,
from
/System/Library/Frameworks/CoreServices.framework/Frameworks/CarbonCore.framework/Headers/CarbonCore.h:18,
from
/System/Library/Frameworks/CoreServices.framework/Frameworks/AE.framework/Headers/AE.h:20,
from
/System/Library/Frameworks/CoreServices.framework/Headers/CoreServices.h:18,
from
/System/Library/Frameworks/ApplicationServices.framework/Headers/ApplicationServices.h:24,
from mercurial/osutil.c:523:
/System/Library/Frameworks/Foundation.framework/Headers/NSZone.h:8:1:
Fehler: verirrtes »@« im Programm
/System/Library/Frameworks/Foundation.framework/Headers/NSZone.h:8:2:
Fehler: unbekannter Typname: »class«
/System/Library/Frameworks/Foundation.framework/Headers/NSZone.h:16:52:
Fehler: expected declaration specifiers or »...« before »NSString«
/System/Library/Frameworks/Foundation.framework/Headers/NSZone.h:17:28:
Fehler: expected »=«, »,«, »;«, »asm« or »__attribute__« before »*« token
In file included from /usr/include/os/object.h:74:0,
from /usr/include/dispatch/dispatch.h:48,
from
/System/Library/Frameworks/CoreFoundation.framework/Headers/CFMessagePort.h:11,
from
/System/Library/Frameworks/CoreFoundation.framework/Headers/CoreFoundation.h:68,
from
/System/Library/Frameworks/CoreServices.framework/Frameworks/CarbonCore.framework/Headers/CarbonCore.h:18,
from
/System/Library/Frameworks/CoreServices.framework/Frameworks/AE.framework/Headers/AE.h:20,
from
/System/Library/Frameworks/CoreServices.framework/Headers/CoreServices.h:18,
from
/System/Library/Frameworks/ApplicationServices.framework/Headers/ApplicationServices.h:24,
from mercurial/osutil.c:523:
/System/Library/Frameworks/Foundation.framework/Headers/NSObject.h:8:1:
Fehler: verirrtes »@« im Programm
/System/Library/Frameworks/Foundation.framework/Headers/NSObject.h:8:2:
Fehler: unbekannter Typname: »class«
/System/Library/Frameworks/Foundation.framework/Headers/NSObject.h:9:1:
Fehler: verirrtes »@« im Programm
/System/Library/Frameworks/Foundation.framework/Headers/NSObject.h:9:2:
Fehler: unbekannter Typname: »class«
/System/Library/Frameworks/Foundation.framework/Headers/NSObject.h:13:1:
Fehler: verirrtes »@« im Programm
/System/Library/Frameworks/Foundation.framework/Headers/NSObject.h:13:2:
Fehler: unbekannter Typname: »protocol«
/System/Library/Frameworks/Foundation.framework/Headers/NSObject.h:15:1:
Fehler: expected »=«, »,«, »;«, »asm« or »__attribute__« before »-« token
/System/Library/Frameworks/Foundation.framework/Headers/NSObject.h:16:1:
Fehler: expected identifier or »(« before »-« token
/System/Library/Frameworks/Foundation.framework/Headers/NSObject.h:18:1:
Fehler: expected identifier or »(« before »-« token
/System/Library/Frameworks/Foundation.framework/Headers/NSObject.h:19:1:
Fehler: expected identifier or »(« before »-« token
/System/Library/Frameworks/Foundation.framework/Headers/NSObject.h:20:1:
Fehler: expected identifier or »(« before »-« token
/System/Library/Frameworks/Foundation.framework/Headers/NSObject.h:21:1:
Fehler: expected identifier or »(« before »-« token
/System/Library/Frameworks/Foundation.framework/Headers/NSObject.h:23:1:
Fehler: expected identifier or »(« before »-« token
/System/Library/Frameworks/Foundation.framework/Headers/NSObject.h:24:1:
Fehler: expected identifier or »(« before »-« token
/System/Library/Frameworks/Foundation.framework/Headers/NSObject.h:25:1:
Fehler: expected identifier or »(« before »-« token
/System/Library/Frameworks/Foundation.framework/Headers/NSObject.h:27:1:
Fehler: expected identifier or »(« before »-« token
/System/Library/Frameworks/Foundation.framework/Headers/NSObject.h:29:1:
Fehler: expected identifier or »(« before »-« token
/System/Library/Frameworks/Foundation.framework/Headers/NSObject.h:30:1:
Fehler: expected identifier or »(« before »-« token
/System/Library/Frameworks/Foundation.framework/Headers/NSObject.h:31:1:
Fehler: expected identifier or »(« before »-« token
/System/Library/Frameworks/Foundation.framework/Headers/NSObject.h:33:1:
Fehler: expected identifier or »(« before »-« token
/System/Library/Frameworks/Foundation.framework/Headers/NSObject.h:35:1:
Fehler: expected identifier or »(« before »-« token
/System/Library/Frameworks/Foundation.framework/Headers/NSObject.h:36:1:
Fehler: expected identifier or »(« before »-« token
/System/Library/Frameworks/Foundation.framework/Headers/NSObject.h:37:1:
Fehler: expected identifier or »(« before »-« token
/System/Library/Frameworks/Foundation.framework/Headers/NSObject.h:38:1:
Fehler: expected identifier or »(« before »-« token
/System/Library/Frameworks/Foundation.framework/Headers/NSObject.h:40:1:
Fehler: expected identifier or »(« before »-« token
/System/Library/Frameworks/Foundation.framework/Headers/NSObject.h:41:1:
Fehler: verirrtes »@« im Programm
/System/Library/Frameworks/Foundation.framework/Headers/NSObject.h:42:1:
Fehler: expected »=«, »,«, »;«, »asm« or »__attribute__« before »-« token
/System/Library/Frameworks/Foundation.framework/Headers/NSObject.h:44:1:
Fehler: verirrtes »@« im Programm
/System/Library/Frameworks/Foundation.framework/Headers/NSObject.h:46:1:
Fehler: verirrtes »@« im Programm
/System/Library/Frameworks/Foundation.framework/Headers/NSObject.h:44:2:
Fehler: unbekannter Typname: »end«
/System/Library/Frameworks/Foundation.framework/Headers/NSObject.h:46:11: Fehler:
expected »=«, »,«, »;«, »asm« or »__attribute__« before »NSCopying«
/System/Library/Frameworks/Foundation.framework/Headers/NSObject.h:50:1:
Fehler: verirrtes »@« im Programm
/System/Library/Frameworks/Foundation.framework/Headers/NSObject.h:52:1:
Fehler: verirrtes »@« im Programm
/System/Library/Frameworks/Foundation.framework/Headers/NSObject.h:50:2:
Fehler: unbekannter Typname: »end«
/System/Library/Frameworks/Foundation.framework/Headers/NSObject.h:52:11: Fehler:
expected »=«, »,«, »;«, »asm« or »__attribute__« before »NSMutableCopying«
/System/Library/Frameworks/Foundation.framework/Headers/NSObject.h:56:1:
Fehler: verirrtes »@« im Programm
/System/Library/Frameworks/Foundation.framework/Headers/NSObject.h:58:1:
Fehler: verirrtes »@« im Programm
/System/Library/Frameworks/Foundation.framework/Headers/NSObject.h:56:2:
Fehler: unbekannter Typname: »end«
/System/Library/Frameworks/Foundation.framework/Headers/NSObject.h:58:11: Fehler:
expected »=«, »,«, »;«, »asm« or »__attribute__« before »NSCoding«
/System/Library/Frameworks/Foundation.framework/Headers/NSObject.h:61:1:
Fehler: expected identifier or »(« before »-« token
/System/Library/Frameworks/Foundation.framework/Headers/NSObject.h:63:1:
Fehler: verirrtes »@« im Programm
In file included from /usr/include/os/object.h:74:0,
from /usr/include/dispatch/dispatch.h:48,
from
/System/Library/Frameworks/CoreFoundation.framework/Headers/CFMessagePort.h:11,
from
/System/Library/Frameworks/CoreFoundation.framework/Headers/CoreFoundation.h:68,
from
/System/Library/Frameworks/CoreServices.framework/Frameworks/CarbonCore.framework/Headers/CarbonCore.h:18,
from
/System/Library/Frameworks/CoreServices.framework/Frameworks/AE.framework/Headers/AE.h:20,
from
/System/Library/Frameworks/CoreServices.framework/Headers/CoreServices.h:18,
from
/System/Library/Frameworks/ApplicationServices.framework/Headers/ApplicationServices.h:24,
from mercurial/osutil.c:523:
/System/Library/Frameworks/Foundation.framework/Headers/NSObject.h:66:1:
Fehler: verirrtes »@« im Programm
/System/Library/Frameworks/Foundation.framework/Headers/NSObject.h:63:2:
Fehler: unbekannter Typname: »end«
/System/Library/Frameworks/Foundation.framework/Headers/NSObject.h:66:11: Fehler:
expected »=«, »,«, »;«, »asm« or »__attribute__« before »NSSecureCoding«
/System/Library/Frameworks/Foundation.framework/Headers/NSObject.h:67:1:
Fehler: verirrtes »@« im Programm
/System/Library/Frameworks/Foundation.framework/Headers/NSObject.h:71:1:
Fehler: verirrtes »@« im Programm
/System/Library/Frameworks/Foundation.framework/Headers/NSObject.h:76:1:
Fehler: verirrtes »@« im Programm
/System/Library/Frameworks/Foundation.framework/Headers/NSObject.h:71:2:
Fehler: unbekannter Typname: »end«
/System/Library/Frameworks/Foundation.framework/Headers/NSObject.h:76:12: Fehler:
expected »=«, »,«, »;«, »asm« or »__attribute__« before »NSObject«
/System/Library/Frameworks/Foundation.framework/Headers/NSObject.h:80:1:
Fehler: expected identifier or »(« before »+« token
/System/Library/Frameworks/Foundation.framework/Headers/NSObject.h:82:1:
Fehler: expected identifier or »(« before »+« token
/System/Library/Frameworks/Foundation.framework/Headers/NSObject.h:83:1:
Fehler: expected identifier or »(« before »-« token
/System/Library/Frameworks/Foundation.framework/Headers/NSObject.h:85:1:
Fehler: expected identifier or »(« before »+« token
/System/Library/Frameworks/Foundation.framework/Headers/NSObject.h:86:1:
Fehler: expected identifier or »(« before »+« token
/System/Library/Frameworks/Foundation.framework/Headers/NSObject.h:87:1:
Fehler: expected identifier or »(« before »+« token
/System/Library/Frameworks/Foundation.framework/Headers/NSObject.h:88:1:
Fehler: expected identifier or »(« before »-« token
/System/Library/Frameworks/Foundation.framework/Headers/NSObject.h:90:1:
Fehler: expected identifier or »(« before »-« token
/System/Library/Frameworks/Foundation.framework/Headers/NSObject.h:92:1:
Fehler: expected identifier or »(« before »-« token
/System/Library/Frameworks/Foundation.framework/Headers/NSObject.h:93:1:
Fehler: expected identifier or »(« before »-« token
/System/Library/Frameworks/Foundation.framework/Headers/NSObject.h:95:1:
Fehler: expected identifier or »(« before »+« token
/System/Library/Frameworks/Foundation.framework/Headers/NSObject.h:96:1:
Fehler: expected identifier or »(« before »+« token
/System/Library/Frameworks/Foundation.framework/Headers/NSObject.h:98:1:
Fehler: expected identifier or »(« before »+« token
/System/Library/Frameworks/Foundation.framework/Headers/NSObject.h:99:1:
Fehler: expected identifier or »(« before »+« token
/System/Library/Frameworks/Foundation.framework/Headers/NSObject.h:100:1: Fehler:
expected identifier or »(« before »+« token
/System/Library/Frameworks/Foundation.framework/Headers/NSObject.h:101:1: Fehler:
expected identifier or »(« before »+« token
/System/Library/Frameworks/Foundation.framework/Headers/NSObject.h:102:1: Fehler:
expected identifier or »(« before »-« token
/System/Library/Frameworks/Foundation.framework/Headers/NSObject.h:103:1: Fehler:
expected identifier or »(« before »+« token
/System/Library/Frameworks/Foundation.framework/Headers/NSObject.h:104:1: Fehler:
expected identifier or »(« before »-« token
/System/Library/Frameworks/Foundation.framework/Headers/NSObject.h:106:1: Fehler:
expected identifier or »(« before »-« token
/System/Library/Frameworks/Foundation.framework/Headers/NSObject.h:107:1: Fehler:
expected identifier or »(« before »-« token
/System/Library/Frameworks/Foundation.framework/Headers/NSObject.h:108:1: Fehler:
expected identifier or »(« before »-« token
/System/Library/Frameworks/Foundation.framework/Headers/NSObject.h:110:1: Fehler:
expected identifier or »(« before »+« token
/System/Library/Frameworks/Foundation.framework/Headers/NSObject.h:112:1: Fehler:
expected identifier or »(« before »-« token
/System/Library/Frameworks/Foundation.framework/Headers/NSObject.h:113:1: Fehler:
expected identifier or »(« before »-« token
/System/Library/Frameworks/Foundation.framework/Headers/NSObject.h:115:1: Fehler:
expected identifier or »(« before »+« token
/System/Library/Frameworks/Foundation.framework/Headers/NSObject.h:117:1: Fehler:
expected identifier or »(« before »+« token
/System/Library/Frameworks/Foundation.framework/Headers/NSObject.h:119:1: Fehler:
expected identifier or »(« before »+« token
/System/Library/Frameworks/Foundation.framework/Headers/NSObject.h:120:1: Fehler:
expected identifier or »(« before »+« token
/System/Library/Frameworks/Foundation.framework/Headers/NSObject.h:122:1: Fehler:
verirrtes »@« im Programm
/System/Library/Frameworks/Foundation.framework/Headers/NSObject.h:124:1: Fehler:
verirrtes »@« im Programm
/System/Library/Frameworks/Foundation.framework/Headers/NSObject.h:122:2: Fehler:
unbekannter Typname: »end«
/System/Library/Frameworks/Foundation.framework/Headers/NSObject.h:124:12:
Fehler: expected »=«, »,«, »;«, »asm« or »__attribute__« before »NSObject«
/System/Library/Frameworks/Foundation.framework/Headers/NSObject.h:127:1: Fehler:
expected identifier or »(« before »+« token
/System/Library/Frameworks/Foundation.framework/Headers/NSObject.h:128:1: Fehler:
expected identifier or »(« before »-« token
/System/Library/Frameworks/Foundation.framework/Headers/NSObject.h:129:1: Fehler:
expected identifier or »(« before »-« token
/System/Library/Frameworks/Foundation.framework/Headers/NSObject.h:130:1: Fehler:
expected identifier or »(« before »-« token
/System/Library/Frameworks/Foundation.framework/Headers/NSObject.h:132:1: Fehler:
verirrtes »@« im Programm
/System/Library/Frameworks/Foundation.framework/Headers/NSObject.h:135:1: Fehler:
verirrtes »@« im Programm
/System/Library/Frameworks/Foundation.framework/Headers/NSObject.h:132:2: Fehler:
unbekannter Typname: »end«
/System/Library/Frameworks/Foundation.framework/Headers/NSObject.h:135:12:
Fehler: expected »=«, »,«, »;«, »asm« or »__attribute__« before »NSObject«
/System/Library/Frameworks/Foundation.framework/Headers/NSObject.h:143:1: Fehler:
verirrtes »@« im Programm
/System/Library/Frameworks/Foundation.framework/Headers/NSObject.h:149:1: Fehler:
verirrtes »@« im Programm
/System/Library/Frameworks/Foundation.framework/Headers/NSObject.h:143:2: Fehler:
unbekannter Typname: »end«
/System/Library/Frameworks/Foundation.framework/Headers/NSObject.h:149:11:
Fehler: expected »=«, »,«, »;«, »asm« or »__attribute__« before
»NSDiscardableContent«
/System/Library/Frameworks/Foundation.framework/Headers/NSObject.h:150:1: Fehler:
verirrtes »@« im Programm
/System/Library/Frameworks/Foundation.framework/Headers/NSObject.h:149:11:
Fehler: unbekannter Typname: »NSDiscardableContent«
/System/Library/Frameworks/Foundation.framework/Headers/NSObject.h:152:1: Fehler:
expected identifier or »(« before »-« token
/System/Library/Frameworks/Foundation.framework/Headers/NSObject.h:153:1: Fehler:
expected identifier or »(« before »-« token
/System/Library/Frameworks/Foundation.framework/Headers/NSObject.h:154:1: Fehler:
expected identifier or »(« before »-« token
/System/Library/Frameworks/Foundation.framework/Headers/NSObject.h:155:1: Fehler:
verirrtes »@« im Programm
/System/Library/Frameworks/Foundation.framework/Headers/NSObject.h:157:1: Fehler:
verirrtes »@« im Programm
/System/Library/Frameworks/Foundation.framework/Headers/NSObject.h:155:2: Fehler:
unbekannter Typname: »end«
/System/Library/Frameworks/Foundation.framework/Headers/NSObject.h:157:12:
Fehler: expected »=«, »,«, »;«, »asm« or »__attribute__« before »NSObject«
/System/Library/Frameworks/Foundation.framework/Headers/NSObject.h:159:1: Fehler:
verirrtes »@« im Programm
/System/Library/Frameworks/Foundation.framework/Headers/NSObject.h:164:1: Fehler:
expected »=«, »,«, »;«, »asm« or »__attribute__« before »extern«
/System/Library/Frameworks/Foundation.framework/Headers/NSObject.h: In
Funktion »CFBridgingRelease«:
/System/Library/Frameworks/Foundation.framework/Headers/NSObject.h:198:12:
Fehler: expected expression before »[« token
In file included from /usr/include/dispatch/dispatch.h:50:0,
from
/System/Library/Frameworks/CoreFoundation.framework/Headers/CFMessagePort.h:11,
from
/System/Library/Frameworks/CoreFoundation.framework/Headers/CoreFoundation.h:68,
from
/System/Library/Frameworks/CoreServices.framework/Frameworks/CarbonCore.framework/Headers/CarbonCore.h:18,
from
/System/Library/Frameworks/CoreServices.framework/Frameworks/AE.framework/Headers/AE.h:20,
from
/System/Library/Frameworks/CoreServices.framework/Headers/CoreServices.h:18,
from
/System/Library/Frameworks/ApplicationServices.framework/Headers/ApplicationServices.h:24,
from mercurial/osutil.c:523:
/usr/include/dispatch/object.h: Auf höchster Ebene:
/usr/include/dispatch/object.h:49:1: Fehler: verirrtes »@« im Programm
/usr/include/dispatch/object.h:49:1: Fehler: unbekannter Typname: »protocol«
/usr/include/dispatch/object.h:49:1: Fehler: verirrtes »@« im Programm
/usr/include/dispatch/object.h:49:1: Fehler: expected »=«, »,«, »;«,
»asm« or »__attribute__« before »end«
/usr/include/dispatch/object.h:55:27: Fehler: unbekannter Typname:
»dispatch_object_t«
/usr/include/dispatch/object.h:124:16: Fehler: unbekannter Typname:
»dispatch_object_t«
/usr/include/dispatch/object.h:130:17: Fehler: unbekannter Typname:
»dispatch_object_t«
/usr/include/dispatch/object.h:149:17: Fehler: unbekannter Typname:
»dispatch_object_t«
/usr/include/dispatch/object.h:175:18: Fehler: unbekannter Typname:
»dispatch_object_t«
/usr/include/dispatch/object.h:198:22: Fehler: unbekannter Typname:
»dispatch_object_t«
/usr/include/dispatch/object.h:216:22: Fehler: unbekannter Typname:
»dispatch_object_t«
/usr/include/dispatch/object.h:242:26: Fehler: unbekannter Typname:
»dispatch_object_t«
/usr/include/dispatch/object.h:266:18: Fehler: unbekannter Typname:
»dispatch_object_t«
/usr/include/dispatch/object.h:281:17: Fehler: unbekannter Typname:
»dispatch_object_t«
In file included from /usr/include/dispatch/dispatch.h:52:0,
from
/System/Library/Frameworks/CoreFoundation.framework/Headers/CFMessagePort.h:11,
from
/System/Library/Frameworks/CoreFoundation.framework/Headers/CoreFoundation.h:68,
from
/System/Library/Frameworks/CoreServices.framework/Frameworks/CarbonCore.framework/Headers/CarbonCore.h:18,
from
/System/Library/Frameworks/CoreServices.framework/Frameworks/AE.framework/Headers/AE.h:20,
from
/System/Library/Frameworks/CoreServices.framework/Headers/CoreServices.h:18,
from
/System/Library/Frameworks/ApplicationServices.framework/Headers/ApplicationServices.h:24,
from mercurial/osutil.c:523:
/usr/include/dispatch/queue.h:67:1: Fehler: verirrtes »@« im Programm
/usr/include/dispatch/queue.h:67:1: Fehler: unbekannter Typname: »protocol«
/usr/include/dispatch/queue.h:67:1: Fehler: expected »=«, »,«, »;«,
»asm« or »__attribute__« before »<« token
/usr/include/dispatch/queue.h:67:1: Fehler: verirrtes »@« im Programm
/usr/include/dispatch/queue.h:75:1: Fehler: verirrtes »@« im Programm
/usr/include/dispatch/queue.h:75:1: Fehler: unbekannter Typname: »protocol«
/usr/include/dispatch/queue.h:75:1: Fehler: expected »=«, »,«, »;«,
»asm« or »__attribute__« before »<« token
/usr/include/dispatch/queue.h:75:1: Fehler: verirrtes »@« im Programm
/usr/include/dispatch/queue.h:178:18: Fehler: unbekannter Typname:
»dispatch_queue_t«
/usr/include/dispatch/queue.h:244:17: Fehler: unbekannter Typname:
»dispatch_queue_t«
/usr/include/dispatch/queue.h:310:37: Fehler: unbekannter Typname:
»dispatch_queue_t«
/usr/include/dispatch/queue.h:344:1: Fehler: unbekannter Typname:
»dispatch_queue_t«
/usr/include/dispatch/queue.h:425:1: Fehler: unbekannter Typname:
»dispatch_queue_t«
/usr/include/dispatch/queue.h:484:1: Fehler: unbekannter Typname:
»dispatch_queue_t«
/usr/include/dispatch/queue.h:484:42: Fehler: unbekannter Typname:
»dispatch_queue_attr_t«
/usr/include/dispatch/queue.h:503:26: Fehler: unbekannter Typname:
»dispatch_queue_t«
/usr/include/dispatch/queue.h:558:27: Fehler: unbekannter Typname:
»dispatch_object_t«
/usr/include/dispatch/queue.h:558:53: Fehler: unbekannter Typname:
»dispatch_queue_t«
/usr/include/dispatch/queue.h:638:2: Fehler: unbekannter Typname:
»dispatch_queue_t«
/usr/include/dispatch/queue.h:718:26: Fehler: unbekannter Typname:
»dispatch_queue_t«
/usr/include/dispatch/queue.h:777:25: Fehler: unbekannter Typname:
»dispatch_queue_t«
/usr/include/dispatch/queue.h:820:29: Fehler: unbekannter Typname:
»dispatch_queue_t«
/usr/include/dispatch/queue.h:850:29: Fehler: unbekannter Typname:
»dispatch_queue_t«
In file included from /usr/include/dispatch/dispatch.h:53:0,
from
/System/Library/Frameworks/CoreFoundation.framework/Headers/CFMessagePort.h:11,
from
/System/Library/Frameworks/CoreFoundation.framework/Headers/CoreFoundation.h:68,
from
/System/Library/Frameworks/CoreServices.framework/Frameworks/CarbonCore.framework/Headers/CarbonCore.h:18,
from
/System/Library/Frameworks/CoreServices.framework/Frameworks/AE.framework/Headers/AE.h:20,
from
/System/Library/Frameworks/CoreServices.framework/Headers/CoreServices.h:18,
from
/System/Library/Frameworks/ApplicationServices.framework/Headers/ApplicationServices.h:24,
from mercurial/osutil.c:523:
/usr/include/dispatch/source.h:52:1: Fehler: verirrtes »@« im Programm
/usr/include/dispatch/source.h:52:1: Fehler: unbekannter Typname: »protocol«
/usr/include/dispatch/source.h:52:1: Fehler: expected »=«, »,«, »;«,
»asm« or »__attribute__« before »<« token
/usr/include/dispatch/source.h:52:1: Fehler: verirrtes »@« im Programm
/usr/include/dispatch/source.h:294:1: Fehler: unbekannter Typname:
»dispatch_source_t«
/usr/include/dispatch/source.h:297:2: Fehler: unbekannter Typname:
»dispatch_queue_t«
/usr/include/dispatch/source.h:339:37: Fehler: unbekannter Typname:
»dispatch_source_t«
/usr/include/dispatch/source.h:398:38: Fehler: unbekannter Typname:
»dispatch_source_t«
/usr/include/dispatch/source.h:426:24: Fehler: unbekannter Typname:
»dispatch_source_t«
/usr/include/dispatch/source.h:445:28: Fehler: unbekannter Typname:
»dispatch_source_t«
/usr/include/dispatch/source.h:475:28: Fehler: unbekannter Typname:
»dispatch_source_t«
/usr/include/dispatch/source.h:505:26: Fehler: unbekannter Typname:
»dispatch_source_t«
/usr/include/dispatch/source.h:542:26: Fehler: unbekannter Typname:
»dispatch_source_t«
/usr/include/dispatch/source.h:563:28: Fehler: unbekannter Typname:
»dispatch_source_t«
/usr/include/dispatch/source.h:600:27: Fehler: unbekannter Typname:
»dispatch_source_t«
/usr/include/dispatch/source.h:655:44: Fehler: unbekannter Typname:
»dispatch_source_t«
In file included from /usr/include/dispatch/dispatch.h:54:0,
from
/System/Library/Frameworks/CoreFoundation.framework/Headers/CFMessagePort.h:11,
from
/System/Library/Frameworks/CoreFoundation.framework/Headers/CoreFoundation.h:68,
from
/System/Library/Frameworks/CoreServices.framework/Frameworks/CarbonCore.framework/Headers/CarbonCore.h:18,
from
/System/Library/Frameworks/CoreServices.framework/Frameworks/AE.framework/Headers/AE.h:20,
from
/System/Library/Frameworks/CoreServices.framework/Headers/CoreServices.h:18,
from
/System/Library/Frameworks/ApplicationServices.framework/Headers/ApplicationServices.h:24,
from mercurial/osutil.c:523:
/usr/include/dispatch/group.h:34:1: Fehler: verirrtes »@« im Programm
/usr/include/dispatch/group.h:34:1: Fehler: unbekannter Typname: »protocol«
/usr/include/dispatch/group.h:34:1: Fehler: expected »=«, »,«, »;«,
»asm« or »__attribute__« before »<« token
/usr/include/dispatch/group.h:34:1: Fehler: verirrtes »@« im Programm
/usr/include/dispatch/group.h:56:1: Fehler: unbekannter Typname:
»dispatch_group_t«
/usr/include/dispatch/group.h:120:24: Fehler: unbekannter Typname:
»dispatch_group_t«
/usr/include/dispatch/group.h:121:2: Fehler: unbekannter Typname:
»dispatch_queue_t«
/usr/include/dispatch/group.h:163:21: Fehler: unbekannter Typname:
»dispatch_group_t«
/usr/include/dispatch/group.h:230:25: Fehler: unbekannter Typname:
»dispatch_group_t«
/usr/include/dispatch/group.h:231:2: Fehler: unbekannter Typname:
»dispatch_queue_t«
/usr/include/dispatch/group.h:253:22: Fehler: unbekannter Typname:
»dispatch_group_t«
/usr/include/dispatch/group.h:272:22: Fehler: unbekannter Typname:
»dispatch_group_t«
In file included from /usr/include/dispatch/dispatch.h:55:0,
from
/System/Library/Frameworks/CoreFoundation.framework/Headers/CFMessagePort.h:11,
from
/System/Library/Frameworks/CoreFoundation.framework/Headers/CoreFoundation.h:68,
from
/System/Library/Frameworks/CoreServices.framework/Frameworks/CarbonCore.framework/Headers/CarbonCore.h:18,
from
/System/Library/Frameworks/CoreServices.framework/Frameworks/AE.framework/Headers/AE.h:20,
from
/System/Library/Frameworks/CoreServices.framework/Headers/CoreServices.h:18,
from
/System/Library/Frameworks/ApplicationServices.framework/Headers/ApplicationServices.h:24,
from mercurial/osutil.c:523:
/usr/include/dispatch/semaphore.h:35:1: Fehler: verirrtes »@« im Programm
/usr/include/dispatch/semaphore.h:35:1: Fehler: unbekannter Typname:
»protocol«
/usr/include/dispatch/semaphore.h:35:1: Fehler: expected »=«, »,«, »;«,
»asm« or »__attribute__« before »<« token
/usr/include/dispatch/semaphore.h:35:1: Fehler: verirrtes »@« im Programm
/usr/include/dispatch/semaphore.h:62:1: Fehler: unbekannter Typname:
»dispatch_semaphore_t«
/usr/include/dispatch/semaphore.h:87:25: Fehler: unbekannter Typname:
»dispatch_semaphore_t«
/usr/include/dispatch/semaphore.h:109:27: Fehler: unbekannter Typname:
»dispatch_semaphore_t«
In file included from /usr/include/dispatch/dispatch.h:57:0,
from
/System/Library/Frameworks/CoreFoundation.framework/Headers/CFMessagePort.h:11,
from
/System/Library/Frameworks/CoreFoundation.framework/Headers/CoreFoundation.h:68,
from
/System/Library/Frameworks/CoreServices.framework/Frameworks/CarbonCore.framework/Headers/CarbonCore.h:18,
from
/System/Library/Frameworks/CoreServices.framework/Frameworks/AE.framework/Headers/AE.h:20,
from
/System/Library/Frameworks/CoreServices.framework/Headers/CoreServices.h:18,
from
/System/Library/Frameworks/ApplicationServices.framework/Headers/ApplicationServices.h:24,
from mercurial/osutil.c:523:
/usr/include/dispatch/data.h:42:1: Fehler: verirrtes »@« im Programm
/usr/include/dispatch/data.h:42:1: Fehler: unbekannter Typname: »protocol«
/usr/include/dispatch/data.h:42:1: Fehler: expected »=«, »,«, »;«, »asm«
or »__attribute__« before »<« token
/usr/include/dispatch/data.h:42:1: Fehler: verirrtes »@« im Programm
In file included from
/System/Library/Frameworks/CoreFoundation.framework/Headers/CoreFoundation.h:68:0,
from
/System/Library/Frameworks/CoreServices.framework/Frameworks/CarbonCore.framework/Headers/CarbonCore.h:18,
from
/System/Library/Frameworks/CoreServices.framework/Frameworks/AE.framework/Headers/AE.h:20,
from
/System/Library/Frameworks/CoreServices.framework/Headers/CoreServices.h:18,
from
/System/Library/Frameworks/ApplicationServices.framework/Headers/ApplicationServices.h:24,
from mercurial/osutil.c:523:
/System/Library/Frameworks/CoreFoundation.framework/Headers/CFMessagePort.h:57:67:
Fehler: unbekannter Typname: »dispatch_queue_t«
In file included from
/System/Library/Frameworks/DiskArbitration.framework/Headers/DADisk.h:28:0,
from
/System/Library/Frameworks/CoreServices.framework/Frameworks/CarbonCore.framework/Headers/Files.h:56,
from
/System/Library/Frameworks/CoreServices.framework/Frameworks/CarbonCore.framework/Headers/Components.h:26,
from
/System/Library/Frameworks/CoreServices.framework/Frameworks/CarbonCore.framework/Headers/CarbonCore.h:87,
from
/System/Library/Frameworks/CoreServices.framework/Frameworks/AE.framework/Headers/AE.h:20,
from
/System/Library/Frameworks/CoreServices.framework/Headers/CoreServices.h:18,
from
/System/Library/Frameworks/ApplicationServices.framework/Headers/ApplicationServices.h:24,
from mercurial/osutil.c:523:
/System/Library/Frameworks/IOKit.framework/Headers/IOKitLib.h:186:32:
Fehler: unbekannter Typname: »dispatch_queue_t«
In file included from
/System/Library/Frameworks/DiskArbitration.framework/Headers/DADisk.h:30:0,
from
/System/Library/Frameworks/CoreServices.framework/Frameworks/CarbonCore.framework/Headers/Files.h:56,
from
/System/Library/Frameworks/CoreServices.framework/Frameworks/CarbonCore.framework/Headers/Components.h:26,
from
/System/Library/Frameworks/CoreServices.framework/Frameworks/CarbonCore.framework/Headers/CarbonCore.h:87,
from
/System/Library/Frameworks/CoreServices.framework/Frameworks/AE.framework/Headers/AE.h:20,
from
/System/Library/Frameworks/CoreServices.framework/Headers/CoreServices.h:18,
from
/System/Library/Frameworks/ApplicationServices.framework/Headers/ApplicationServices.h:24,
from mercurial/osutil.c:523:
/System/Library/Frameworks/DiskArbitration.framework/Headers/DASession.h:87:62:
Fehler: unbekannter Typname: »dispatch_queue_t«
In file included from
/System/Library/Frameworks/CoreServices.framework/Frameworks/CarbonCore.framework/Headers/CarbonCore.h:220:0,
from
/System/Library/Frameworks/CoreServices.framework/Frameworks/AE.framework/Headers/AE.h:20,
from
/System/Library/Frameworks/CoreServices.framework/Headers/CoreServices.h:18,
from
/System/Library/Frameworks/ApplicationServices.framework/Headers/ApplicationServices.h:24,
from mercurial/osutil.c:523:
/System/Library/Frameworks/CoreServices.framework/Frameworks/CarbonCore.framework/Headers/FSEvents.h:1056:3:
Fehler: unbekannter Typname: »dispatch_queue_t«
In file included from
/System/Library/Frameworks/CoreServices.framework/Frameworks/Metadata.framework/Headers/MDLabel.h:20:0,
from
/System/Library/Frameworks/CoreServices.framework/Frameworks/Metadata.framework/Headers/Metadata.h:11,
from
/System/Library/Frameworks/CoreServices.framework/Headers/CoreServices.h:46,
from
/System/Library/Frameworks/ApplicationServices.framework/Headers/ApplicationServices.h:24,
from mercurial/osutil.c:523:
/System/Library/Frameworks/CoreServices.framework/Frameworks/Metadata.framework/Headers/MDQuery.h:533:58:
Fehler: unbekannter Typname: »dispatch_queue_t«
In file included from
/System/Library/Frameworks/IOSurface.framework/Headers/IOSurfaceBase.h:30:0,
from
/System/Library/Frameworks/IOSurface.framework/Headers/IOSurfaceAPI.h:13,
from
/System/Library/Frameworks/CoreGraphics.framework/Headers/CGDisplayStream.h:11,
from
/System/Library/Frameworks/CoreGraphics.framework/Headers/CoreGraphics.h:43,
from
/System/Library/Frameworks/ApplicationServices.framework/Frameworks/QD.framework/Headers/QD.h:25,
from
/System/Library/Frameworks/ApplicationServices.framework/Headers/ApplicationServices.h:32,
from mercurial/osutil.c:523:
/usr/include/xpc/xpc.h:64:1: Fehler: verirrtes »@« im Programm
/usr/include/xpc/xpc.h:64:1: Fehler: unbekannter Typname: »protocol«
/usr/include/xpc/xpc.h:64:1: Fehler: verirrtes »@« im Programm
/usr/include/xpc/xpc.h:64:1: Fehler: expected »=«, »,«, »;«, »asm« or
»__attribute__« before »end«
/usr/include/xpc/xpc.h:72:22: Fehler: unbekannter Typname: »xpc_object_t«
/usr/include/xpc/xpc.h:109:1: Fehler: unbekannter Typname: »xpc_object_t«
/usr/include/xpc/xpc.h:136:1: Fehler: unbekannter Typname: »xpc_object_t«
In file included from /usr/include/xpc/xpc.h:324:0,
from
/System/Library/Frameworks/IOSurface.framework/Headers/IOSurfaceBase.h:30,
from
/System/Library/Frameworks/IOSurface.framework/Headers/IOSurfaceAPI.h:13,
from
/System/Library/Frameworks/CoreGraphics.framework/Headers/CGDisplayStream.h:11,
from
/System/Library/Frameworks/CoreGraphics.framework/Headers/CoreGraphics.h:43,
from
/System/Library/Frameworks/ApplicationServices.framework/Frameworks/QD.framework/Headers/QD.h:25,
from
/System/Library/Frameworks/ApplicationServices.framework/Headers/ApplicationServices.h:32,
from mercurial/osutil.c:523:
/usr/include/xpc/endpoint.h:20:1: Fehler: Nicht-Null-Argument
referenziert Nicht-Zeiger-Operanden (Argument 1, Operand 1)
In file included from
/System/Library/Frameworks/IOSurface.framework/Headers/IOSurfaceBase.h:30:0,
from
/System/Library/Frameworks/IOSurface.framework/Headers/IOSurfaceAPI.h:13,
from
/System/Library/Frameworks/CoreGraphics.framework/Headers/CGDisplayStream.h:11,
from
/System/Library/Frameworks/CoreGraphics.framework/Headers/CoreGraphics.h:43,
from
/System/Library/Frameworks/ApplicationServices.framework/Frameworks/QD.framework/Headers/QD.h:25,
from
/System/Library/Frameworks/ApplicationServices.framework/Headers/ApplicationServices.h:32,
from mercurial/osutil.c:523:
/usr/include/xpc/xpc.h:350:1: Fehler: unbekannter Typname: »xpc_object_t«
/usr/include/xpc/xpc.h:350:12: Fehler: unbekannter Typname: »xpc_object_t«
/usr/include/xpc/xpc.h:375:13: Fehler: unbekannter Typname: »xpc_object_t«
/usr/include/xpc/xpc.h:398:14: Fehler: unbekannter Typname: »xpc_object_t«
/usr/include/xpc/xpc.h:423:1: Fehler: unbekannter Typname: »xpc_object_t«
/usr/include/xpc/xpc.h:423:10: Fehler: unbekannter Typname: »xpc_object_t«
/usr/include/xpc/xpc.h:451:11: Fehler: unbekannter Typname: »xpc_object_t«
/usr/include/xpc/xpc.h:451:33: Fehler: unbekannter Typname: »xpc_object_t«
/usr/include/xpc/xpc.h:474:10: Fehler: unbekannter Typname: »xpc_object_t«
/usr/include/xpc/xpc.h:492:22: Fehler: unbekannter Typname: »xpc_object_t«
/usr/include/xpc/xpc.h:508:1: Fehler: unbekannter Typname: »xpc_object_t«
/usr/include/xpc/xpc.h:526:1: Fehler: unbekannter Typname: »xpc_object_t«
/usr/include/xpc/xpc.h:543:20: Fehler: unbekannter Typname: »xpc_object_t«
/usr/include/xpc/xpc.h:561:1: Fehler: unbekannter Typname: »xpc_object_t«
/usr/include/xpc/xpc.h:578:21: Fehler: unbekannter Typname: »xpc_object_t«
/usr/include/xpc/xpc.h:596:1: Fehler: unbekannter Typname: »xpc_object_t«
/usr/include/xpc/xpc.h:613:22: Fehler: unbekannter Typname: »xpc_object_t«
/usr/include/xpc/xpc.h:631:1: Fehler: unbekannter Typname: »xpc_object_t«
/usr/include/xpc/xpc.h:648:22: Fehler: unbekannter Typname: »xpc_object_t«
/usr/include/xpc/xpc.h:668:1: Fehler: unbekannter Typname: »xpc_object_t«
/usr/include/xpc/xpc.h:682:1: Fehler: unbekannter Typname: »xpc_object_t«
/usr/include/xpc/xpc.h:699:20: Fehler: unbekannter Typname: »xpc_object_t«
/usr/include/xpc/xpc.h:726:1: Fehler: unbekannter Typname: »xpc_object_t«
/usr/include/xpc/xpc.h:750:1: Fehler: unbekannter Typname: »xpc_object_t«
/usr/include/xpc/xpc.h:750:36: Fehler: unbekannter Typname:
»dispatch_data_t«
/usr/include/xpc/xpc.h:767:21: Fehler: unbekannter Typname: »xpc_object_t«
/usr/include/xpc/xpc.h:784:24: Fehler: unbekannter Typname: »xpc_object_t«
/usr/include/xpc/xpc.h:812:20: Fehler: unbekannter Typname: »xpc_object_t«
/usr/include/xpc/xpc.h:831:1: Fehler: unbekannter Typname: »xpc_object_t«
/usr/include/xpc/xpc.h:854:1: Fehler: unbekannter Typname: »xpc_object_t«
/usr/include/xpc/xpc.h:878:1: Fehler: unbekannter Typname: »xpc_object_t«
/usr/include/xpc/xpc.h:895:23: Fehler: unbekannter Typname: »xpc_object_t«
/usr/include/xpc/xpc.h:912:27: Fehler: unbekannter Typname: »xpc_object_t«
/usr/include/xpc/xpc.h:931:1: Fehler: unbekannter Typname: »xpc_object_t«
/usr/include/xpc/xpc.h:949:20: Fehler: unbekannter Typname: »xpc_object_t«
/usr/include/xpc/xpc.h:983:1: Fehler: unbekannter Typname: »xpc_object_t«
/usr/include/xpc/xpc.h:1009:12: Fehler: unbekannter Typname: »xpc_object_t«
/usr/include/xpc/xpc.h:1036:1: Fehler: unbekannter Typname: »xpc_object_t«
/usr/include/xpc/xpc.h:1065:15: Fehler: unbekannter Typname: »xpc_object_t«
/usr/include/xpc/xpc.h:1113:1: Fehler: unbekannter Typname: »xpc_object_t«
/usr/include/xpc/xpc.h:1113:1: Fehler: unbekannter Typname: »xpc_object_t«
/usr/include/xpc/xpc.h:1137:21: Fehler: unbekannter Typname: »xpc_object_t«
/usr/include/xpc/xpc.h:1137:56: Fehler: unbekannter Typname: »xpc_object_t«
/usr/include/xpc/xpc.h:1154:24: Fehler: unbekannter Typname: »xpc_object_t«
/usr/include/xpc/xpc.h:1154:45: Fehler: unbekannter Typname: »xpc_object_t«
/usr/include/xpc/xpc.h:1171:21: Fehler: unbekannter Typname: »xpc_object_t«
/usr/include/xpc/xpc.h:1196:1: Fehler: unbekannter Typname: »xpc_object_t«
/usr/include/xpc/xpc.h:1196:21: Fehler: unbekannter Typname: »xpc_object_t«
/usr/include/xpc/xpc.h:1257:20: Fehler: unbekannter Typname: »xpc_object_t«
/usr/include/xpc/xpc.h:1283:21: Fehler: unbekannter Typname: »xpc_object_t«
/usr/include/xpc/xpc.h:1309:22: Fehler: unbekannter Typname: »xpc_object_t«
/usr/include/xpc/xpc.h:1335:22: Fehler: unbekannter Typname: »xpc_object_t«
/usr/include/xpc/xpc.h:1361:20: Fehler: unbekannter Typname: »xpc_object_t«
/usr/include/xpc/xpc.h:1390:20: Fehler: unbekannter Typname: »xpc_object_t«
/usr/include/xpc/xpc.h:1416:22: Fehler: unbekannter Typname: »xpc_object_t«
/usr/include/xpc/xpc.h:1442:20: Fehler: unbekannter Typname: »xpc_object_t«
/usr/include/xpc/xpc.h:1468:18: Fehler: unbekannter Typname: »xpc_object_t«
/usr/include/xpc/xpc.h:1494:26: Fehler: unbekannter Typname: »xpc_object_t«
/usr/include/xpc/xpc.h:1519:20: Fehler: unbekannter Typname: »xpc_object_t«
/usr/include/xpc/xpc.h:1542:21: Fehler: unbekannter Typname: »xpc_object_t«
/usr/include/xpc/xpc.h:1565:22: Fehler: unbekannter Typname: »xpc_object_t«
/usr/include/xpc/xpc.h:1588:22: Fehler: unbekannter Typname: »xpc_object_t«
/usr/include/xpc/xpc.h:1611:20: Fehler: unbekannter Typname: »xpc_object_t«
/usr/include/xpc/xpc.h:1638:20: Fehler: unbekannter Typname: »xpc_object_t«
/usr/include/xpc/xpc.h:1661:22: Fehler: unbekannter Typname: »xpc_object_t«
/usr/include/xpc/xpc.h:1685:20: Fehler: unbekannter Typname: »xpc_object_t«
/usr/include/xpc/xpc.h:1709:18: Fehler: unbekannter Typname: »xpc_object_t«
/usr/include/xpc/xpc.h:1737:29: Fehler: unbekannter Typname: »xpc_object_t«
/usr/include/xpc/xpc.h:1790:1: Fehler: unbekannter Typname: »xpc_object_t«
/usr/include/xpc/xpc.h:1790:1: Fehler: unbekannter Typname: »xpc_object_t«
/usr/include/xpc/xpc.h:1816:1: Fehler: unbekannter Typname: »xpc_object_t«
/usr/include/xpc/xpc.h:1816:29: Fehler: unbekannter Typname: »xpc_object_t«
/usr/include/xpc/xpc.h:1839:26: Fehler: unbekannter Typname: »xpc_object_t«
/usr/include/xpc/xpc.h:1840:19: Fehler: unbekannter Typname: »xpc_object_t«
/usr/include/xpc/xpc.h:1865:1: Fehler: unbekannter Typname: »xpc_object_t«
/usr/include/xpc/xpc.h:1865:26: Fehler: unbekannter Typname: »xpc_object_t«
/usr/include/xpc/xpc.h:1885:26: Fehler: unbekannter Typname: »xpc_object_t«
/usr/include/xpc/xpc.h:1933:38: Fehler: unbekannter Typname: »xpc_object_t«
/usr/include/xpc/xpc.h:1959:25: Fehler: unbekannter Typname: »xpc_object_t«
/usr/include/xpc/xpc.h:1982:26: Fehler: unbekannter Typname: »xpc_object_t«
/usr/include/xpc/xpc.h:2005:27: Fehler: unbekannter Typname: »xpc_object_t«
/usr/include/xpc/xpc.h:2028:27: Fehler: unbekannter Typname: »xpc_object_t«
/usr/include/xpc/xpc.h:2051:25: Fehler: unbekannter Typname: »xpc_object_t«
/usr/include/xpc/xpc.h:2077:25: Fehler: unbekannter Typname: »xpc_object_t«
/usr/include/xpc/xpc.h:2100:27: Fehler: unbekannter Typname: »xpc_object_t«
/usr/include/xpc/xpc.h:2123:25: Fehler: unbekannter Typname: »xpc_object_t«
/usr/include/xpc/xpc.h:2146:23: Fehler: unbekannter Typname: »xpc_object_t«
/usr/include/xpc/xpc.h:2170:31: Fehler: unbekannter Typname: »xpc_object_t«
/usr/include/xpc/xpc.h:2194:25: Fehler: unbekannter Typname: »xpc_object_t«
/usr/include/xpc/xpc.h:2216:26: Fehler: unbekannter Typname: »xpc_object_t«
/usr/include/xpc/xpc.h:2238:27: Fehler: unbekannter Typname: »xpc_object_t«
/usr/include/xpc/xpc.h:2260:27: Fehler: unbekannter Typname: »xpc_object_t«
/usr/include/xpc/xpc.h:2282:25: Fehler: unbekannter Typname: »xpc_object_t«
/usr/include/xpc/xpc.h:2308:25: Fehler: unbekannter Typname: »xpc_object_t«
/usr/include/xpc/xpc.h:2330:27: Fehler: unbekannter Typname: »xpc_object_t«
/usr/include/xpc/xpc.h:2352:25: Fehler: unbekannter Typname: »xpc_object_t«
/usr/include/xpc/xpc.h:2375:23: Fehler: unbekannter Typname: »xpc_object_t«
/usr/include/xpc/xpc.h:2401:34: Fehler: unbekannter Typname: »xpc_object_t«
In file included from
/System/Library/Frameworks/CoreGraphics.framework/Headers/CGDisplayStream.h:11:0,
from
/System/Library/Frameworks/CoreGraphics.framework/Headers/CoreGraphics.h:43,
from
/System/Library/Frameworks/ApplicationServices.framework/Frameworks/QD.framework/Headers/QD.h:25,
from
/System/Library/Frameworks/ApplicationServices.framework/Headers/ApplicationServices.h:32,
from mercurial/osutil.c:523:
/System/Library/Frameworks/IOSurface.framework/Headers/IOSurfaceAPI.h:251:1:
Fehler: unbekannter Typname: »xpc_object_t«
/System/Library/Frameworks/IOSurface.framework/Headers/IOSurfaceAPI.h:255:43:
Fehler: unbekannter Typname: »xpc_object_t«
mercurial/osutil.c: In Funktion »isgui«:
mercurial/osutil.c:531:3: Warnung: Dereferenzierung eines
Type-Pun-Zeigers verletzt strict-aliasing-Regeln [-Wstrict-aliasing]
mercurial/osutil.c:533:3: Warnung: Dereferenzierung eines
Type-Pun-Zeigers verletzt strict-aliasing-Regeln [-Wstrict-aliasing]
error: command 'gcc' failed with exit status 1
Error building and installing Mercurial

real 0m1.687s
user 0m1.400s
sys 0m0.227s
************************************************************************
Error installing package mercurial-2.2.2.p0
************************************************************************
Please email sage-devel (http://groups.google.com/group/sage-devel)
explaining the problem and including the relevant part of the log file
/opt/sage/sage-5.6.beta1/spkg/logs/mercurial-2.2.2.p0.log
Describe your computer, operating system, etc.
If you want to try to fix the problem yourself, *don't* just cd to
/opt/sage/sage-5.6.beta1/spkg/build/mercurial-2.2.2.p0 and type 'make'
or whatever is appropriate.
Instead, the following commands setup all environment variables
correctly and load a subshell for you to debug the error:
(cd '/opt/sage/sage-5.6.beta1/spkg/build/mercurial-2.2.2.p0' &&
'/opt/sage/sage-5.6.beta1/sage' -sh)
When you are done debugging, you can type "exit" to leave the subshell.
************************************************************************

Volker Braun

unread,
Dec 31, 2012, 5:08:37 AM12/31/12
to sage-...@googlegroups.com
Does it work if you set

CFLAGS="-DOS_OBJECT_USE_OBJC=0"
export CFLAGS
make

/System/Library/Frameworks/Foundation.framework/Header...<br><a href="https://groups.google.com/group/sage-devel/msg/305078213d6bef73?dmode=source&output=gplain&noredirect">Show original</a>

Robert Zeier

unread,
Jan 1, 2013, 11:47:47 AM1/1/13
to sage-...@googlegroups.com
Yes, everything compiles with this flag.
Thanks!

Volker Braun

unread,
Jan 1, 2013, 1:05:12 PM1/1/13
to sage-...@googlegroups.com
This is Apple in their infinite wisdom relying on non-standard C extensions in the system headers.

Somebody with a Mac should try to figure out if we only need it for mercurial or whether its needed globally...

Robert Zeier

unread,
Jan 1, 2013, 1:36:37 PM1/1/13
to sage-...@googlegroups.com
How could I figure this out?

Volker Braun

unread,
Jan 1, 2013, 2:01:29 PM1/1/13
to sage-...@googlegroups.com
The following ticket says that this was fixed in XCode 4.5. Are you sure you don't have an old version floating around?

http://trac.sagemath.org/sage_trac/ticket/13309

Robert Zeier

unread,
Jan 1, 2013, 3:31:41 PM1/1/13
to sage-...@googlegroups.com
I do not see how this would be possible as 
I did upgrade Xcode to the latest version some time ago
and I have never installed a "second" version of Xcode:

/usr/bin/xcodebuild -version
Xcode 4.5.2
Build version 4G2008a

I did find some strange files but I do not think that they are the problem:

1,3M /private/var/folders/fj/mnbwqdjs335c_g0xj3qtwfjh0000gn/C/com.apple.DeveloperTools/4.4.1/Xcode
1,3M /private/var/folders/fj/mnbwqdjs335c_g0xj3qtwfjh0000gn/C/com.apple.DeveloperTools/4.4.1
1,3M /private/var/folders/fj/mnbwqdjs335c_g0xj3qtwfjh0000gn/C/com.apple.DeveloperTools/4.5/Xcode
1,3M /private/var/folders/fj/mnbwqdjs335c_g0xj3qtwfjh0000gn/C/com.apple.DeveloperTools/4.5
1,3M /private/var/folders/fj/mnbwqdjs335c_g0xj3qtwfjh0000gn/C/com.apple.DeveloperTools/4.5.1/Xcode
1,3M /private/var/folders/fj/mnbwqdjs335c_g0xj3qtwfjh0000gn/C/com.apple.DeveloperTools/4.5.1
1,3M /private/var/folders/fj/mnbwqdjs335c_g0xj3qtwfjh0000gn/C/com.apple.DeveloperTools/4.5.2/Xcode
 92K /private/var/folders/fj/mnbwqdjs335c_g0xj3qtwfjh0000gn/C/com.apple.DeveloperTools/4.5.2/xcodebuild
1,4M /private/var/folders/fj/mnbwqdjs335c_g0xj3qtwfjh0000gn/C/com.apple.DeveloperTools/4.5.2
5,4M /private/var/folders/fj/mnbwqdjs335c_g0xj3qtwfjh0000gn/C/com.apple.DeveloperTools

Please feel free to propose further ideas to analyze this. Thanks!

Volker Braun

unread,
Jan 1, 2013, 4:01:50 PM1/1/13
to sage-...@googlegroups.com
Can you do another build where you replace the old mercurial with this one:

http://www.stp.dias.ie/~vbraun/Sage/spkg/mercurial-2.2.2.p1.spkg

Jeroen Demeyer

unread,
Jan 2, 2013, 4:05:05 AM1/2/13
to sage-...@googlegroups.com
It's also strange that nobody else reported this problem.

Jeroen Demeyer

unread,
Jan 2, 2013, 4:08:11 AM1/2/13
to sage-...@googlegroups.com
On 2013-01-01 21:31, Robert Zeier wrote:
> I do not see how this would be possible as
> I did upgrade Xcode to the latest version some time ago
> and I have never installed a "second" version of Xcode:
Perhaps you still have some remnants of some old XCode on your system
which cause this problem. But then you might run into more errors apart
from this Mercurial one.

Robert Zeier

unread,
Jan 2, 2013, 7:26:12 AM1/2/13
to sage-...@googlegroups.com
I ended up patching also python and R in the same way as mercurial.
@Volker: Thanks for showing me how to do this.
Everything did build with the patches for mercurial, python, and R!

Hopefully, somebody else can independently verify that the problem exist.
Please let me know if there is something else I can try or test!

*************************************
some details follow below:
*************************************

Without the patches python did build, but some modules did not:

Python build finished, but the necessary bits to build these modules were not found:
bsddb185           dl                 gdbm            
imageop            linuxaudiodev      ossaudiodev     
spwd               sunaudiodev                        
To find the necessary bits, look in setup.py in detect_modules() for the module's name.


Failed to build these modules:
_scproxy                                              

This resulted in cython not building:

    from Cython.Tempita import sub
  File "/opt/sage/sage-5.6.beta1/spkg/build/cython-0.17.2/src/Cython/Tempita/__init__.py", line 34, in <module>
    import cgi
  File "/opt/sage/sage-5.6.beta1/local/lib/python/cgi.py", line 40, in <module>
    import urllib
  File "/opt/sage/sage-5.6.beta1/local/lib/python/urllib.py", line 1379, in <module>
    from _scproxy import _get_proxy_settings, _get_proxies
ImportError: No module named _scproxy
Error installing Cython

real 0m0.339s
user 0m0.294s
sys 0m0.041s
************************************************************************
Error installing package cython-0.17.2
************************************************************************
explaining the problem and including the relevant part of the log file
  /opt/sage/sage-5.6.beta1/spkg/logs/cython-0.17.2.log
Describe your computer, operating system, etc.
If you want to try to fix the problem yourself, *don't* just cd to
/opt/sage/sage-5.6.beta1/spkg/build/cython-0.17.2 and type 'make' or whatever is appropriate.
Instead, the following commands setup all environment variables
correctly and load a subshell for you to debug the error:
  (cd '/opt/sage/sage-5.6.beta1/spkg/build/cython-0.17.2' && '/opt/sage/sage-5.6.beta1/sage' -sh)
When you are done debugging, you can type "exit" to leave the subshell.
************************************************************************
make[2]: *** [installed/cython-0.17.2] Error 1
make[1]: *** [all] Error 2


*************************************
*************************************



P.S. There was one spurious testing error with eclib-20120830.
But this did go away after I reran it.

make[4]: *** [check_g0n] Error 127
make[4]: *** Waiting for unfinished jobs....

...

make[3]: *** [check-recursive] Error 1
Error: eclib's test suite failed to pass. 

Volker Braun

unread,
Jan 5, 2013, 4:29:35 AM1/5/13
to sage-...@googlegroups.com
Can you post your updated spkgs to http://trac.sagemath.org/sage_trac/ticket/13309, or at least the diffs?

Robert Zeier

unread,
Jan 6, 2013, 6:16:10 PM1/6/13
to sage-...@googlegroups.com
I can share the updates and/or the diffs.
Did you mean http://trac.sagemath.org/13898 ?
Should I ask for a trac account ?

Volker Braun

unread,
Jan 6, 2013, 6:40:58 PM1/6/13
to sage-...@googlegroups.com
On Sunday, January 6, 2013 11:16:10 PM UTC, Robert Zeier wrote:
I can share the updates and/or the diffs.
Did you mean http://trac.sagemath.org/13898 ?
Should I ask for a trac account ?

Please do. Instructions are on the Sage trac homepage.

Neal Harris

unread,
Feb 3, 2013, 8:05:48 PM2/3/13
to sage-...@googlegroups.com
I'm not sure if this has been reported already, but I just had an error while trying to build Sage 5.6 on 10.8.2:

In file included from /System/Library/Frameworks/CoreGraphics.framework/Headers/CGDisplayStream.h:11:0,
                 from /System/Library/Frameworks/CoreGraphics.framework/Headers/CoreGraphics.h:43,
                 from /System/Library/Frameworks/ApplicationServices.framework/Frameworks/QD.framework/Headers/QD.h:25,
                 from /System/Library/Frameworks/ApplicationServices.framework/Headers/ApplicationServices.h:32,
                 from mercurial/osutil.c:523:
/System/Library/Frameworks/IOSurface.framework/Headers/IOSurfaceAPI.h:251:1: error: unknown type name ‘xpc_object_t’
/System/Library/Frameworks/IOSurface.framework/Headers/IOSurfaceAPI.h:255:43: error: unknown type name ‘xpc_object_t’
error: command 'gcc' failed with exit status 1
Error building and installing Mercurial

real 0m2.886s
user 0m1.958s
sys 0m0.415s
************************************************************************
Error installing package mercurial-2.2.2.p0
************************************************************************

Reply all
Reply to author
Forward
0 new messages