ONL Build fail with "Host-Ccache" Download

15 views
Skip to first unread message

poby...@gmail.com

unread,
Oct 30, 2020, 10:20:33 AM10/30/20
to opennetworklinux
Hi..

When i build ON, I have below " host-ccache " issue.
does anyone know why it is occurred and how can fix it?

Thank you!
Kevin


Checking connectivity... done.
Submodule path 'packages/base/any/initrds/buildroot/builds/buildroot-mirror': checked out '5e1a5c1ef7bac890845920809147ee2070dc96ea'
Calling /root/OpenNetworkLinux/tools/scripts/submodule-updated.sh...
[1;31mWARNING [1;0m:onlpm:Skipping /root/OpenNetworkLinux/packages/base/powerpc/kernels/legacy/kernel-3.9.6-powerpc-e500v/PKG.yml due to .disabled file).
make[4]: warning: -jN forced in submake: disabling jobserver mode.
make[6]: warning: jobserver unavailable: using -j1.  Add '+' to parent make rule.
make[8]: warning: -jN forced in submake: disabling jobserver mode.
  GEN     ../buildroot-x86_64/Makefile
#
# configuration written to ../buildroot-x86_64/.config
#
[7m>>> host-ccache 3.1.8 Downloading [27m
package/pkg-generic.mk:31: recipe for target '/root/OpenNetworkLinux/packages/base/any/initrds/buildroot/builds/buildroot-x86_64/build/host-ccache-3.1.8/.stamp_downloaded' failed
make[6]: *** [/root/OpenNetworkLinux/packages/base/any/initrds/buildroot/builds/buildroot-x86_64/build/host-ccache-3.1.8/.stamp_downloaded] Error 1
Makefile:93: recipe for target 'buildroot-x86_64' failed
make[5]: *** [buildroot-x86_64] Error 2
/root/OpenNetworkLinux/packages/base/any/initrds/buildroot/Makefile.any:36: recipe for target 'buildroot-initrd-amd64.cpio.gz' failed
make[4]: *** [buildroot-initrd-amd64.cpio.gz] Error 2
[1;41mERROR [1;0m:onlpm:'Build failed.'
[1;41mERROR [1;0m:onlrfs:Failed to build all required packages.
/root/OpenNetworkLinux/make/rfs.mk:36: recipe for target 'RFS' failed
make[3]: *** [RFS] Error 1
[1;41mERROR [1;0m:onlpm:'Build failed.'
/root/OpenNetworkLinux/make/pkg.mk:30: recipe for target 'pkgall' failed
make[2]: *** [pkgall] Error 1
/root/OpenNetworkLinux/make/subdirs.mk:15: recipe for target 'all' failed
make[1]: *** [all] Error 1
make[1]: Leaving directory '/root/OpenNetworkLinux/builds/amd64'
Makefile:23: recipe for target 'amd64' failed
make: *** [amd64] Error 2
root@Debian-10-DOCKER-ONL-Build:~/OpenNetworkLinux# 



Reply all
Reply to author
Forward
0 new messages