ompilation of branch review/occt-720-patches

91 views
Skip to first unread message

Jeremy Theler

unread,
Jun 23, 2019, 12:46:10 AM6/23/19
to oce-dev
Hey guys (especially Thomas)

I am trying to compile branch review/occt-720-patches (Debian Buster) and I get the following error:

[ 99%] Building CXX object test/Standard_StdAllocator_test/CMakeFiles/Standard_StdAllocator_test.dir/Standard_StdAllocator_test
.cpp.o                                                                                                                          
/home/gtheler/codigos/3ros/build/oce/test/Standard_StdAllocator_test/Standard_StdAllocator_test.cpp:1:10:fatal error: Standard
_StdAllocator.hxx: No such file or directory 
#include <Standard_StdAllocator.hxx> 
         ^~~~~~~~~~~~~~~~~~~~~~~~~~~ 
compilation terminated. 
make[2]: *** [test/Standard_StdAllocator_test/CMakeFiles/Standard_StdAllocator_test.dir/build.make:63: test/Standard_StdAllocat
or_test/CMakeFiles/Standard_StdAllocator_test.dir/Standard_StdAllocator_test.cpp.o] Error 1 
make[1]: *** [CMakeFiles/Makefile2:5590: test/Standard_StdAllocator_test/CMakeFiles/Standard_StdAllocator_test.dir/all] Error 2 
make: *** [Makefile:163: all] Error 2
Reply all
Reply to author
Forward
0 new messages