Re: Upgrade to MozillaBuild 1.5.1

157 views
Skip to first unread message

Justin Lebar

unread,
Sep 8, 2010, 2:18:09 PM9/8/10
to
Some people didn't get the original message, so I'm sending another
note.

This patch just landed. Please update your Windows machines to
MozillaBuild 1.5.1!

-Justin

On Sep 6, 4:40 pm, Justin Lebar <justin.le...@gmail.com> wrote:
> Hi, all.
>
> We're getting ready to land bug 583849 (blocks bug 593753 which blocks
> bug 584253 which blocks release), which will switch us to using yasm
> to assemble libvpx on Win32.
>
> Once we land it, configure will error out if you try to compile
> Firefox on Win32 without the new MozillaBuild, unless you disable WebM
> support.
>
> You can get the latest MozillaBuild from
>
> http://ftp.mozilla.org/pub/mozilla.org/mozilla/libraries/win32/Mozill...
>
> Please let me know if there's any reason we shouldn't make this change
> within the next few days.
>
> -Justin

victor.par...@lunascape-inc.com

unread,
Aug 7, 2012, 9:02:38 PM8/7/12
to
Hi all,

I got following error while build on windows server for Gecko 10.0. If possibility could support any one please. thank in adcance.

make[6]: *** No targets specified and no makefile found. Stop.
make[6]: Leaving directory `/c/Users/victor.parthasarathy/gecko_build/output10/j
s/src/ctypes/libffi'
make[5]: *** [export] Error 2
make[5]: Leaving directory `/c/Users/victor.parthasarathy/gecko_build/output10/j
s/src'
make[4]: *** [export_tier_js] Error 2
make[4]: Leaving directory `/c/Users/victor.parthasarathy/gecko_build/output10'
make[3]: *** [tier_js] Error 2
make[3]: Leaving directory `/c/Users/victor.parthasarathy/gecko_build/output10'
make[2]: *** [default] Error 2
make[2]: Leaving directory `/c/Users/victor.parthasarathy/gecko_build/output10'
make[1]: *** [realbuild] Error 2
make[1]: Leaving directory `/c/Users/victor.parthasarathy/gecko_build/mozilla-re
lease'
make: *** [build] Error 2

victor.par...@lunascape-inc.com

unread,
Aug 7, 2012, 9:54:57 PM8/7/12
to
Hi all,

My output/configure file showing this kind of errors.. Kindly support me if you have any solution for this issues.

configure(5087) : fatal error C1083: include ファイルを開けません。'X11/Intrinsic.h': No such file or directory
configure: failed program was:
#line 5086 "configure"
#include
conftest.obj : error LNK2019: 未解決の外部シンボル _XtMalloc が関数 _main で参照されました。
conftest.obj : error LNK2019: 未解決の外部シンボル _XtMalloc が関数 _main で参照されました。
conftest.exe : fatal error LNK1120: 外部参照 1 が未解決です。
configure(6227) : error C2065: '__thumb2__' : 定義されていない識別子です。
configure(6779) : error C2118: 添字が負の数です。
configure(6819) : error C2118: 添字が負の数です。
configure(6862) : error C2118: 添字が負の数です。
1>&5
cl : コマンド ライン error D8021 : 数値型引数 '/Werror' は無効です。
configure(22749) : fatal error C1083: include ファイルを開けません。'stdint.h': No such file or directory
configure(22749) : fatal error C1083: include ファイルを開けません。'inttypes.h': No such file or directory
configure(22749) : fatal error C1083: include ファイルを開けません。'sys/int_types.h': No such file or directory
c1 : fatal error C1083: ソース ファイルを開けません。'kernel32.lib': No such file or directory
c1 : fatal error C1083: ソース ファイルを開けません。'user32.lib': No such file or directory
c1 : fatal error C1083: ソース ファイルを開けません。'gdi32.lib': No such file or directory
c1 : fatal error C1083: ソース ファイルを開けません。'winmm.lib': No such file or directory
c1 : fatal error C1083: ソース ファイルを開けません。'wsock32.lib': No such file or directory
c1 : fatal error C1083: ソース ファイルを開けません。'advapi32.lib': No such file or directory

regards,
Victor

My
2012年8月8日水曜日 10時02分38秒 UTC+9 (不明):
2012年8月8日水曜日 10時02分38秒 UTC+9 (不明):
Reply all
Reply to author
Forward
0 new messages