RUN_TESTS vc++ 2010 SP1 Build problem

5 views
Skip to first unread message

musi...@gmail.com

unread,
Dec 2, 2017, 2:00:59 AM12/2/17
to libarchive-discuss
Win7x64 - 6 tests failing - x32 build:

1>  The following tests FAILED:
1>      375 - libarchive_test_sparse_basic (Failed)
1>      376 - libarchive_test_fully_sparse_files (Failed)
1>      389 - libarchive_test_warn_missing_hardlink_target (Failed)
1>      517 - bsdcat_test_version (Failed)
1>      578 - bsdtar_test_version (Failed)
1>      609 - bsdcpio_test_option_version (Failed)
1>  Errors while running CTest
1>C:\Program Files (x86)\MSBuild\Microsoft.Cpp\v4.0\Microsoft.CppCommon.targets(113,5): error MSB3073: The command "setlocal
1>C:\Program Files (x86)\MSBuild\Microsoft.Cpp\v4.0\Microsoft.CppCommon.targets(113,5): error MSB3073: "C:\Program Files (x86)\CMake\bin\ctest.exe" --force-new-ctest-process -C Release
1>C:\Program Files (x86)\MSBuild\Microsoft.Cpp\v4.0\Microsoft.CppCommon.targets(113,5): error MSB3073: if %errorlevel% neq 0 goto :cmEnd
1>C:\Program Files (x86)\MSBuild\Microsoft.Cpp\v4.0\Microsoft.CppCommon.targets(113,5): error MSB3073: :cmEnd
1>C:\Program Files (x86)\MSBuild\Microsoft.Cpp\v4.0\Microsoft.CppCommon.targets(113,5): error MSB3073: endlocal & call :cmErrorLevel %errorlevel% & goto :cmDone
1>C:\Program Files (x86)\MSBuild\Microsoft.Cpp\v4.0\Microsoft.CppCommon.targets(113,5): error MSB3073: :cmErrorLevel
1>C:\Program Files (x86)\MSBuild\Microsoft.Cpp\v4.0\Microsoft.CppCommon.targets(113,5): error MSB3073: exit /b %1
1>C:\Program Files (x86)\MSBuild\Microsoft.Cpp\v4.0\Microsoft.CppCommon.targets(113,5): error MSB3073: :cmDone
1>C:\Program Files (x86)\MSBuild\Microsoft.Cpp\v4.0\Microsoft.CppCommon.targets(113,5): error MSB3073: if %errorlevel% neq 0 goto :VCEnd
1>C:\Program Files (x86)\MSBuild\Microsoft.Cpp\v4.0\Microsoft.CppCommon.targets(113,5): error MSB3073: :VCEnd" exited with code 8.
1>
1>Build FAILED.
1>
1>Time Elapsed 00:06:32.85
========== Build: 0 succeeded, 1 failed, 1 up-to-date, 0 skipped ==========

I'm clueless.  Any idea what I'm doing wrong?

Reply all
Reply to author
Forward
0 new messages