Did hiphop support soap

24 views
Skip to first unread message

luobo100

unread,
May 13, 2011, 5:41:13 AM5/13/11
to HipHop for PHP Dev
hello,everyone

I want to use hiphop for soap func, can it execute?

I tried it ,but comes the following message:

compiling and linking CPP files...
/tmp/hphp_EUzUwj/sys/dynamic_table_func.no.cpp:14: \xE9\x94\x99\xE8\xAF
\xAF\xEF\xBC\x9A\xE2\x80\x98HPHP::Variant
HPHP::Eval::invoke_from_eval(const char*,
HPHP::Eval::VariableEnvironment&, const
HPHP::Eval::FunctionCallExpression*, HPHP::int64, bool)
\xE2\x80\x99\xE5\xBA\x94\xE5\xBD\x93\xE5\xB7\xB2\xE5\x9C
\xA8\xE2\x80\x98HPHP::Eval
\xE2\x80\x99\xE5\x86\x85\xE9\x83\xA8\xE5\xA3\xB0\xE6\x98\x8E\xE8\xBF
\x87\n/tmp/hphp_EUzUwj/sys/dynamic_table_func.no.cpp: In function
\xE2\x80\x98HPHP::Variant HPHP::Eval::invoke_from_eval(const char*,
HPHP::Eval::VariableEnvironment&, const
HPHP::Eval::FunctionCallExpression*, HPHP::int64, bool)\xE2\x80\x99:\n/
tmp/hphp_EUzUwj/sys/dynamic_table_func.no.cpp:15: \xE9\x94\x99\xE8\xAF
\xAF\xEF\xBC\x9A\xE2\x80\x98invoke_from_eval_builtin
\xE2\x80\x99\xE5\x9C\xA8\xE6\xAD\xA4\xE4\xBD\x9C\xE7\x94\xA8\xE5\x9F
\x9F\xE4\xB8\xAD\xE5\xB0\x9A\xE6\x9C\xAA\xE5\xA3\xB0\xE6\x98\x8E\n/
home/sdb3/boost/include/boost-1_37/boost/system/error_code.hpp: At
global scope:\n/home/sdb3/boost/include/boost-1_37/boost/system/
error_code.hpp:205: \xE8\xAD\xA6\xE5\x91\x8A\xEF\xBC\x9A
\xE2\x80\x98boost::system::system_category\xE2\x80\x99\xE5\xAE\x9A
\xE4\xB9\x89\xE5\x90\x8E\xE6\x9C\xAA\xE4\xBD\xBF\xE7\x94\xA8\n/home/
sdb3/boost/include/boost-1_37/boost/system/error_code.hpp:206: \xE8\xAD
\xA6\xE5\x91\x8A\xEF\xBC\x9A\xE2\x80\x98boost::system::generic_category
\xE2\x80\x99\xE5\xAE\x9A\xE4\xB9\x89\xE5\x90\x8E\xE6\x9C\xAA\xE4\xBD
\xBF\xE7\x94\xA8\n/home/sdb3/boost/include/boost-1_37/boost/system/
error_code.hpp:210: \xE8\xAD\xA6\xE5\x91\x8A\xEF\xBC\x9A
\xE2\x80\x98boost::system::posix_category\xE2\x80\x99\xE5\xAE\x9A
\xE4\xB9\x89\xE5\x90\x8E\xE6\x9C\xAA\xE4\xBD\xBF\xE7\x94\xA8\n/home/
sdb3/boost/include/boost-1_37/boost/system/error_code.hpp:211: \xE8\xAD
\xA6\xE5\x91\x8A\xEF\xBC\x9A\xE2\x80\x98boost::system::errno_ecat
\xE2\x80\x99\xE5\xAE\x9A\xE4\xB9\x89\xE5\x90\x8E\xE6\x9C\xAA\xE4\xBD
\xBF\xE7\x94\xA8\n/home/sdb3/boost/include/boost-1_37/boost/system/
error_code.hpp:212: \xE8\xAD\xA6\xE5\x91\x8A\xEF\xBC\x9A
\xE2\x80\x98boost::system::native_ecat\xE2\x80\x99\xE5\xAE\x9A
\xE4\xB9\x89\xE5\x90\x8E\xE6\x9C\xAA\xE4\xBD\xBF\xE7\x94\xA8\nmake[2]:
*** [CMakeFiles/program.dir/sys/dynamic_table_func.no.cpp.o]
\xE9\x94\x99\xE8\xAF\xAF 1\nmake[1]: *** [CMakeFiles/program.dir/all]
\xE9\x94\x99\xE8\xAF\xAF 2\nmake: *** [all] \xE9\x94\x99\xE8\xAF\xAF
2\n
Reply all
Reply to author
Forward
0 new messages