tcc compiler error!

56 views
Skip to first unread message

WenSheng

unread,
Sep 4, 2021, 5:08:50 AMSep 4
to Harbour Users
I tried to use tcc 32bit to compile harbour but it failed!
The following message appears:
-----------------------------------------------------------------
tcc.exe   -I. -I../../../../../include -W -Wall -O3  -DUNICODE -DHB_HAS_PCRE -ID:/hbdev32/harbour-core/src/3rd/pcre -DPCRE_STATIC -DHB_HAS_ZLIB -ID:/hbdev32/harbour-core/src/3rd/zlib  -ohbdyn.o  -c ../../../hbdyn.c
../../../hbdyn.c:863: error: ')' expected (got "*")
../../../../../config/rules.mk:88: recipe for target 'hbdyn.o' failed
win-make[3]: *** [hbdyn.o] Error 1
../../config/lib.mk:68: recipe for target 'descend' failed
win-make[2]: *** [descend] Error 2
../config/dir.mk:71: recipe for target 'rtl' failed
win-make[1]: *** [rtl] Error 2
config/dir.mk:71: recipe for target 'src' failed
win-make: *** [src] Error 2
-----------------------------------------------------------------
Can someone please help?

Baxajaun

unread,
Sep 4, 2021, 9:33:16 AMSep 4
to Harbour Users
Hi Wen !


Best regards,

WenSheng

unread,
Sep 5, 2021, 4:17:36 AMSep 5
to Harbour Users
Yes!
But hbmk2 can support it! (line:1958, { {|| FindInPath( "tcc.exe"  ) }, "tcc"    }, ; )

Baxajaun 在 2021年9月4日 星期六下午9:33:16 [UTC+8] 的信中寫道:
Reply all
Reply to author
Forward
0 new messages