EPACTS installation issue

407 views
Skip to first unread message

Dash -

unread,
Apr 23, 2018, 6:56:37 AM4/23/18
to EPACTS
Hi there,

i got the error below when trying to install epacts using make command

Makefile:774: recipe for target 'pEmmax.o' failed
make
[2]: *** [pEmmax.o] Error 1
make
[2]: Leaving directory '/home/daruma/EPACTS/src'
Makefile:419: recipe for target 'all-recursive' failed
make
[1]: *** [all-recursive] Error 1
make
[1]: Leaving directory '/home/daruma/EPACTS'
Makefile:351: recipe for target 'all' failed
make
: *** [all] Error 2


I use ubuntu 17.10, any suggestions

D

Olga Ivanova

unread,
Jan 15, 2019, 6:38:54 PM1/15/19
to EPACTS
Hi Dash, 

I have got the same error message only difference in one line up reported, using Debian. Were you able to fix it? 

make[2]: *** [Makefile:773: pEmmax.o] Error 1
make
[2]: Leaving directory '/home/ivanova/EPACTS/src'
make
[1]: *** [Makefile:418: all-recursive] Error 1
make
[1]: Leaving directory '/home/ivanova/EPACTS'
make
: *** [Makefile:350: all] Error 2

Tim Kacprowski

unread,
Feb 4, 2019, 11:14:30 AM2/4/19
to EPACTS
same here.
seems to be a scoping issue:
g++ -DHAVE_CONFIG_H -I. -I.. -Wall -fpic -O2 -g -O2 -MT pEmmax.o -MD -MP -MF .deps/pEmmax.Tpo -c -o pEmmax.o pEmmax.cpp
In file included from pEmmax.cpp:3:0:
fVcf.h: In member function ‘int fVcf::HOMMINC(int)’:
fVcf.h:312:8: error: ‘isnan’ was not declared in this scope
  if ( !isnan(g) ) { // do not count missing at any place
        ^~~~~

dan.alexan...@gmail.com

unread,
Apr 24, 2019, 11:52:09 AM4/24/19
to EPACTS
same issue in Arch Linux 4.8.13-1-ARCH

Victor de Jager

unread,
Jun 4, 2020, 7:41:53 AM6/4/20
to EPACTS
I get the exact same error on Ubuntu 18.04

Op maandag 23 april 2018 12:56:37 UTC+2 schreef Dash -:
Reply all
Reply to author
Forward
0 new messages