I'm an idiot, putty has logging...Duh!
Here is the whole thing:
rpmbuild --rebuild hugin-2013.0.0-0.1.20130628hg.el6.src.rpm
Installing hugin-2013.0.0-0.1.20130628hg.el6.src.rpm
warning: user mockbuild does not exist - using root
warning: group mockbuild does not exist - using root
warning: user mockbuild does not exist - using root
warning: group mockbuild does not exist - using root
Executing(%prep): /bin/sh -e /var/tmp/rpm-tmp.FuMSNK
+ umask 022
+ cd /home/mikeb/rpmbuild/BUILD
+ LANG=C
+ export LANG
+ unset DISPLAY
+ cd /home/mikeb/rpmbuild/BUILD
+ rm -rf hugin-2013.0.0
+ /usr/bin/bzip2 -dc /home/mikeb/rpmbuild/SOURCES/hugin-2013.0.0.tar.bz2
+ /bin/tar -xf -
+ STATUS=0
+ '[' 0 -ne 0 ']'
+ cd hugin-2013.0.0
+ /bin/chmod -Rf a+rX,u+w,g-w,o-w .
+ exit 0
Executing(%build): /bin/sh -e /var/tmp/rpm-tmp.jHXyRp
+ umask 022
+ cd /home/mikeb/rpmbuild/BUILD
+ cd hugin-2013.0.0
+ LANG=C
+ export LANG
+ unset DISPLAY
+ CFLAGS='-O2 -g -pipe -Wall -Wp,-D_FORTIFY_SOURCE=2 -fexceptions -fstack-protector --param=ssp-buffer-size=4 -m64 -mtune=generic'
+ export CFLAGS
+ CXXFLAGS='-O2 -g -pipe -Wall -Wp,-D_FORTIFY_SOURCE=2 -fexceptions -fstack-protector --param=ssp-buffer-size=4 -m64 -mtune=generic'
+ export CXXFLAGS
+ FFLAGS='-O2 -g -pipe -Wall -Wp,-D_FORTIFY_SOURCE=2 -fexceptions -fstack-protector --param=ssp-buffer-size=4 -m64 -mtune=generic'
+ export FFLAGS
+ /usr/bin/cmake -DCMAKE_VERBOSE_MAKEFILE=ON -DCMAKE_INSTALL_PREFIX:PATH=/usr -DCMAKE_INSTALL_LIBDIR:PATH=/usr/lib64 -DINCLUDE_INSTALL_DIR:PATH=/usr/include -DLIB_INSTALL_DIR:PATH=/usr/lib64 -DSYSCONF_INSTALL_DIR:PATH=/etc -DSHARE_INSTALL_PREFIX:PATH=/usr/share -DLIB_SUFFIX=64 -DCMAKE_SKIP_RPATH:BOOL=ON -DBUILD_SHARED_LIBS:BOOL=ON . -DBUILD_HSI=1
-- The C compiler identification is GNU 4.4.7
-- The CXX compiler identification is GNU 4.4.7
-- Check for working C compiler: /usr/bin/gcc
-- Check for working C compiler: /usr/bin/gcc -- works
-- Detecting C compiler ABI info
-- Detecting C compiler ABI info - done
-- Check for working CXX compiler: /usr/bin/c++
-- Check for working CXX compiler: /usr/bin/c++ -- works
-- Detecting CXX compiler ABI info
-- Detecting CXX compiler ABI info - done
-- Current HG revision is 18090ff3f3c8
-- Assuming this is a tarball (release) build for 2013.0.0
-- Looking for log2
-- Looking for log2 - found
-- Found wxWidgets: TRUE
-- Found TIFF: /usr/include
-- Found JPEG: /usr/include
-- Found ZLIB: /usr/include
-- Found PNG: /usr/include
-- WARNING: you are using the obsolete 'PKGCONFIG' macro, use FindPkgConfig
-- Found OPENEXR: /usr/lib64/libImath.so;/usr/lib64/libIlmImf.so;/usr/lib64/libIex.so;/usr/lib64/libHalf.so;/usr/lib64/libIlmThread.so
-- WARNING: you are using the obsolete 'PKGCONFIG' macro, use FindPkgConfig
-- Found Exiv2 release >= 0.12
-- Found Exiv2: /usr/lib64/libexiv2.so
-- Looking for XOpenDisplay in /usr/lib64/libX11.so;/usr/lib64/libXext.so
-- Looking for XOpenDisplay in /usr/lib64/libX11.so;/usr/lib64/libXext.so - found
-- Looking for gethostbyname
-- Looking for gethostbyname - found
-- Looking for connect
-- Looking for connect - found
-- Looking for remove
-- Looking for remove - found
-- Looking for shmat
-- Looking for shmat - found
-- Looking for IceConnectionNumber in ICE
-- Looking for IceConnectionNumber in ICE - found
-- Found X11: /usr/lib64/libX11.so
-- Found OpenGL: /usr/lib64/libGL.so
-- GLUT Found
-- Found Glew: /usr/lib64/libGLEW.so
-- libpano13 version: 2.9.18 major 2 minor 9 patch 18
Boost 1.41 found.
Found Boost components:
thread;date_time;regex;filesystem;iostreams;system;signals
-- Program msgfmt found (/usr/bin/msgfmt)
-- Looking for include file pthread.h
-- Looking for include file pthread.h - found
-- Looking for pthread_create
-- Looking for pthread_create - not found.
-- Looking for pthread_create in pthreads
-- Looking for pthread_create in pthreads - not found
-- Looking for pthread_create in pthread
-- Looking for pthread_create in pthread - found
-- Found Threads: TRUE
-- ZThread library not found. falling back to included copy
-- flann library found
-- Found Lensfun: /usr/include
-- Found PythonInterp: /usr/bin/python (found version "2.6.6")
-- Found PythonLibs: /usr/lib64/
libpython2.6.so (found suitable version "2.6.6", required is "2.6.6")
-- Found SWIG: /usr/bin/swig (found suitable version "2.0.8", required is "2.0")
-- Using shared internal libraries
-- Python libs version: 2.6.6
-- Install Python libs into /usr/lib64/python2.6/site-packages
-- Current source dir = /home/mikeb/rpmbuild/BUILD/hugin-2013.0.0
-- Configuring done
-- Generating done
CMake Warning:
Manually-specified variables were not used by the project:
CMAKE_INSTALL_LIBDIR
INCLUDE_INSTALL_DIR
LIB_INSTALL_DIR
SHARE_INSTALL_PREFIX
SYSCONF_INSTALL_DIR
-- Build files have been written to: /home/mikeb/rpmbuild/BUILD/hugin-2013.0.0
+ make VERBOSE=1 -j16
/usr/bin/cmake -H/home/mikeb/rpmbuild/BUILD/hugin-2013.0.0 -B/home/mikeb/rpmbuild/BUILD/hugin-2013.0.0 --check-build-system CMakeFiles/Makefile.cmake 0
/usr/bin/cmake -E cmake_progress_start /home/mikeb/rpmbuild/BUILD/hugin-2013.0.0/CMakeFiles /home/mikeb/rpmbuild/BUILD/hugin-2013.0.0/CMakeFiles/progress.marks
make -f CMakeFiles/Makefile2 all
make[1]: Entering directory `/home/mikeb/rpmbuild/BUILD/hugin-2013.0.0'
make -f src/hugin_base/makefilelib/CMakeFiles/makefilelib.dir/build.make src/hugin_base/makefilelib/CMakeFiles/makefilelib.dir/depend
make[2]: Entering directory `/home/mikeb/rpmbuild/BUILD/hugin-2013.0.0'
cd /home/mikeb/rpmbuild/BUILD/hugin-2013.0.0 && /usr/bin/cmake -E cmake_depends "Unix Makefiles" /home/mikeb/rpmbuild/BUILD/hugin-2013.0.0 /home/mikeb/rpmbuild/BUILD/hugin-2013.0.0/src/hugin_base/makefilelib /home/mikeb/rpmbuild/BUILD/hugin-2013.0.0 /home/mikeb/rpmbuild/BUILD/hugin-2013.0.0/src/hugin_base/makefilelib /home/mikeb/rpmbuild/BUILD/hugin-2013.0.0/src/hugin_base/makefilelib/CMakeFiles/makefilelib.dir/DependInfo.cmake --color=
make -f src/foreign/vigra/vigra_impex/CMakeFiles/huginvigraimpex.dir/build.make src/foreign/vigra/vigra_impex/CMakeFiles/huginvigraimpex.dir/depend
make -f src/foreign/levmar/CMakeFiles/huginlevmar.dir/build.make src/foreign/levmar/CMakeFiles/huginlevmar.dir/depend
make[2]: Entering directory `/home/mikeb/rpmbuild/BUILD/hugin-2013.0.0'
cd /home/mikeb/rpmbuild/BUILD/hugin-2013.0.0 && /usr/bin/cmake -E cmake_depends "Unix Makefiles" /home/mikeb/rpmbuild/BUILD/hugin-2013.0.0 /home/mikeb/rpmbuild/BUILD/hugin-2013.0.0/src/foreign/levmar /home/mikeb/rpmbuild/BUILD/hugin-2013.0.0 /home/mikeb/rpmbuild/BUILD/hugin-2013.0.0/src/foreign/levmar /home/mikeb/rpmbuild/BUILD/hugin-2013.0.0/src/foreign/levmar/CMakeFiles/huginlevmar.dir/DependInfo.cmake --color=
make -f src/foreign/lensdb/CMakeFiles/huginlensdb.dir/build.make src/foreign/lensdb/CMakeFiles/huginlensdb.dir/depend
make[2]: Entering directory `/home/mikeb/rpmbuild/BUILD/hugin-2013.0.0'
cd /home/mikeb/rpmbuild/BUILD/hugin-2013.0.0 && /usr/bin/cmake -E cmake_depends "Unix Makefiles" /home/mikeb/rpmbuild/BUILD/hugin-2013.0.0 /home/mikeb/rpmbuild/BUILD/hugin-2013.0.0/src/foreign/vigra/vigra_impex /home/mikeb/rpmbuild/BUILD/hugin-2013.0.0 /home/mikeb/rpmbuild/BUILD/hugin-2013.0.0/src/foreign/vigra/vigra_impex /home/mikeb/rpmbuild/BUILD/hugin-2013.0.0/src/foreign/vigra/vigra_impex/CMakeFiles/huginvigraimpex.dir/DependInfo.cmake --color=
make[2]: Entering directory `/home/mikeb/rpmbuild/BUILD/hugin-2013.0.0'
cd /home/mikeb/rpmbuild/BUILD/hugin-2013.0.0 && /usr/bin/cmake -E cmake_depends "Unix Makefiles" /home/mikeb/rpmbuild/BUILD/hugin-2013.0.0 /home/mikeb/rpmbuild/BUILD/hugin-2013.0.0/src/foreign/lensdb /home/mikeb/rpmbuild/BUILD/hugin-2013.0.0 /home/mikeb/rpmbuild/BUILD/hugin-2013.0.0/src/foreign/lensdb /home/mikeb/rpmbuild/BUILD/hugin-2013.0.0/src/foreign/lensdb/CMakeFiles/huginlensdb.dir/DependInfo.cmake --color=
make -f src/foreign/zthread/src/CMakeFiles/ZThread.dir/build.make src/foreign/zthread/src/CMakeFiles/ZThread.dir/depend
make -f src/hugin_cpfind/localfeatures/CMakeFiles/localfeatures.dir/build.make src/hugin_cpfind/localfeatures/CMakeFiles/localfeatures.dir/depend
Dependee "/home/mikeb/rpmbuild/BUILD/hugin-2013.0.0/src/hugin_base/makefilelib/CMakeFiles/makefilelib.dir/DependInfo.cmake" is newer than depender "/home/mikeb/rpmbuild/BUILD/hugin-2013.0.0/src/hugin_base/makefilelib/CMakeFiles/makefilelib.dir/depend.internal".
Dependee "/home/mikeb/rpmbuild/BUILD/hugin-2013.0.0/src/hugin_base/makefilelib/CMakeFiles/CMakeDirectoryInformation.cmake" is newer than depender "/home/mikeb/rpmbuild/BUILD/hugin-2013.0.0/src/hugin_base/makefilelib/CMakeFiles/makefilelib.dir/depend.internal".
[35m [1mScanning dependencies of target makefilelib
make[2]: Entering directory `/home/mikeb/rpmbuild/BUILD/hugin-2013.0.0'
cd /home/mikeb/rpmbuild/BUILD/hugin-2013.0.0 && /usr/bin/cmake -E cmake_depends "Unix Makefiles" /home/mikeb/rpmbuild/BUILD/hugin-2013.0.0 /home/mikeb/rpmbuild/BUILD/hugin-2013.0.0/src/hugin_cpfind/localfeatures /home/mikeb/rpmbuild/BUILD/hugin-2013.0.0 /home/mikeb/rpmbuild/BUILD/hugin-2013.0.0/src/hugin_cpfind/localfeatures /home/mikeb/rpmbuild/BUILD/hugin-2013.0.0/src/hugin_cpfind/localfeatures/CMakeFiles/localfeatures.dir/DependInfo.cmake --color=
make -f src/translations/CMakeFiles/translationshugin.dir/build.make src/translations/CMakeFiles/translationshugin.dir/depend
make[2]: Entering directory `/home/mikeb/rpmbuild/BUILD/hugin-2013.0.0'
cd /home/mikeb/rpmbuild/BUILD/hugin-2013.0.0 && /usr/bin/cmake -E cmake_depends "Unix Makefiles" /home/mikeb/rpmbuild/BUILD/hugin-2013.0.0 /home/mikeb/rpmbuild/BUILD/hugin-2013.0.0/src/foreign/zthread/src /home/mikeb/rpmbuild/BUILD/hugin-2013.0.0 /home/mikeb/rpmbuild/BUILD/hugin-2013.0.0/src/foreign/zthread/src /home/mikeb/rpmbuild/BUILD/hugin-2013.0.0/src/foreign/zthread/src/CMakeFiles/ZThread.dir/DependInfo.cmake --color=
Dependee "/home/mikeb/rpmbuild/BUILD/hugin-2013.0.0/src/foreign/levmar/CMakeFiles/huginlevmar.dir/DependInfo.cmake" is newer than depender "/home/mikeb/rpmbuild/BUILD/hugin-2013.0.0/src/foreign/levmar/CMakeFiles/huginlevmar.dir/depend.internal".
Dependee "/home/mikeb/rpmbuild/BUILD/hugin-2013.0.0/src/foreign/levmar/CMakeFiles/CMakeDirectoryInformation.cmake" is newer than depender "/home/mikeb/rpmbuild/BUILD/hugin-2013.0.0/src/foreign/levmar/CMakeFiles/huginlevmar.dir/depend.internal".
[35m [1mScanning dependencies of target huginlevmar
make[2]: Entering directory `/home/mikeb/rpmbuild/BUILD/hugin-2013.0.0'
cd /home/mikeb/rpmbuild/BUILD/hugin-2013.0.0 && /usr/bin/cmake -E cmake_depends "Unix Makefiles" /home/mikeb/rpmbuild/BUILD/hugin-2013.0.0 /home/mikeb/rpmbuild/BUILD/hugin-2013.0.0/src/translations /home/mikeb/rpmbuild/BUILD/hugin-2013.0.0 /home/mikeb/rpmbuild/BUILD/hugin-2013.0.0/src/translations /home/mikeb/rpmbuild/BUILD/hugin-2013.0.0/src/translations/CMakeFiles/translationshugin.dir/DependInfo.cmake --color=
Dependee "/home/mikeb/rpmbuild/BUILD/hugin-2013.0.0/src/foreign/lensdb/CMakeFiles/huginlensdb.dir/DependInfo.cmake" is newer than depender "/home/mikeb/rpmbuild/BUILD/hugin-2013.0.0/src/foreign/lensdb/CMakeFiles/huginlensdb.dir/depend.internal".
Dependee "/home/mikeb/rpmbuild/BUILD/hugin-2013.0.0/src/foreign/lensdb/CMakeFiles/CMakeDirectoryInformation.cmake" is newer than depender "/home/mikeb/rpmbuild/BUILD/hugin-2013.0.0/src/foreign/lensdb/CMakeFiles/huginlensdb.dir/depend.internal".
[35m [1mScanning dependencies of target huginlensdb
make -f doc/CMakeFiles/ManPages.dir/build.make doc/CMakeFiles/ManPages.dir/depend
Dependee "/home/mikeb/rpmbuild/BUILD/hugin-2013.0.0/src/foreign/vigra/vigra_impex/CMakeFiles/huginvigraimpex.dir/DependInfo.cmake" is newer than depender "/home/mikeb/rpmbuild/BUILD/hugin-2013.0.0/src/foreign/vigra/vigra_impex/CMakeFiles/huginvigraimpex.dir/depend.internal".
Dependee "/home/mikeb/rpmbuild/BUILD/hugin-2013.0.0/src/foreign/vigra/vigra_impex/CMakeFiles/CMakeDirectoryInformation.cmake" is newer than depender "/home/mikeb/rpmbuild/BUILD/hugin-2013.0.0/src/foreign/vigra/vigra_impex/CMakeFiles/huginvigraimpex.dir/depend.internal".
[35m [1mScanning dependencies of target huginvigraimpex
[0m [0mmake[2]: Entering directory `/home/mikeb/rpmbuild/BUILD/hugin-2013.0.0'
Dependee "/home/mikeb/rpmbuild/BUILD/hugin-2013.0.0/src/hugin_cpfind/localfeatures/CMakeFiles/localfeatures.dir/DependInfo.cmake" is newer than depender "/home/mikeb/rpmbuild/BUILD/hugin-2013.0.0/src/hugin_cpfind/localfeatures/CMakeFiles/localfeatures.dir/depend.internal".
cd /home/mikeb/rpmbuild/BUILD/hugin-2013.0.0 && /usr/bin/cmake -E cmake_depends "Unix Makefiles" /home/mikeb/rpmbuild/BUILD/hugin-2013.0.0 /home/mikeb/rpmbuild/BUILD/hugin-2013.0.0/doc /home/mikeb/rpmbuild/BUILD/hugin-2013.0.0 /home/mikeb/rpmbuild/BUILD/hugin-2013.0.0/doc /home/mikeb/rpmbuild/BUILD/hugin-2013.0.0/doc/CMakeFiles/ManPages.dir/DependInfo.cmake --color=
Dependee "/home/mikeb/rpmbuild/BUILD/hugin-2013.0.0/src/hugin_cpfind/localfeatures/CMakeFiles/CMakeDirectoryInformation.cmake" is newer than depender "/home/mikeb/rpmbuild/BUILD/hugin-2013.0.0/src/hugin_cpfind/localfeatures/CMakeFiles/localfeatures.dir/depend.internal".
[35m [1mScanning dependencies of target localfeatures
[0mmake[2]: Leaving directory `/home/mikeb/rpmbuild/BUILD/hugin-2013.0.0'
make[2]: Leaving directory `/home/mikeb/rpmbuild/BUILD/hugin-2013.0.0'
make -f src/hugin_base/makefilelib/CMakeFiles/makefilelib.dir/build.make src/hugin_base/makefilelib/CMakeFiles/makefilelib.dir/build
make -f src/foreign/lensdb/CMakeFiles/huginlensdb.dir/build.make src/foreign/lensdb/CMakeFiles/huginlensdb.dir/build
Dependee "/home/mikeb/rpmbuild/BUILD/hugin-2013.0.0/src/translations/CMakeFiles/translationshugin.dir/DependInfo.cmake" is newer than depender "/home/mikeb/rpmbuild/BUILD/hugin-2013.0.0/src/translations/CMakeFiles/translationshugin.dir/depend.internal".
Dependee "/home/mikeb/rpmbuild/BUILD/hugin-2013.0.0/src/translations/CMakeFiles/CMakeDirectoryInformation.cmake" is newer than depender "/home/mikeb/rpmbuild/BUILD/hugin-2013.0.0/src/translations/CMakeFiles/translationshugin.dir/depend.internal".
[35m [1mScanning dependencies of target translationshugin
[0mDependee "/home/mikeb/rpmbuild/BUILD/hugin-2013.0.0/src/foreign/zthread/src/CMakeFiles/ZThread.dir/DependInfo.cmake" is newer than depender "/home/mikeb/rpmbuild/BUILD/hugin-2013.0.0/src/foreign/zthread/src/CMakeFiles/ZThread.dir/depend.internal".
Dependee "/home/mikeb/rpmbuild/BUILD/hugin-2013.0.0/src/foreign/zthread/src/CMakeFiles/CMakeDirectoryInformation.cmake" is newer than depender "/home/mikeb/rpmbuild/BUILD/hugin-2013.0.0/src/foreign/zthread/src/CMakeFiles/ZThread.dir/depend.internal".
[35m [1mScanning dependencies of target ZThread
make[2]: Leaving directory `/home/mikeb/rpmbuild/BUILD/hugin-2013.0.0'
make[2]: Entering directory `/home/mikeb/rpmbuild/BUILD/hugin-2013.0.0'
/usr/bin/cmake -E cmake_progress_report /home/mikeb/rpmbuild/BUILD/hugin-2013.0.0/CMakeFiles
make[2]: Leaving directory `/home/mikeb/rpmbuild/BUILD/hugin-2013.0.0'
make -f src/foreign/levmar/CMakeFiles/huginlevmar.dir/build.make src/foreign/levmar/CMakeFiles/huginlevmar.dir/build
make -f src/translations/CMakeFiles/translationshugin.dir/build.make src/translations/CMakeFiles/translationshugin.dir/build
make[2]: Entering directory `/home/mikeb/rpmbuild/BUILD/hugin-2013.0.0'
/usr/bin/cmake -E cmake_progress_report /home/mikeb/rpmbuild/BUILD/hugin-2013.0.0/CMakeFiles 84
Dependee "/home/mikeb/rpmbuild/BUILD/hugin-2013.0.0/doc/CMakeFiles/ManPages.dir/DependInfo.cmake" is newer than depender "/home/mikeb/rpmbuild/BUILD/hugin-2013.0.0/doc/CMakeFiles/ManPages.dir/depend.internal".
Dependee "/home/mikeb/rpmbuild/BUILD/hugin-2013.0.0/doc/CMakeFiles/CMakeDirectoryInformation.cmake" is newer than depender "/home/mikeb/rpmbuild/BUILD/hugin-2013.0.0/doc/CMakeFiles/ManPages.dir/depend.internal".
[35m [1mScanning dependencies of target ManPages
make[2]: Entering directory `/home/mikeb/rpmbuild/BUILD/hugin-2013.0.0'
/usr/bin/cmake -E cmake_progress_report /home/mikeb/rpmbuild/BUILD/hugin-2013.0.0/CMakeFiles 92
[ 0%] make[2]: Entering directory `/home/mikeb/rpmbuild/BUILD/hugin-2013.0.0'
/usr/bin/cmake -E cmake_progress_report /home/mikeb/rpmbuild/BUILD/hugin-2013.0.0/CMakeFiles
[0mmake[2]: Leaving directory `/home/mikeb/rpmbuild/BUILD/hugin-2013.0.0'
[ 1%] [ 2%] /usr/bin/cmake -E cmake_progress_report /home/mikeb/rpmbuild/BUILD/hugin-2013.0.0/CMakeFiles 74
/usr/bin/cmake -E cmake_progress_report /home/mikeb/rpmbuild/BUILD/hugin-2013.0.0/CMakeFiles
[ 2%] make -f doc/CMakeFiles/ManPages.dir/build.make doc/CMakeFiles/ManPages.dir/build
/usr/bin/cmake -E cmake_progress_report /home/mikeb/rpmbuild/BUILD/hugin-2013.0.0/CMakeFiles
/usr/bin/cmake -E cmake_progress_report /home/mikeb/rpmbuild/BUILD/hugin-2013.0.0/CMakeFiles 85
/usr/bin/cmake -E cmake_progress_report /home/mikeb/rpmbuild/BUILD/hugin-2013.0.0/CMakeFiles
[ 2%] make[2]: Entering directory `/home/mikeb/rpmbuild/BUILD/hugin-2013.0.0'
/usr/bin/cmake -E cmake_progress_report /home/mikeb/rpmbuild/BUILD/hugin-2013.0.0/CMakeFiles
[32mBuilding CXX object src/hugin_base/makefilelib/CMakeFiles/makefilelib.dir/Comment.cpp.o
[0m[ 3%] [ 3%] /usr/bin/cmake -E cmake_progress_report /home/mikeb/rpmbuild/BUILD/hugin-2013.0.0/CMakeFiles
/usr/bin/cmake -E cmake_progress_report /home/mikeb/rpmbuild/BUILD/hugin-2013.0.0/CMakeFiles
[ 4%] [ 4%] [32mBuilding C object src/foreign/lensdb/CMakeFiles/huginlensdb.dir/PTLensDB.c.o
[0mcd /home/mikeb/rpmbuild/BUILD/hugin-2013.0.0/src/foreign/lensdb && /usr/bin/gcc -DHUGIN_HSI -O2 -g -pipe -Wall -Wp,-D_FORTIFY_SOURCE=2 -fexceptions -fstack-protector --param=ssp-buffer-size=4 -m64 -mtune=generic -O2 -g -I/home/mikeb/rpmbuild/BUILD/hugin-2013.0.0/src -I/home/mikeb/rpmbuild/BUILD/hugin-2013.0.0/src/hugin_base -I/home/mikeb/rpmbuild/BUILD/hugin-2013.0.0/src/foreign/vigra -I/home/mikeb/rpmbuild/BUILD/hugin-2013.0.0/src/celeste -I/usr/include/OpenEXR -I/usr/include/python2.6 -o CMakeFiles/huginlensdb.dir/PTLensDB.c.o -c /home/mikeb/rpmbuild/BUILD/hugin-2013.0.0/src/foreign/lensdb/PTLensDB.c
[34m [1mGenerating sv.gmo
[0m [32mBuilding C object src/foreign/levmar/CMakeFiles/huginlevmar.dir/lm.c.o
[0m/usr/bin/cmake -E cmake_progress_report /home/mikeb/rpmbuild/BUILD/hugin-2013.0.0/CMakeFiles
[ 4%] [ 4%] cd /home/mikeb/rpmbuild/BUILD/hugin-2013.0.0/src/translations && /usr/bin/msgfmt -o /home/mikeb/rpmbuild/BUILD/hugin-2013.0.0/src/translations/sv.gmo /home/mikeb/rpmbuild/BUILD/hugin-2013.0.0/src/translations/sv.po
cd /home/mikeb/rpmbuild/BUILD/hugin-2013.0.0/src/hugin_base/makefilelib && /usr/bin/c++ -Dmakefilelib_EXPORTS -DHUGIN_HSI -O2 -g -pipe -Wall -Wp,-D_FORTIFY_SOURCE=2 -fexceptions -fstack-protector --param=ssp-buffer-size=4 -m64 -mtune=generic -Wall -O2 -g -fPIC -I/home/mikeb/rpmbuild/BUILD/hugin-2013.0.0/src -I/home/mikeb/rpmbuild/BUILD/hugin-2013.0.0/src/hugin_base -I/home/mikeb/rpmbuild/BUILD/hugin-2013.0.0/src/foreign/vigra -I/home/mikeb/rpmbuild/BUILD/hugin-2013.0.0/src/celeste -I/usr/include/OpenEXR -I/usr/include/python2.6 -o CMakeFiles/makefilelib.dir/Comment.cpp.o -c /home/mikeb/rpmbuild/BUILD/hugin-2013.0.0/src/hugin_base/makefilelib/Comment.cpp
[ 4%] [ 4%] cd /home/mikeb/rpmbuild/BUILD/hugin-2013.0.0/src/foreign/levmar && /usr/bin/gcc -DHUGIN_HSI -O2 -g -pipe -Wall -Wp,-D_FORTIFY_SOURCE=2 -fexceptions -fstack-protector --param=ssp-buffer-size=4 -m64 -mtune=generic -fPIC -O2 -g -I/home/mikeb/rpmbuild/BUILD/hugin-2013.0.0/src -I/home/mikeb/rpmbuild/BUILD/hugin-2013.0.0/src/hugin_base -I/home/mikeb/rpmbuild/BUILD/hugin-2013.0.0/src/foreign/vigra -I/home/mikeb/rpmbuild/BUILD/hugin-2013.0.0/src/celeste -I/usr/include/OpenEXR -I/usr/include/python2.6 -fPIC -o CMakeFiles/huginlevmar.dir/lm.c.o -c /home/mikeb/rpmbuild/BUILD/hugin-2013.0.0/src/foreign/levmar/lm.c
[34m [1mGenerating checkpto.1.gz
[0m [32mBuilding C object src/foreign/levmar/CMakeFiles/huginlevmar.dir/Axb.c.o
[0m [34m [1mGenerating PTBatcher.1.gz
[0mcd /home/mikeb/rpmbuild/BUILD/hugin-2013.0.0/src/foreign/levmar && /usr/bin/gcc -DHUGIN_HSI -O2 -g -pipe -Wall -Wp,-D_FORTIFY_SOURCE=2 -fexceptions -fstack-protector --param=ssp-buffer-size=4 -m64 -mtune=generic -fPIC -O2 -g -I/home/mikeb/rpmbuild/BUILD/hugin-2013.0.0/src -I/home/mikeb/rpmbuild/BUILD/hugin-2013.0.0/src/hugin_base -I/home/mikeb/rpmbuild/BUILD/hugin-2013.0.0/src/foreign/vigra -I/home/mikeb/rpmbuild/BUILD/hugin-2013.0.0/src/celeste -I/usr/include/OpenEXR -I/usr/include/python2.6 -fPIC -o CMakeFiles/huginlevmar.dir/Axb.c.o -c /home/mikeb/rpmbuild/BUILD/hugin-2013.0.0/src/foreign/levmar/Axb.c
cd /home/mikeb/rpmbuild/BUILD/hugin-2013.0.0/doc && /usr/bin/pod2man --section=\"1\" "--release=\"Version: 2013.0.0\"" --center=HUGIN /home/mikeb/rpmbuild/BUILD/hugin-2013.0.0/doc/checkpto.pod /home/mikeb/rpmbuild/BUILD/hugin-2013.0.0/doc/checkpto.1
[0m [32mBuilding CXX object src/hugin_base/makefilelib/CMakeFiles/makefilelib.dir/MakefileItem.cpp.o
[34m [1mGenerating ro.gmo
[0m [0m [32mBuilding CXX object src/hugin_base/makefilelib/CMakeFiles/makefilelib.dir/VariableRef.cpp.o
[0m [32mBuilding CXX object src/hugin_base/makefilelib/CMakeFiles/makefilelib.dir/Variable.cpp.o
[0m [32mBuilding CXX object src/hugin_base/makefilelib/CMakeFiles/makefilelib.dir/Makefile.cpp.o
/usr/bin/cmake -E cmake_progress_report /home/mikeb/rpmbuild/BUILD/hugin-2013.0.0/CMakeFiles
[0m [0m [0mcd /home/mikeb/rpmbuild/BUILD/hugin-2013.0.0/src/translations && /usr/bin/msgfmt -o /home/mikeb/rpmbuild/BUILD/hugin-2013.0.0/src/translations/ro.gmo /home/mikeb/rpmbuild/BUILD/hugin-2013.0.0/src/translations/ro.po
make[2]: Leaving directory `/home/mikeb/rpmbuild/BUILD/hugin-2013.0.0'
make[2]: Leaving directory `/home/mikeb/rpmbuild/BUILD/hugin-2013.0.0'
make[2]: Leaving directory `/home/mikeb/rpmbuild/BUILD/hugin-2013.0.0'
make -f src/foreign/vigra/vigra_impex/CMakeFiles/huginvigraimpex.dir/build.make src/foreign/vigra/vigra_impex/CMakeFiles/huginvigraimpex.dir/build
[ 4%] cd /home/mikeb/rpmbuild/BUILD/hugin-2013.0.0/src/hugin_base/makefilelib && /usr/bin/c++ -Dmakefilelib_EXPORTS -DHUGIN_HSI -O2 -g -pipe -Wall -Wp,-D_FORTIFY_SOURCE=2 -fexceptions -fstack-protector --param=ssp-buffer-size=4 -m64 -mtune=generic -Wall -O2 -g -fPIC -I/home/mikeb/rpmbuild/BUILD/hugin-2013.0.0/src -I/home/mikeb/rpmbuild/BUILD/hugin-2013.0.0/src/hugin_base -I/home/mikeb/rpmbuild/BUILD/hugin-2013.0.0/src/foreign/vigra -I/home/mikeb/rpmbuild/BUILD/hugin-2013.0.0/src/celeste -I/usr/include/OpenEXR -I/usr/include/python2.6 -o CMakeFiles/makefilelib.dir/MakefileItem.cpp.o -c /home/mikeb/rpmbuild/BUILD/hugin-2013.0.0/src/hugin_base/makefilelib/MakefileItem.cpp
cd /home/mikeb/rpmbuild/BUILD/hugin-2013.0.0/src/hugin_base/makefilelib && /usr/bin/c++ -Dmakefilelib_EXPORTS -DHUGIN_HSI -O2 -g -pipe -Wall -Wp,-D_FORTIFY_SOURCE=2 -fexceptions -fstack-protector --param=ssp-buffer-size=4 -m64 -mtune=generic -Wall -O2 -g -fPIC -I/home/mikeb/rpmbuild/BUILD/hugin-2013.0.0/src -I/home/mikeb/rpmbuild/BUILD/hugin-2013.0.0/src/hugin_base -I/home/mikeb/rpmbuild/BUILD/hugin-2013.0.0/src/foreign/vigra -I/home/mikeb/rpmbuild/BUILD/hugin-2013.0.0/src/celeste -I/usr/include/OpenEXR -I/usr/include/python2.6 -o CMakeFiles/makefilelib.dir/Variable.cpp.o -c /home/mikeb/rpmbuild/BUILD/hugin-2013.0.0/src/hugin_base/makefilelib/Variable.cpp
[34m [1mGenerating hugin.1.gz
[0mcd /home/mikeb/rpmbuild/BUILD/hugin-2013.0.0/doc && /usr/bin/pod2man --section=\"1\" "--release=\"Version: 2013.0.0\"" --center=HUGIN /home/mikeb/rpmbuild/BUILD/hugin-2013.0.0/doc/PTBatcher.pod /home/mikeb/rpmbuild/BUILD/hugin-2013.0.0/doc/PTBatcher.1
make -f src/foreign/zthread/src/CMakeFiles/ZThread.dir/build.make src/foreign/zthread/src/CMakeFiles/ZThread.dir/build
cd /home/mikeb/rpmbuild/BUILD/hugin-2013.0.0/src/hugin_base/makefilelib && /usr/bin/c++ -Dmakefilelib_EXPORTS -DHUGIN_HSI -O2 -g -pipe -Wall -Wp,-D_FORTIFY_SOURCE=2 -fexceptions -fstack-protector --param=ssp-buffer-size=4 -m64 -mtune=generic -Wall -O2 -g -fPIC -I/home/mikeb/rpmbuild/BUILD/hugin-2013.0.0/src -I/home/mikeb/rpmbuild/BUILD/hugin-2013.0.0/src/hugin_base -I/home/mikeb/rpmbuild/BUILD/hugin-2013.0.0/src/foreign/vigra -I/home/mikeb/rpmbuild/BUILD/hugin-2013.0.0/src/celeste -I/usr/include/OpenEXR -I/usr/include/python2.6 -o CMakeFiles/makefilelib.dir/VariableRef.cpp.o -c /home/mikeb/rpmbuild/BUILD/hugin-2013.0.0/src/hugin_base/makefilelib/VariableRef.cpp
make[2]: Entering directory `/home/mikeb/rpmbuild/BUILD/hugin-2013.0.0'
/usr/bin/cmake -E cmake_progress_report /home/mikeb/rpmbuild/BUILD/hugin-2013.0.0/CMakeFiles
cd /home/mikeb/rpmbuild/BUILD/hugin-2013.0.0/src/hugin_base/makefilelib && /usr/bin/c++ -Dmakefilelib_EXPORTS -DHUGIN_HSI -O2 -g -pipe -Wall -Wp,-D_FORTIFY_SOURCE=2 -fexceptions -fstack-protector --param=ssp-buffer-size=4 -m64 -mtune=generic -Wall -O2 -g -fPIC -I/home/mikeb/rpmbuild/BUILD/hugin-2013.0.0/src -I/home/mikeb/rpmbuild/BUILD/hugin-2013.0.0/src/hugin_base -I/home/mikeb/rpmbuild/BUILD/hugin-2013.0.0/src/foreign/vigra -I/home/mikeb/rpmbuild/BUILD/hugin-2013.0.0/src/celeste -I/usr/include/OpenEXR -I/usr/include/python2.6 -o CMakeFiles/makefilelib.dir/Makefile.cpp.o -c /home/mikeb/rpmbuild/BUILD/hugin-2013.0.0/src/hugin_base/makefilelib/Makefile.cpp
cd /home/mikeb/rpmbuild/BUILD/hugin-2013.0.0/doc && /usr/bin/pod2man --section=\"1\" "--release=\"Version: 2013.0.0\"" --center=HUGIN /home/mikeb/rpmbuild/BUILD/hugin-2013.0.0/doc/hugin.pod /home/mikeb/rpmbuild/BUILD/hugin-2013.0.0/doc/hugin.1
make -f src/hugin_cpfind/localfeatures/CMakeFiles/localfeatures.dir/build.make src/hugin_cpfind/localfeatures/CMakeFiles/localfeatures.dir/build
make[2]: Entering directory `/home/mikeb/rpmbuild/BUILD/hugin-2013.0.0'
/usr/bin/cmake -E cmake_progress_report /home/mikeb/rpmbuild/BUILD/hugin-2013.0.0/CMakeFiles
[32mBuilding CXX object src/hugin_base/makefilelib/CMakeFiles/makefilelib.dir/Rule.cpp.o
[0m[ 4%] cd /home/mikeb/rpmbuild/BUILD/hugin-2013.0.0/src/hugin_base/makefilelib && /usr/bin/c++ -Dmakefilelib_EXPORTS -DHUGIN_HSI -O2 -g -pipe -Wall -Wp,-D_FORTIFY_SOURCE=2 -fexceptions -fstack-protector --param=ssp-buffer-size=4 -m64 -mtune=generic -Wall -O2 -g -fPIC -I/home/mikeb/rpmbuild/BUILD/hugin-2013.0.0/src -I/home/mikeb/rpmbuild/BUILD/hugin-2013.0.0/src/hugin_base -I/home/mikeb/rpmbuild/BUILD/hugin-2013.0.0/src/foreign/vigra -I/home/mikeb/rpmbuild/BUILD/hugin-2013.0.0/src/celeste -I/usr/include/OpenEXR -I/usr/include/python2.6 -o CMakeFiles/makefilelib.dir/Rule.cpp.o -c /home/mikeb/rpmbuild/BUILD/hugin-2013.0.0/src/hugin_base/makefilelib/Rule.cpp
[ 4%] make[2]: Entering directory `/home/mikeb/rpmbuild/BUILD/hugin-2013.0.0'
/usr/bin/cmake -E cmake_progress_report /home/mikeb/rpmbuild/BUILD/hugin-2013.0.0/CMakeFiles 82
[32mBuilding CXX object src/foreign/vigra/vigra_impex/CMakeFiles/huginvigraimpex.dir/bmp.cxx.o
[0mcd /home/mikeb/rpmbuild/BUILD/hugin-2013.0.0/src/foreign/vigra/vigra_impex && /usr/bin/c++ -Dhuginvigraimpex_EXPORTS -DHUGIN_HSI -O2 -g -pipe -Wall -Wp,-D_FORTIFY_SOURCE=2 -fexceptions -fstack-protector --param=ssp-buffer-size=4 -m64 -mtune=generic -O2 -g -fPIC -I/home/mikeb/rpmbuild/BUILD/hugin-2013.0.0/src -I/home/mikeb/rpmbuild/BUILD/hugin-2013.0.0/src/hugin_base -I/home/mikeb/rpmbuild/BUILD/hugin-2013.0.0/src/foreign/vigra -I/home/mikeb/rpmbuild/BUILD/hugin-2013.0.0/src/celeste -I/usr/include/OpenEXR -I/usr/include/python2.6 -o CMakeFiles/huginvigraimpex.dir/bmp.cxx.o -c /home/mikeb/rpmbuild/BUILD/hugin-2013.0.0/src/foreign/vigra/vigra_impex/bmp.cxx
[32mBuilding CXX object src/foreign/zthread/src/CMakeFiles/ZThread.dir/AtomicCount.cxx.o
[0mcd /home/mikeb/rpmbuild/BUILD/hugin-2013.0.0/src/foreign/zthread/src && /usr/bin/c++ -DHUGIN_HSI -DNDEBUG -O2 -g -pipe -Wall -Wp,-D_FORTIFY_SOURCE=2 -fexceptions -fstack-protector --param=ssp-buffer-size=4 -m64 -mtune=generic -O2 -g -I/home/mikeb/rpmbuild/BUILD/hugin-2013.0.0/src -I/home/mikeb/rpmbuild/BUILD/hugin-2013.0.0/src/hugin_base -I/home/mikeb/rpmbuild/BUILD/hugin-2013.0.0/src/foreign/vigra -I/home/mikeb/rpmbuild/BUILD/hugin-2013.0.0/src/celeste -I/usr/include/OpenEXR -I/usr/include/python2.6 -I/home/mikeb/rpmbuild/BUILD/hugin-2013.0.0/src/foreign/zthread/src/../include -o CMakeFiles/ZThread.dir/AtomicCount.cxx.o -c /home/mikeb/rpmbuild/BUILD/hugin-2013.0.0/src/foreign/zthread/src/AtomicCount.cxx
[ 5%] [32mBuilding CXX object src/hugin_cpfind/localfeatures/CMakeFiles/localfeatures.dir/RansacFiltering.cpp.o
[0mcd /home/mikeb/rpmbuild/BUILD/hugin-2013.0.0/src/hugin_cpfind/localfeatures && /usr/bin/c++ -Dlocalfeatures_EXPORTS -DHUGIN_HSI -D_FILE_OFFSET_BITS=64 -D_LARGE_FILES -D__WXGTK__ -O2 -g -pipe -Wall -Wp,-D_FORTIFY_SOURCE=2 -fexceptions -fstack-protector --param=ssp-buffer-size=4 -m64 -mtune=generic -pthread -O2 -g -fPIC -I/home/mikeb/rpmbuild/BUILD/hugin-2013.0.0/src -I/home/mikeb/rpmbuild/BUILD/hugin-2013.0.0/src/hugin_base -I/home/mikeb/rpmbuild/BUILD/hugin-2013.0.0/src/foreign/vigra -I/home/mikeb/rpmbuild/BUILD/hugin-2013.0.0/src/celeste -I/usr/include/OpenEXR -I/usr/include/python2.6 -isystem /usr/lib64/wx/include/gtk2-unicode-release-2.8 -isystem /usr/include/wx-2.8 -I/home/mikeb/rpmbuild/BUILD/hugin-2013.0.0/src/hugin1 -I/home/mikeb/rpmbuild/BUILD/hugin-2013.0.0/src/foreign/zthread/include -I/home/mikeb/rpmbuild/BUILD/hugin-2013.0.0/src/hugin_cpfind/. -o CMakeFiles/localfeatures.dir/RansacFiltering.cpp.o -c /home/mikeb/rpmbuild/BUILD/hugin-2013.0.0/src/hugin_cpfind/localfeatures/RansacFiltering.cpp
/usr/bin/cmake -E cmake_progress_report /home/mikeb/rpmbuild/BUILD/hugin-2013.0.0/CMakeFiles
[ 5%] [34m [1mGenerating ko.gmo
[0mcd /home/mikeb/rpmbuild/BUILD/hugin-2013.0.0/src/translations && /usr/bin/msgfmt -o /home/mikeb/rpmbuild/BUILD/hugin-2013.0.0/src/translations/ko.gmo /home/mikeb/rpmbuild/BUILD/hugin-2013.0.0/src/translations/ko.po
/usr/bin/cmake -E cmake_progress_report /home/mikeb/rpmbuild/BUILD/hugin-2013.0.0/CMakeFiles 93
[ 6%] [34m [1mGenerating zh_CN.gmo
[0mcd /home/mikeb/rpmbuild/BUILD/hugin-2013.0.0/src/translations && /usr/bin/msgfmt -o /home/mikeb/rpmbuild/BUILD/hugin-2013.0.0/src/translations/zh_CN.gmo /home/mikeb/rpmbuild/BUILD/hugin-2013.0.0/src/translations/zh_CN.po
cd /home/mikeb/rpmbuild/BUILD/hugin-2013.0.0/doc && /bin/gzip -f /home/mikeb/rpmbuild/BUILD/hugin-2013.0.0/doc/checkpto.1
/usr/bin/cmake -E cmake_progress_report /home/mikeb/rpmbuild/BUILD/hugin-2013.0.0/CMakeFiles
[ 6%] [34m [1mGenerating nl.gmo
[0mcd /home/mikeb/rpmbuild/BUILD/hugin-2013.0.0/src/translations && /usr/bin/msgfmt -o /home/mikeb/rpmbuild/BUILD/hugin-2013.0.0/src/translations/nl.gmo /home/mikeb/rpmbuild/BUILD/hugin-2013.0.0/src/translations/nl.po
cd /home/mikeb/rpmbuild/BUILD/hugin-2013.0.0/doc && /bin/gzip -f /home/mikeb/rpmbuild/BUILD/hugin-2013.0.0/doc/PTBatcher.1
/usr/bin/cmake -E cmake_progress_report /home/mikeb/rpmbuild/BUILD/hugin-2013.0.0/CMakeFiles
/usr/bin/cmake -E cmake_progress_report /home/mikeb/rpmbuild/BUILD/hugin-2013.0.0/CMakeFiles 1
[ 6%] cd /home/mikeb/rpmbuild/BUILD/hugin-2013.0.0/doc && /bin/gzip -f /home/mikeb/rpmbuild/BUILD/hugin-2013.0.0/doc/hugin.1
[ 7%] [34m [1mGenerating ru.gmo
[0mcd /home/mikeb/rpmbuild/BUILD/hugin-2013.0.0/src/translations && /usr/bin/msgfmt -o /home/mikeb/rpmbuild/BUILD/hugin-2013.0.0/src/translations/ru.gmo /home/mikeb/rpmbuild/BUILD/hugin-2013.0.0/src/translations/ru.po
/usr/bin/cmake -E cmake_progress_report /home/mikeb/rpmbuild/BUILD/hugin-2013.0.0/CMakeFiles 94
[34m [1mGenerating pano_trafo.1.gz
[0mcd /home/mikeb/rpmbuild/BUILD/hugin-2013.0.0/doc && /usr/bin/pod2man --section=\"1\" "--release=\"Version: 2013.0.0\"" --center=HUGIN /home/mikeb/rpmbuild/BUILD/hugin-2013.0.0/doc/pano_trafo.pod /home/mikeb/rpmbuild/BUILD/hugin-2013.0.0/doc/pano_trafo.1
[ 8%] [34m [1mGenerating da.gmo
[0mcd /home/mikeb/rpmbuild/BUILD/hugin-2013.0.0/src/translations && /usr/bin/msgfmt -o /home/mikeb/rpmbuild/BUILD/hugin-2013.0.0/src/translations/da.gmo /home/mikeb/rpmbuild/BUILD/hugin-2013.0.0/src/translations/da.po
/usr/bin/cmake -E cmake_progress_report /home/mikeb/rpmbuild/BUILD/hugin-2013.0.0/CMakeFiles
[ 8%] [34m [1mGenerating pto2mk.1.gz
[0mcd /home/mikeb/rpmbuild/BUILD/hugin-2013.0.0/doc && /usr/bin/pod2man --section=\"1\" "--release=\"Version: 2013.0.0\"" --center=HUGIN /home/mikeb/rpmbuild/BUILD/hugin-2013.0.0/doc/pto2mk.pod /home/mikeb/rpmbuild/BUILD/hugin-2013.0.0/doc/pto2mk.1
/usr/bin/cmake -E cmake_progress_report /home/mikeb/rpmbuild/BUILD/hugin-2013.0.0/CMakeFiles
[ 8%] [34m [1mGenerating autopano-noop.sh.1.gz
[0mcd /home/mikeb/rpmbuild/BUILD/hugin-2013.0.0/doc && /usr/bin/pod2man --section=\"1\" "--release=\"Version: 2013.0.0\"" --center=HUGIN /home/mikeb/rpmbuild/BUILD/hugin-2013.0.0/doc/autopano-noop.sh.pod /home/mikeb/rpmbuild/BUILD/hugin-2013.0.0/doc/autopano-noop.sh.1
/usr/bin/cmake -E cmake_progress_report /home/mikeb/rpmbuild/BUILD/hugin-2013.0.0/CMakeFiles 2
[ 9%] [34m [1mGenerating pto_merge.1.gz
[0mcd /home/mikeb/rpmbuild/BUILD/hugin-2013.0.0/doc && /usr/bin/pod2man --section=\"1\" "--release=\"Version: 2013.0.0\"" --center=HUGIN /home/mikeb/rpmbuild/BUILD/hugin-2013.0.0/doc/pto_merge.pod /home/mikeb/rpmbuild/BUILD/hugin-2013.0.0/doc/pto_merge.1
/usr/bin/cmake -E cmake_progress_report /home/mikeb/rpmbuild/BUILD/hugin-2013.0.0/CMakeFiles
[ 9%] [34m [1mGenerating it.gmo
[0mcd /home/mikeb/rpmbuild/BUILD/hugin-2013.0.0/src/translations && /usr/bin/msgfmt -o /home/mikeb/rpmbuild/BUILD/hugin-2013.0.0/src/translations/it.gmo /home/mikeb/rpmbuild/BUILD/hugin-2013.0.0/src/translations/it.po
/usr/bin/cmake -E cmake_progress_report /home/mikeb/rpmbuild/BUILD/hugin-2013.0.0/CMakeFiles
[ 9%] cd /home/mikeb/rpmbuild/BUILD/hugin-2013.0.0/doc && /bin/gzip -f /home/mikeb/rpmbuild/BUILD/hugin-2013.0.0/doc/pano_trafo.1
[32mBuilding CXX object src/foreign/zthread/src/CMakeFiles/ZThread.dir/Condition.cxx.o
[0mcd /home/mikeb/rpmbuild/BUILD/hugin-2013.0.0/src/foreign/zthread/src && /usr/bin/c++ -DHUGIN_HSI -DNDEBUG -O2 -g -pipe -Wall -Wp,-D_FORTIFY_SOURCE=2 -fexceptions -fstack-protector --param=ssp-buffer-size=4 -m64 -mtune=generic -O2 -g -I/home/mikeb/rpmbuild/BUILD/hugin-2013.0.0/src -I/home/mikeb/rpmbuild/BUILD/hugin-2013.0.0/src/hugin_base -I/home/mikeb/rpmbuild/BUILD/hugin-2013.0.0/src/foreign/vigra -I/home/mikeb/rpmbuild/BUILD/hugin-2013.0.0/src/celeste -I/usr/include/OpenEXR -I/usr/include/python2.6 -I/home/mikeb/rpmbuild/BUILD/hugin-2013.0.0/src/foreign/zthread/src/../include -o CMakeFiles/ZThread.dir/Condition.cxx.o -c /home/mikeb/rpmbuild/BUILD/hugin-2013.0.0/src/foreign/zthread/src/Condition.cxx
/usr/bin/cmake -E cmake_progress_report /home/mikeb/rpmbuild/BUILD/hugin-2013.0.0/CMakeFiles
/usr/bin/cmake -E cmake_progress_report /home/mikeb/rpmbuild/BUILD/hugin-2013.0.0/CMakeFiles
[31m [1mLinking C static library libhuginlensdb.a
[0mcd /home/mikeb/rpmbuild/BUILD/hugin-2013.0.0/src/foreign/lensdb && /usr/bin/cmake -P CMakeFiles/huginlensdb.dir/cmake_clean_target.cmake
[ 9%] [ 9%] [32mBuilding CXX object src/hugin_cpfind/localfeatures/CMakeFiles/localfeatures.dir/Homography.cpp.o
[0mcd /home/mikeb/rpmbuild/BUILD/hugin-2013.0.0/src/hugin_cpfind/localfeatures && /usr/bin/c++ -Dlocalfeatures_EXPORTS -DHUGIN_HSI -D_FILE_OFFSET_BITS=64 -D_LARGE_FILES -D__WXGTK__ -O2 -g -pipe -Wall -Wp,-D_FORTIFY_SOURCE=2 -fexceptions -fstack-protector --param=ssp-buffer-size=4 -m64 -mtune=generic -pthread -O2 -g -fPIC -I/home/mikeb/rpmbuild/BUILD/hugin-2013.0.0/src -I/home/mikeb/rpmbuild/BUILD/hugin-2013.0.0/src/hugin_base -I/home/mikeb/rpmbuild/BUILD/hugin-2013.0.0/src/foreign/vigra -I/home/mikeb/rpmbuild/BUILD/hugin-2013.0.0/src/celeste -I/usr/include/OpenEXR -I/usr/include/python2.6 -isystem /usr/lib64/wx/include/gtk2-unicode-release-2.8 -isystem /usr/include/wx-2.8 -I/home/mikeb/rpmbuild/BUILD/hugin-2013.0.0/src/hugin1 -I/home/mikeb/rpmbuild/BUILD/hugin-2013.0.0/src/foreign/zthread/include -I/home/mikeb/rpmbuild/BUILD/hugin-2013.0.0/src/hugin_cpfind/. -o CMakeFiles/localfeatures.dir/Homography.cpp.o -c /home/mikeb/rpmbuild/BUILD/hugin-2013.0.0/src/hugin_cpfind/localfeatures/Homography.cpp
[34m [1mGenerating ja.gmo
[0mcd /home/mikeb/rpmbuild/BUILD/hugin-2013.0.0/src/foreign/lensdb && /usr/bin/cmake -E cmake_link_script CMakeFiles/huginlensdb.dir/link.txt --verbose=1
cd /home/mikeb/rpmbuild/BUILD/hugin-2013.0.0/src/translations && /usr/bin/msgfmt -o /home/mikeb/rpmbuild/BUILD/hugin-2013.0.0/src/translations/ja.gmo /home/mikeb/rpmbuild/BUILD/hugin-2013.0.0/src/translations/ja.po
/usr/bin/ar cr libhuginlensdb.a CMakeFiles/huginlensdb.dir/PTLensDB.c.o
/usr/bin/ranlib libhuginlensdb.a
make[2]: Leaving directory `/home/mikeb/rpmbuild/BUILD/hugin-2013.0.0'
/usr/bin/cmake -E cmake_progress_report /home/mikeb/rpmbuild/BUILD/hugin-2013.0.0/CMakeFiles
cd /home/mikeb/rpmbuild/BUILD/hugin-2013.0.0/doc && /bin/gzip -f /home/mikeb/rpmbuild/BUILD/hugin-2013.0.0/doc/pto2mk.1
cd /home/mikeb/rpmbuild/BUILD/hugin-2013.0.0/doc && /bin/gzip -f /home/mikeb/rpmbuild/BUILD/hugin-2013.0.0/doc/pto_merge.1
[ 9%] /usr/bin/cmake -E cmake_progress_report /home/mikeb/rpmbuild/BUILD/hugin-2013.0.0/CMakeFiles 95
Built target huginlensdb
[ 10%] /usr/bin/cmake -E cmake_progress_report /home/mikeb/rpmbuild/BUILD/hugin-2013.0.0/CMakeFiles 76
/usr/bin/cmake -E cmake_progress_report /home/mikeb/rpmbuild/BUILD/hugin-2013.0.0/CMakeFiles 14
[ 11%] [ 12%] cd /home/mikeb/rpmbuild/BUILD/hugin-2013.0.0/doc && /bin/gzip -f /home/mikeb/rpmbuild/BUILD/hugin-2013.0.0/doc/autopano-noop.sh.1
[34m [1mGenerating bg.gmo
[0mcd /home/mikeb/rpmbuild/BUILD/hugin-2013.0.0/src/translations && /usr/bin/msgfmt -o /home/mikeb/rpmbuild/BUILD/hugin-2013.0.0/src/translations/bg.gmo /home/mikeb/rpmbuild/BUILD/hugin-2013.0.0/src/translations/bg.po
[32mBuilding CXX object src/foreign/vigra/vigra_impex/CMakeFiles/huginvigraimpex.dir/byteorder.cxx.o
[0m [32mBuilding CXX object src/foreign/zthread/src/CMakeFiles/ZThread.dir/ConcurrentExecutor.cxx.o
/usr/bin/cmake -E cmake_progress_report /home/mikeb/rpmbuild/BUILD/hugin-2013.0.0/CMakeFiles
[0mcd /home/mikeb/rpmbuild/BUILD/hugin-2013.0.0/src/foreign/vigra/vigra_impex && /usr/bin/c++ -Dhuginvigraimpex_EXPORTS -DHUGIN_HSI -O2 -g -pipe -Wall -Wp,-D_FORTIFY_SOURCE=2 -fexceptions -fstack-protector --param=ssp-buffer-size=4 -m64 -mtune=generic -O2 -g -fPIC -I/home/mikeb/rpmbuild/BUILD/hugin-2013.0.0/src -I/home/mikeb/rpmbuild/BUILD/hugin-2013.0.0/src/hugin_base -I/home/mikeb/rpmbuild/BUILD/hugin-2013.0.0/src/foreign/vigra -I/home/mikeb/rpmbuild/BUILD/hugin-2013.0.0/src/celeste -I/usr/include/OpenEXR -I/usr/include/python2.6 -o CMakeFiles/huginvigraimpex.dir/byteorder.cxx.o -c /home/mikeb/rpmbuild/BUILD/hugin-2013.0.0/src/foreign/vigra/vigra_impex/byteorder.cxx
cd /home/mikeb/rpmbuild/BUILD/hugin-2013.0.0/src/foreign/zthread/src && /usr/bin/c++ -DHUGIN_HSI -DNDEBUG -O2 -g -pipe -Wall -Wp,-D_FORTIFY_SOURCE=2 -fexceptions -fstack-protector --param=ssp-buffer-size=4 -m64 -mtune=generic -O2 -g -I/home/mikeb/rpmbuild/BUILD/hugin-2013.0.0/src -I/home/mikeb/rpmbuild/BUILD/hugin-2013.0.0/src/hugin_base -I/home/mikeb/rpmbuild/BUILD/hugin-2013.0.0/src/foreign/vigra -I/home/mikeb/rpmbuild/BUILD/hugin-2013.0.0/src/celeste -I/usr/include/OpenEXR -I/usr/include/python2.6 -I/home/mikeb/rpmbuild/BUILD/hugin-2013.0.0/src/foreign/zthread/src/../include -o CMakeFiles/ZThread.dir/ConcurrentExecutor.cxx.o -c /home/mikeb/rpmbuild/BUILD/hugin-2013.0.0/src/foreign/zthread/src/ConcurrentExecutor.cxx
[ 12%] [34m [1mGenerating matchpoint.1.gz
[0mcd /home/mikeb/rpmbuild/BUILD/hugin-2013.0.0/doc && /usr/bin/pod2man --section=\"1\" "--release=\"Version: 2013.0.0\"" --center=HUGIN /home/mikeb/rpmbuild/BUILD/hugin-2013.0.0/doc/matchpoint.pod /home/mikeb/rpmbuild/BUILD/hugin-2013.0.0/doc/matchpoint.1
/usr/bin/cmake -E cmake_progress_report /home/mikeb/rpmbuild/BUILD/hugin-2013.0.0/CMakeFiles
[ 12%] [32mBuilding CXX object src/foreign/vigra/vigra_impex/CMakeFiles/huginvigraimpex.dir/codecmanager.cxx.o
[0mcd /home/mikeb/rpmbuild/BUILD/hugin-2013.0.0/src/foreign/vigra/vigra_impex && /usr/bin/c++ -Dhuginvigraimpex_EXPORTS -DHUGIN_HSI -O2 -g -pipe -Wall -Wp,-D_FORTIFY_SOURCE=2 -fexceptions -fstack-protector --param=ssp-buffer-size=4 -m64 -mtune=generic -O2 -g -fPIC -I/home/mikeb/rpmbuild/BUILD/hugin-2013.0.0/src -I/home/mikeb/rpmbuild/BUILD/hugin-2013.0.0/src/hugin_base -I/home/mikeb/rpmbuild/BUILD/hugin-2013.0.0/src/foreign/vigra -I/home/mikeb/rpmbuild/BUILD/hugin-2013.0.0/src/celeste -I/usr/include/OpenEXR -I/usr/include/python2.6 -o CMakeFiles/huginvigraimpex.dir/codecmanager.cxx.o -c /home/mikeb/rpmbuild/BUILD/hugin-2013.0.0/src/foreign/vigra/vigra_impex/codecmanager.cxx
/usr/bin/cmake -E cmake_progress_report /home/mikeb/rpmbuild/BUILD/hugin-2013.0.0/CMakeFiles
[ 12%] [34m [1mGenerating sk.gmo
[0mcd /home/mikeb/rpmbuild/BUILD/hugin-2013.0.0/src/translations && /usr/bin/msgfmt -o /home/mikeb/rpmbuild/BUILD/hugin-2013.0.0/src/translations/sk.gmo /home/mikeb/rpmbuild/BUILD/hugin-2013.0.0/src/translations/sk.po
/usr/bin/cmake -E cmake_progress_report /home/mikeb/rpmbuild/BUILD/hugin-2013.0.0/CMakeFiles
[ 12%] [34m [1mGenerating fr.gmo
[0mcd /home/mikeb/rpmbuild/BUILD/hugin-2013.0.0/src/translations && /usr/bin/msgfmt -o /home/mikeb/rpmbuild/BUILD/hugin-2013.0.0/src/translations/fr.gmo /home/mikeb/rpmbuild/BUILD/hugin-2013.0.0/src/translations/fr.po
/usr/bin/cmake -E cmake_progress_report /home/mikeb/rpmbuild/BUILD/hugin-2013.0.0/CMakeFiles
[ 12%] cd /home/mikeb/rpmbuild/BUILD/hugin-2013.0.0/doc && /bin/gzip -f /home/mikeb/rpmbuild/BUILD/hugin-2013.0.0/doc/matchpoint.1
[34m [1mGenerating zh_TW.gmo
[0mcd /home/mikeb/rpmbuild/BUILD/hugin-2013.0.0/src/translations && /usr/bin/msgfmt -o /home/mikeb/rpmbuild/BUILD/hugin-2013.0.0/src/translations/zh_TW.gmo /home/mikeb/rpmbuild/BUILD/hugin-2013.0.0/src/translations/zh_TW.po
/usr/bin/cmake -E cmake_progress_report /home/mikeb/rpmbuild/BUILD/hugin-2013.0.0/CMakeFiles
[ 12%] [34m [1mGenerating hugin_stitch_project.1.gz
[0mcd /home/mikeb/rpmbuild/BUILD/hugin-2013.0.0/doc && /usr/bin/pod2man --section=\"1\" "--release=\"Version: 2013.0.0\"" --center=HUGIN /home/mikeb/rpmbuild/BUILD/hugin-2013.0.0/doc/hugin_stitch_project.pod /home/mikeb/rpmbuild/BUILD/hugin-2013.0.0/doc/hugin_stitch_project.1
In file included from /home/mikeb/rpmbuild/BUILD/hugin-2013.0.0/src/foreign/zthread/src/../include/zthread/ConcurrentExecutor.h:26,
from /home/mikeb/rpmbuild/BUILD/hugin-2013.0.0/src/foreign/zthread/src/ConcurrentExecutor.cxx:23:
/home/mikeb/rpmbuild/BUILD/hugin-2013.0.0/src/foreign/zthread/src/../include/zthread/PoolExecutor.h:58: warning: 'ZThread::PoolExecutor' has a field 'ZThread::PoolExecutor::_impl' whose type uses the anonymous namespace
/usr/bin/cmake -E cmake_progress_report /home/mikeb/rpmbuild/BUILD/hugin-2013.0.0/CMakeFiles 96
[ 13%] [34m [1mGenerating hu.gmo
[0mcd /home/mikeb/rpmbuild/BUILD/hugin-2013.0.0/src/translations && /usr/bin/msgfmt -o /home/mikeb/rpmbuild/BUILD/hugin-2013.0.0/src/translations/hu.gmo /home/mikeb/rpmbuild/BUILD/hugin-2013.0.0/src/translations/hu.po
/usr/bin/cmake -E cmake_progress_report /home/mikeb/rpmbuild/BUILD/hugin-2013.0.0/CMakeFiles
[ 13%] [32mBuilding C object src/foreign/levmar/CMakeFiles/huginlevmar.dir/misc.c.o
[0mcd /home/mikeb/rpmbuild/BUILD/hugin-2013.0.0/src/foreign/levmar && /usr/bin/gcc -DHUGIN_HSI -O2 -g -pipe -Wall -Wp,-D_FORTIFY_SOURCE=2 -fexceptions -fstack-protector --param=ssp-buffer-size=4 -m64 -mtune=generic -fPIC -O2 -g -I/home/mikeb/rpmbuild/BUILD/hugin-2013.0.0/src -I/home/mikeb/rpmbuild/BUILD/hugin-2013.0.0/src/hugin_base -I/home/mikeb/rpmbuild/BUILD/hugin-2013.0.0/src/foreign/vigra -I/home/mikeb/rpmbuild/BUILD/hugin-2013.0.0/src/celeste -I/usr/include/OpenEXR -I/usr/include/python2.6 -fPIC -o CMakeFiles/huginlevmar.dir/misc.c.o -c /home/mikeb/rpmbuild/BUILD/hugin-2013.0.0/src/foreign/levmar/misc.c
/usr/bin/cmake -E cmake_progress_report /home/mikeb/rpmbuild/BUILD/hugin-2013.0.0/CMakeFiles
cd /home/mikeb/rpmbuild/BUILD/hugin-2013.0.0/doc && /bin/gzip -f /home/mikeb/rpmbuild/BUILD/hugin-2013.0.0/doc/hugin_stitch_project.1
[ 13%] /usr/bin/cmake -E cmake_progress_report /home/mikeb/rpmbuild/BUILD/hugin-2013.0.0/CMakeFiles 3
[ 14%] [34m [1mGenerating en_GB.gmo
[0mcd /home/mikeb/rpmbuild/BUILD/hugin-2013.0.0/src/translations && /usr/bin/msgfmt -o /home/mikeb/rpmbuild/BUILD/hugin-2013.0.0/src/translations/en_GB.gmo /home/mikeb/rpmbuild/BUILD/hugin-2013.0.0/src/translations/en_GB.po
[34m [1mGenerating cpclean.1.gz
[0mcd /home/mikeb/rpmbuild/BUILD/hugin-2013.0.0/doc && /usr/bin/pod2man --section=\"1\" "--release=\"Version: 2013.0.0\"" --center=HUGIN /home/mikeb/rpmbuild/BUILD/hugin-2013.0.0/doc/cpclean.pod /home/mikeb/rpmbuild/BUILD/hugin-2013.0.0/doc/cpclean.1
In file included from /home/mikeb/rpmbuild/BUILD/hugin-2013.0.0/src/foreign/levmar/misc.c:42:
/home/mikeb/rpmbuild/BUILD/hugin-2013.0.0/src/foreign/levmar/misc_core.c:566:2: warning: #warning LAPACK not available, LU will be used for matrix inversion when computing the covariance; this might be unstable at times
In file included from /home/mikeb/rpmbuild/BUILD/hugin-2013.0.0/src/foreign/levmar/misc.c:57:
/home/mikeb/rpmbuild/BUILD/hugin-2013.0.0/src/foreign/levmar/misc_core.c:566:2: warning: #warning LAPACK not available, LU will be used for matrix inversion when computing the covariance; this might be unstable at times
/usr/bin/cmake -E cmake_progress_report /home/mikeb/rpmbuild/BUILD/hugin-2013.0.0/CMakeFiles
[ 14%] [34m [1mGenerating de.gmo
[0mcd /home/mikeb/rpmbuild/BUILD/hugin-2013.0.0/src/translations && /usr/bin/msgfmt -o /home/mikeb/rpmbuild/BUILD/hugin-2013.0.0/src/translations/de.gmo /home/mikeb/rpmbuild/BUILD/hugin-2013.0.0/src/translations/de.po
/usr/bin/cmake -E cmake_progress_report /home/mikeb/rpmbuild/BUILD/hugin-2013.0.0/CMakeFiles 97
[ 15%] /usr/bin/cmake -E cmake_progress_report /home/mikeb/rpmbuild/BUILD/hugin-2013.0.0/CMakeFiles
[34m [1mGenerating sl.gmo
[0mcd /home/mikeb/rpmbuild/BUILD/hugin-2013.0.0/src/translations && /usr/bin/msgfmt -o /home/mikeb/rpmbuild/BUILD/hugin-2013.0.0/src/translations/sl.gmo /home/mikeb/rpmbuild/BUILD/hugin-2013.0.0/src/translations/sl.po
[ 15%] [32mBuilding CXX object src/hugin_cpfind/localfeatures/CMakeFiles/localfeatures.dir/Image.cpp.o
[0mcd /home/mikeb/rpmbuild/BUILD/hugin-2013.0.0/src/hugin_cpfind/localfeatures && /usr/bin/c++ -Dlocalfeatures_EXPORTS -DHUGIN_HSI -D_FILE_OFFSET_BITS=64 -D_LARGE_FILES -D__WXGTK__ -O2 -g -pipe -Wall -Wp,-D_FORTIFY_SOURCE=2 -fexceptions -fstack-protector --param=ssp-buffer-size=4 -m64 -mtune=generic -pthread -O2 -g -fPIC -I/home/mikeb/rpmbuild/BUILD/hugin-2013.0.0/src -I/home/mikeb/rpmbuild/BUILD/hugin-2013.0.0/src/hugin_base -I/home/mikeb/rpmbuild/BUILD/hugin-2013.0.0/src/foreign/vigra -I/home/mikeb/rpmbuild/BUILD/hugin-2013.0.0/src/celeste -I/usr/include/OpenEXR -I/usr/include/python2.6 -isystem /usr/lib64/wx/include/gtk2-unicode-release-2.8 -isystem /usr/include/wx-2.8 -I/home/mikeb/rpmbuild/BUILD/hugin-2013.0.0/src/hugin1 -I/home/mikeb/rpmbuild/BUILD/hugin-2013.0.0/src/foreign/zthread/include -I/home/mikeb/rpmbuild/BUILD/hugin-2013.0.0/src/hugin_cpfind/. -o CMakeFiles/localfeatures.dir/Image.cpp.o -c /home/mikeb/rpmbuild/BUILD/hugin-2013.0.0/src/hugin_cpfind/localfeatures/Image.cpp
cd /home/mikeb/rpmbuild/BUILD/hugin-2013.0.0/doc && /bin/gzip -f /home/mikeb/rpmbuild/BUILD/hugin-2013.0.0/doc/cpclean.1
/usr/bin/cmake -E cmake_progress_report /home/mikeb/rpmbuild/BUILD/hugin-2013.0.0/CMakeFiles
[ 15%] [34m [1mGenerating PTBatcherGUI.1.gz
[0mcd /home/mikeb/rpmbuild/BUILD/hugin-2013.0.0/doc && /usr/bin/pod2man --section=\"1\" "--release=\"Version: 2013.0.0\"" --center=HUGIN /home/mikeb/rpmbuild/BUILD/hugin-2013.0.0/doc/PTBatcherGUI.pod /home/mikeb/rpmbuild/BUILD/hugin-2013.0.0/doc/PTBatcherGUI.1
/usr/bin/cmake -E cmake_progress_report /home/mikeb/rpmbuild/BUILD/hugin-2013.0.0/CMakeFiles
[ 15%] [34m [1mGenerating pt_BR.gmo
[0mcd /home/mikeb/rpmbuild/BUILD/hugin-2013.0.0/src/translations && /usr/bin/msgfmt -o /home/mikeb/rpmbuild/BUILD/hugin-2013.0.0/src/translations/pt_BR.gmo /home/mikeb/rpmbuild/BUILD/hugin-2013.0.0/src/translations/pt_BR.po
/usr/bin/cmake -E cmake_progress_report /home/mikeb/rpmbuild/BUILD/hugin-2013.0.0/CMakeFiles
[ 15%] cd /home/mikeb/rpmbuild/BUILD/hugin-2013.0.0/doc && /bin/gzip -f /home/mikeb/rpmbuild/BUILD/hugin-2013.0.0/doc/PTBatcherGUI.1
[34m [1mGenerating es.gmo
[0mcd /home/mikeb/rpmbuild/BUILD/hugin-2013.0.0/src/translations && /usr/bin/msgfmt -o /home/mikeb/rpmbuild/BUILD/hugin-2013.0.0/src/translations/es.gmo /home/mikeb/rpmbuild/BUILD/hugin-2013.0.0/src/translations/es.po
/usr/bin/cmake -E cmake_progress_report /home/mikeb/rpmbuild/BUILD/hugin-2013.0.0/CMakeFiles
[ 15%] /usr/bin/cmake -E cmake_progress_report /home/mikeb/rpmbuild/BUILD/hugin-2013.0.0/CMakeFiles 4
[34m [1mGenerating pano_modify.1.gz
[0mcd /home/mikeb/rpmbuild/BUILD/hugin-2013.0.0/doc && /usr/bin/pod2man --section=\"1\" "--release=\"Version: 2013.0.0\"" --center=HUGIN /home/mikeb/rpmbuild/BUILD/hugin-2013.0.0/doc/pano_modify.pod /home/mikeb/rpmbuild/BUILD/hugin-2013.0.0/doc/pano_modify.1
[ 16%] [34m [1mGenerating nona_gui.1.gz
[0mcd /home/mikeb/rpmbuild/BUILD/hugin-2013.0.0/doc && /usr/bin/pod2man --section=\"1\" "--release=\"Version: 2013.0.0\"" --center=HUGIN /home/mikeb/rpmbuild/BUILD/hugin-2013.0.0/doc/nona_gui.pod /home/mikeb/rpmbuild/BUILD/hugin-2013.0.0/doc/nona_gui.1
/usr/bin/cmake -E cmake_progress_report /home/mikeb/rpmbuild/BUILD/hugin-2013.0.0/CMakeFiles 98
[ 17%] [34m [1mGenerating eu.gmo
[0mcd /home/mikeb/rpmbuild/BUILD/hugin-2013.0.0/src/translations && /usr/bin/msgfmt -o /home/mikeb/rpmbuild/BUILD/hugin-2013.0.0/src/translations/eu.gmo /home/mikeb/rpmbuild/BUILD/hugin-2013.0.0/src/translations/eu.po
/usr/bin/cmake -E cmake_progress_report /home/mikeb/rpmbuild/BUILD/hugin-2013.0.0/CMakeFiles
[ 17%] [34m [1mGenerating uk.gmo
[0mcd /home/mikeb/rpmbuild/BUILD/hugin-2013.0.0/src/translations && /usr/bin/msgfmt -o /home/mikeb/rpmbuild/BUILD/hugin-2013.0.0/src/translations/uk.gmo /home/mikeb/rpmbuild/BUILD/hugin-2013.0.0/src/translations/uk.po
/usr/bin/cmake -E cmake_progress_report /home/mikeb/rpmbuild/BUILD/hugin-2013.0.0/CMakeFiles
[ 17%] [34m [1mGenerating pl.gmo
[0mcd /home/mikeb/rpmbuild/BUILD/hugin-2013.0.0/src/translations && /usr/bin/msgfmt -o /home/mikeb/rpmbuild/BUILD/hugin-2013.0.0/src/translations/pl.gmo /home/mikeb/rpmbuild/BUILD/hugin-2013.0.0/src/translations/pl.po
cd /home/mikeb/rpmbuild/BUILD/hugin-2013.0.0/doc && /bin/gzip -f /home/mikeb/rpmbuild/BUILD/hugin-2013.0.0/doc/pano_modify.1
/usr/bin/cmake -E cmake_progress_report /home/mikeb/rpmbuild/BUILD/hugin-2013.0.0/CMakeFiles 99
[ 18%] [34m [1mGenerating cs_CZ.gmo
[0mcd /home/mikeb/rpmbuild/BUILD/hugin-2013.0.0/src/translations && /usr/bin/msgfmt -o /home/mikeb/rpmbuild/BUILD/hugin-2013.0.0/src/translations/cs_CZ.gmo /home/mikeb/rpmbuild/BUILD/hugin-2013.0.0/src/translations/cs_CZ.po
cd /home/mikeb/rpmbuild/BUILD/hugin-2013.0.0/doc && /bin/gzip -f /home/mikeb/rpmbuild/BUILD/hugin-2013.0.0/doc/nona_gui.1
/usr/bin/cmake -E cmake_progress_report /home/mikeb/rpmbuild/BUILD/hugin-2013.0.0/CMakeFiles
/usr/bin/cmake -E cmake_progress_report /home/mikeb/rpmbuild/BUILD/hugin-2013.0.0/CMakeFiles
[ 18%] [ 18%] [32mBuilding C object src/foreign/levmar/CMakeFiles/huginlevmar.dir/lmlec.c.o
[0mcd /home/mikeb/rpmbuild/BUILD/hugin-2013.0.0/src/foreign/levmar && /usr/bin/gcc -DHUGIN_HSI -O2 -g -pipe -Wall -Wp,-D_FORTIFY_SOURCE=2 -fexceptions -fstack-protector --param=ssp-buffer-size=4 -m64 -mtune=generic -fPIC -O2 -g -I/home/mikeb/rpmbuild/BUILD/hugin-2013.0.0/src -I/home/mikeb/rpmbuild/BUILD/hugin-2013.0.0/src/hugin_base -I/home/mikeb/rpmbuild/BUILD/hugin-2013.0.0/src/foreign/vigra -I/home/mikeb/rpmbuild/BUILD/hugin-2013.0.0/src/celeste -I/usr/include/OpenEXR -I/usr/include/python2.6 -fPIC -o CMakeFiles/huginlevmar.dir/lmlec.c.o -c /home/mikeb/rpmbuild/BUILD/hugin-2013.0.0/src/foreign/levmar/lmlec.c
[34m [1mGenerating pto_var.1.gz
[0mcd /home/mikeb/rpmbuild/BUILD/hugin-2013.0.0/doc && /usr/bin/pod2man --section=\"1\" "--release=\"Version: 2013.0.0\"" --center=HUGIN /home/mikeb/rpmbuild/BUILD/hugin-2013.0.0/doc/pto_var.pod /home/mikeb/rpmbuild/BUILD/hugin-2013.0.0/doc/pto_var.1
/usr/bin/cmake -E cmake_progress_report /home/mikeb/rpmbuild/BUILD/hugin-2013.0.0/CMakeFiles
[ 18%] [34m [1mGenerating fi.gmo
[0mcd /home/mikeb/rpmbuild/BUILD/hugin-2013.0.0/src/translations && /usr/bin/msgfmt -o /home/mikeb/rpmbuild/BUILD/hugin-2013.0.0/src/translations/fi.gmo /home/mikeb/rpmbuild/BUILD/hugin-2013.0.0/src/translations/fi.po
/home/mikeb/rpmbuild/BUILD/hugin-2013.0.0/src/foreign/levmar/lmlec.c:39:2: warning: #warning Linearly constrained optimization requires LAPACK and was not compiled!
/usr/bin/cmake -E cmake_progress_report /home/mikeb/rpmbuild/BUILD/hugin-2013.0.0/CMakeFiles
[ 18%] /usr/bin/cmake -E cmake_progress_report /home/mikeb/rpmbuild/BUILD/hugin-2013.0.0/CMakeFiles 83
[ 19%] [34m [1mGenerating ca_ES.gmo
[0mcd /home/mikeb/rpmbuild/BUILD/hugin-2013.0.0/src/translations && /usr/bin/msgfmt -o /home/mikeb/rpmbuild/BUILD/hugin-2013.0.0/src/translations/ca_ES.gmo /home/mikeb/rpmbuild/BUILD/hugin-2013.0.0/src/translations/ca_ES.po
[32mBuilding CXX object src/hugin_cpfind/localfeatures/CMakeFiles/localfeatures.dir/CircularKeyPointDescriptor.cpp.o
[0mcd /home/mikeb/rpmbuild/BUILD/hugin-2013.0.0/src/hugin_cpfind/localfeatures && /usr/bin/c++ -Dlocalfeatures_EXPORTS -DHUGIN_HSI -D_FILE_OFFSET_BITS=64 -D_LARGE_FILES -D__WXGTK__ -O2 -g -pipe -Wall -Wp,-D_FORTIFY_SOURCE=2 -fexceptions -fstack-protector --param=ssp-buffer-size=4 -m64 -mtune=generic -pthread -O2 -g -fPIC -I/home/mikeb/rpmbuild/BUILD/hugin-2013.0.0/src -I/home/mikeb/rpmbuild/BUILD/hugin-2013.0.0/src/hugin_base -I/home/mikeb/rpmbuild/BUILD/hugin-2013.0.0/src/foreign/vigra -I/home/mikeb/rpmbuild/BUILD/hugin-2013.0.0/src/celeste -I/usr/include/OpenEXR -I/usr/include/python2.6 -isystem /usr/lib64/wx/include/gtk2-unicode-release-2.8 -isystem /usr/include/wx-2.8 -I/home/mikeb/rpmbuild/BUILD/hugin-2013.0.0/src/hugin1 -I/home/mikeb/rpmbuild/BUILD/hugin-2013.0.0/src/foreign/zthread/include -I/home/mikeb/rpmbuild/BUILD/hugin-2013.0.0/src/hugin_cpfind/. -o CMakeFiles/localfeatures.dir/CircularKeyPointDescriptor.cpp.o -c /home/mikeb/rpmbuild/BUILD/hugin-2013.0.0/src/hugin_cpfind/localfeatures/CircularKeyPointDescriptor.cpp
/usr/bin/cmake -E cmake_progress_report /home/mikeb/rpmbuild/BUILD/hugin-2013.0.0/CMakeFiles
[ 19%] cd /home/mikeb/rpmbuild/BUILD/hugin-2013.0.0/doc && /bin/gzip -f /home/mikeb/rpmbuild/BUILD/hugin-2013.0.0/doc/pto_var.1
[32mBuilding CXX object src/hugin_cpfind/localfeatures/CMakeFiles/localfeatures.dir/KeyPointDetector.cpp.o
[0mcd /home/mikeb/rpmbuild/BUILD/hugin-2013.0.0/src/hugin_cpfind/localfeatures && /usr/bin/c++ -Dlocalfeatures_EXPORTS -DHUGIN_HSI -D_FILE_OFFSET_BITS=64 -D_LARGE_FILES -D__WXGTK__ -O2 -g -pipe -Wall -Wp,-D_FORTIFY_SOURCE=2 -fexceptions -fstack-protector --param=ssp-buffer-size=4 -m64 -mtune=generic -pthread -O2 -g -fPIC -I/home/mikeb/rpmbuild/BUILD/hugin-2013.0.0/src -I/home/mikeb/rpmbuild/BUILD/hugin-2013.0.0/src/hugin_base -I/home/mikeb/rpmbuild/BUILD/hugin-2013.0.0/src/foreign/vigra -I/home/mikeb/rpmbuild/BUILD/hugin-2013.0.0/src/celeste -I/usr/include/OpenEXR -I/usr/include/python2.6 -isystem /usr/lib64/wx/include/gtk2-unicode-release-2.8 -isystem /usr/include/wx-2.8 -I/home/mikeb/rpmbuild/BUILD/hugin-2013.0.0/src/hugin1 -I/home/mikeb/rpmbuild/BUILD/hugin-2013.0.0/src/foreign/zthread/include -I/home/mikeb/rpmbuild/BUILD/hugin-2013.0.0/src/hugin_cpfind/. -o CMakeFiles/localfeatures.dir/KeyPointDetector.cpp.o -c /home/mikeb/rpmbuild/BUILD/hugin-2013.0.0/src/hugin_cpfind/localfeatures/KeyPointDetector.cpp
/usr/bin/cmake -E cmake_progress_report /home/mikeb/rpmbuild/BUILD/hugin-2013.0.0/CMakeFiles
[ 19%] [34m [1mGenerating vig_optimize.1.gz
[0mcd /home/mikeb/rpmbuild/BUILD/hugin-2013.0.0/doc && /usr/bin/pod2man --section=\"1\" "--release=\"Version: 2013.0.0\"" --center=HUGIN /home/mikeb/rpmbuild/BUILD/hugin-2013.0.0/doc/vig_optimize.pod /home/mikeb/rpmbuild/BUILD/hugin-2013.0.0/doc/vig_optimize.1
make[2]: Leaving directory `/home/mikeb/rpmbuild/BUILD/hugin-2013.0.0'
/usr/bin/cmake -E cmake_progress_report /home/mikeb/rpmbuild/BUILD/hugin-2013.0.0/CMakeFiles 92 93 94 95 96 97 98 99
[ 19%] /usr/bin/cmake -E cmake_progress_report /home/mikeb/rpmbuild/BUILD/hugin-2013.0.0/CMakeFiles 86
Built target translationshugin
/usr/bin/cmake -E cmake_progress_report /home/mikeb/rpmbuild/BUILD/hugin-2013.0.0/CMakeFiles
[ 20%] [ 20%] [32mBuilding CXX object src/hugin_base/makefilelib/CMakeFiles/makefilelib.dir/AutoVariable.cpp.o
[0m [32mBuilding CXX object src/hugin_base/makefilelib/CMakeFiles/makefilelib.dir/VariableDef.cpp.o
[0mcd /home/mikeb/rpmbuild/BUILD/hugin-2013.0.0/src/hugin_base/makefilelib && /usr/bin/c++ -Dmakefilelib_EXPORTS -DHUGIN_HSI -O2 -g -pipe -Wall -Wp,-D_FORTIFY_SOURCE=2 -fexceptions -fstack-protector --param=ssp-buffer-size=4 -m64 -mtune=generic -Wall -O2 -g -fPIC -I/home/mikeb/rpmbuild/BUILD/hugin-2013.0.0/src -I/home/mikeb/rpmbuild/BUILD/hugin-2013.0.0/src/hugin_base -I/home/mikeb/rpmbuild/BUILD/hugin-2013.0.0/src/foreign/vigra -I/home/mikeb/rpmbuild/BUILD/hugin-2013.0.0/src/celeste -I/usr/include/OpenEXR -I/usr/include/python2.6 -o CMakeFiles/makefilelib.dir/AutoVariable.cpp.o -c /home/mikeb/rpmbuild/BUILD/hugin-2013.0.0/src/hugin_base/makefilelib/AutoVariable.cpp
cd /home/mikeb/rpmbuild/BUILD/hugin-2013.0.0/src/hugin_base/makefilelib && /usr/bin/c++ -Dmakefilelib_EXPORTS -DHUGIN_HSI -O2 -g -pipe -Wall -Wp,-D_FORTIFY_SOURCE=2 -fexceptions -fstack-protector --param=ssp-buffer-size=4 -m64 -mtune=generic -Wall -O2 -g -fPIC -I/home/mikeb/rpmbuild/BUILD/hugin-2013.0.0/src -I/home/mikeb/rpmbuild/BUILD/hugin-2013.0.0/src/hugin_base -I/home/mikeb/rpmbuild/BUILD/hugin-2013.0.0/src/foreign/vigra -I/home/mikeb/rpmbuild/BUILD/hugin-2013.0.0/src/celeste -I/usr/include/OpenEXR -I/usr/include/python2.6 -o CMakeFiles/makefilelib.dir/VariableDef.cpp.o -c /home/mikeb/rpmbuild/BUILD/hugin-2013.0.0/src/hugin_base/makefilelib/VariableDef.cpp
/usr/bin/cmake -E cmake_progress_report /home/mikeb/rpmbuild/BUILD/hugin-2013.0.0/CMakeFiles 75
[ 21%] [32mBuilding C object src/foreign/levmar/CMakeFiles/huginlevmar.dir/lmbc.c.o
[0mcd /home/mikeb/rpmbuild/BUILD/hugin-2013.0.0/src/foreign/levmar && /usr/bin/gcc -DHUGIN_HSI -O2 -g -pipe -Wall -Wp,-D_FORTIFY_SOURCE=2 -fexceptions -fstack-protector --param=ssp-buffer-size=4 -m64 -mtune=generic -fPIC -O2 -g -I/home/mikeb/rpmbuild/BUILD/hugin-2013.0.0/src -I/home/mikeb/rpmbuild/BUILD/hugin-2013.0.0/src/hugin_base -I/home/mikeb/rpmbuild/BUILD/hugin-2013.0.0/src/foreign/vigra -I/home/mikeb/rpmbuild/BUILD/hugin-2013.0.0/src/celeste -I/usr/include/OpenEXR -I/usr/include/python2.6 -fPIC -o CMakeFiles/huginlevmar.dir/lmbc.c.o -c /home/mikeb/rpmbuild/BUILD/hugin-2013.0.0/src/foreign/levmar/lmbc.c
/home/mikeb/rpmbuild/BUILD/hugin-2013.0.0/src/hugin_cpfind/localfeatures/CircularKeyPointDescriptor.cpp:174:2: warning: #warning use LUT after parameter tuning
/usr/bin/cmake -E cmake_progress_report /home/mikeb/rpmbuild/BUILD/hugin-2013.0.0/CMakeFiles
[ 21%] [32mBuilding CXX object src/foreign/zthread/src/CMakeFiles/ZThread.dir/CountingSemaphore.cxx.o
[0mcd /home/mikeb/rpmbuild/BUILD/hugin-2013.0.0/src/foreign/zthread/src && /usr/bin/c++ -DHUGIN_HSI -DNDEBUG -O2 -g -pipe -Wall -Wp,-D_FORTIFY_SOURCE=2 -fexceptions -fstack-protector --param=ssp-buffer-size=4 -m64 -mtune=generic -O2 -g -I/home/mikeb/rpmbuild/BUILD/hugin-2013.0.0/src -I/home/mikeb/rpmbuild/BUILD/hugin-2013.0.0/src/hugin_base -I/home/mikeb/rpmbuild/BUILD/hugin-2013.0.0/src/foreign/vigra -I/home/mikeb/rpmbuild/BUILD/hugin-2013.0.0/src/celeste -I/usr/include/OpenEXR -I/usr/include/python2.6 -I/home/mikeb/rpmbuild/BUILD/hugin-2013.0.0/src/foreign/zthread/src/../include -o CMakeFiles/ZThread.dir/CountingSemaphore.cxx.o -c /home/mikeb/rpmbuild/BUILD/hugin-2013.0.0/src/foreign/zthread/src/CountingSemaphore.cxx
cd /home/mikeb/rpmbuild/BUILD/hugin-2013.0.0/doc && /bin/gzip -f /home/mikeb/rpmbuild/BUILD/hugin-2013.0.0/doc/vig_optimize.1
/usr/bin/cmake -E cmake_progress_report /home/mikeb/rpmbuild/BUILD/hugin-2013.0.0/CMakeFiles
[ 21%] [34m [1mGenerating icpfind.1.gz
[0mcd /home/mikeb/rpmbuild/BUILD/hugin-2013.0.0/doc && /usr/bin/pod2man --section=\"1\" "--release=\"Version: 2013.0.0\"" --center=HUGIN /home/mikeb/rpmbuild/BUILD/hugin-2013.0.0/doc/icpfind.pod /home/mikeb/rpmbuild/BUILD/hugin-2013.0.0/doc/icpfind.1
/usr/bin/cmake -E cmake_progress_report /home/mikeb/rpmbuild/BUILD/hugin-2013.0.0/CMakeFiles 5
[ 22%] [34m [1mGenerating align_image_stack.1.gz
[0mcd /home/mikeb/rpmbuild/BUILD/hugin-2013.0.0/doc && /usr/bin/pod2man --section=\"1\" "--release=\"Version: 2013.0.0\"" --center=HUGIN /home/mikeb/rpmbuild/BUILD/hugin-2013.0.0/doc/align_image_stack.pod /home/mikeb/rpmbuild/BUILD/hugin-2013.0.0/doc/align_image_stack.1
cd /home/mikeb/rpmbuild/BUILD/hugin-2013.0.0/doc && /bin/gzip -f /home/mikeb/rpmbuild/BUILD/hugin-2013.0.0/doc/icpfind.1
/usr/bin/cmake -E cmake_progress_report /home/mikeb/rpmbuild/BUILD/hugin-2013.0.0/CMakeFiles
[ 22%] [32mBuilding CXX object src/hugin_cpfind/localfeatures/CMakeFiles/localfeatures.dir/KeyPointIO.cpp.o
[0mcd /home/mikeb/rpmbuild/BUILD/hugin-2013.0.0/src/hugin_cpfind/localfeatures && /usr/bin/c++ -Dlocalfeatures_EXPORTS -DHUGIN_HSI -D_FILE_OFFSET_BITS=64 -D_LARGE_FILES -D__WXGTK__ -O2 -g -pipe -Wall -Wp,-D_FORTIFY_SOURCE=2 -fexceptions -fstack-protector --param=ssp-buffer-size=4 -m64 -mtune=generic -pthread -O2 -g -fPIC -I/home/mikeb/rpmbuild/BUILD/hugin-2013.0.0/src -I/home/mikeb/rpmbuild/BUILD/hugin-2013.0.0/src/hugin_base -I/home/mikeb/rpmbuild/BUILD/hugin-2013.0.0/src/foreign/vigra -I/home/mikeb/rpmbuild/BUILD/hugin-2013.0.0/src/celeste -I/usr/include/OpenEXR -I/usr/include/python2.6 -isystem /usr/lib64/wx/include/gtk2-unicode-release-2.8 -isystem /usr/include/wx-2.8 -I/home/mikeb/rpmbuild/BUILD/hugin-2013.0.0/src/hugin1 -I/home/mikeb/rpmbuild/BUILD/hugin-2013.0.0/src/foreign/zthread/include -I/home/mikeb/rpmbuild/BUILD/hugin-2013.0.0/src/hugin_cpfind/. -o CMakeFiles/localfeatures.dir/KeyPointIO.cpp.o -c /home/mikeb/rpmbuild/BUILD/hugin-2013.0.0/src/hugin_cpfind/localfeatures/KeyPointIO.cpp
/usr/bin/cmake -E cmake_progress_report /home/mikeb/rpmbuild/BUILD/hugin-2013.0.0/CMakeFiles
[ 22%] [32mBuilding CXX object src/hugin_cpfind/localfeatures/CMakeFiles/localfeatures.dir/MathStuff.cpp.o
[0mcd /home/mikeb/rpmbuild/BUILD/hugin-2013.0.0/src/hugin_cpfind/localfeatures && /usr/bin/c++ -Dlocalfeatures_EXPORTS -DHUGIN_HSI -D_FILE_OFFSET_BITS=64 -D_LARGE_FILES -D__WXGTK__ -O2 -g -pipe -Wall -Wp,-D_FORTIFY_SOURCE=2 -fexceptions -fstack-protector --param=ssp-buffer-size=4 -m64 -mtune=generic -pthread -O2 -g -fPIC -I/home/mikeb/rpmbuild/BUILD/hugin-2013.0.0/src -I/home/mikeb/rpmbuild/BUILD/hugin-2013.0.0/src/hugin_base -I/home/mikeb/rpmbuild/BUILD/hugin-2013.0.0/src/foreign/vigra -I/home/mikeb/rpmbuild/BUILD/hugin-2013.0.0/src/celeste -I/usr/include/OpenEXR -I/usr/include/python2.6 -isystem /usr/lib64/wx/include/gtk2-unicode-release-2.8 -isystem /usr/include/wx-2.8 -I/home/mikeb/rpmbuild/BUILD/hugin-2013.0.0/src/hugin1 -I/home/mikeb/rpmbuild/BUILD/hugin-2013.0.0/src/foreign/zthread/include -I/home/mikeb/rpmbuild/BUILD/hugin-2013.0.0/src/hugin_cpfind/. -o CMakeFiles/localfeatures.dir/MathStuff.cpp.o -c /home/mikeb/rpmbuild/BUILD/hugin-2013.0.0/src/hugin_cpfind/localfeatures/MathStuff.cpp
/usr/bin/cmake -E cmake_progress_report /home/mikeb/rpmbuild/BUILD/hugin-2013.0.0/CMakeFiles
[ 22%] [32mBuilding CXX object src/hugin_base/makefilelib/CMakeFiles/makefilelib.dir/Conditional.cpp.o
[0mcd /home/mikeb/rpmbuild/BUILD/hugin-2013.0.0/src/hugin_base/makefilelib && /usr/bin/c++ -Dmakefilelib_EXPORTS -DHUGIN_HSI -O2 -g -pipe -Wall -Wp,-D_FORTIFY_SOURCE=2 -fexceptions -fstack-protector --param=ssp-buffer-size=4 -m64 -mtune=generic -Wall -O2 -g -fPIC -I/home/mikeb/rpmbuild/BUILD/hugin-2013.0.0/src -I/home/mikeb/rpmbuild/BUILD/hugin-2013.0.0/src/hugin_base -I/home/mikeb/rpmbuild/BUILD/hugin-2013.0.0/src/foreign/vigra -I/home/mikeb/rpmbuild/BUILD/hugin-2013.0.0/src/celeste -I/usr/include/OpenEXR -I/usr/include/python2.6 -o CMakeFiles/makefilelib.dir/Conditional.cpp.o -c /home/mikeb/rpmbuild/BUILD/hugin-2013.0.0/src/hugin_base/makefilelib/Conditional.cpp
cd /home/mikeb/rpmbuild/BUILD/hugin-2013.0.0/doc && /bin/gzip -f /home/mikeb/rpmbuild/BUILD/hugin-2013.0.0/doc/align_image_stack.1
/usr/bin/cmake -E cmake_progress_report /home/mikeb/rpmbuild/BUILD/hugin-2013.0.0/CMakeFiles
[ 22%] [34m [1mGenerating celeste_standalone.1.gz
[0mcd /home/mikeb/rpmbuild/BUILD/hugin-2013.0.0/doc && /usr/bin/pod2man --section=\"1\" "--release=\"Version: 2013.0.0\"" --center=HUGIN /home/mikeb/rpmbuild/BUILD/hugin-2013.0.0/doc/celeste_standalone.pod /home/mikeb/rpmbuild/BUILD/hugin-2013.0.0/doc/celeste_standalone.1
cd /home/mikeb/rpmbuild/BUILD/hugin-2013.0.0/doc && /bin/gzip -f /home/mikeb/rpmbuild/BUILD/hugin-2013.0.0/doc/celeste_standalone.1
/usr/bin/cmake -E cmake_progress_report /home/mikeb/rpmbuild/BUILD/hugin-2013.0.0/CMakeFiles
[ 22%] /usr/bin/cmake -E cmake_progress_report /home/mikeb/rpmbuild/BUILD/hugin-2013.0.0/CMakeFiles 6
[34m [1mGenerating cpfind.1.gz
[0mcd /home/mikeb/rpmbuild/BUILD/hugin-2013.0.0/doc && /usr/bin/pod2man --section=\"1\" "--release=\"Version: 2013.0.0\"" --center=HUGIN /home/mikeb/rpmbuild/BUILD/hugin-2013.0.0/doc/cpfind.pod /home/mikeb/rpmbuild/BUILD/hugin-2013.0.0/doc/cpfind.1
[ 23%] [34m [1mGenerating calibrate_lens_gui.1.gz
[0mcd /home/mikeb/rpmbuild/BUILD/hugin-2013.0.0/doc && /usr/bin/pod2man --section=\"1\" "--release=\"Version: 2013.0.0\"" --center=HUGIN /home/mikeb/rpmbuild/BUILD/hugin-2013.0.0/doc/calibrate_lens_gui.pod /home/mikeb/rpmbuild/BUILD/hugin-2013.0.0/doc/calibrate_lens_gui.1
cd /home/mikeb/rpmbuild/BUILD/hugin-2013.0.0/doc && /bin/gzip -f /home/mikeb/rpmbuild/BUILD/hugin-2013.0.0/doc/calibrate_lens_gui.1
/usr/bin/cmake -E cmake_progress_report /home/mikeb/rpmbuild/BUILD/hugin-2013.0.0/CMakeFiles
[ 23%] [32mBuilding CXX object src/foreign/zthread/src/CMakeFiles/ZThread.dir/FastMutex.cxx.o
[0mcd /home/mikeb/rpmbuild/BUILD/hugin-2013.0.0/src/foreign/zthread/src && /usr/bin/c++ -DHUGIN_HSI -DNDEBUG -O2 -g -pipe -Wall -Wp,-D_FORTIFY_SOURCE=2 -fexceptions -fstack-protector --param=ssp-buffer-size=4 -m64 -mtune=generic -O2 -g -I/home/mikeb/rpmbuild/BUILD/hugin-2013.0.0/src -I/home/mikeb/rpmbuild/BUILD/hugin-2013.0.0/src/hugin_base -I/home/mikeb/rpmbuild/BUILD/hugin-2013.0.0/src/foreign/vigra -I/home/mikeb/rpmbuild/BUILD/hugin-2013.0.0/src/celeste -I/usr/include/OpenEXR -I/usr/include/python2.6 -I/home/mikeb/rpmbuild/BUILD/hugin-2013.0.0/src/foreign/zthread/src/../include -o CMakeFiles/ZThread.dir/FastMutex.cxx.o -c /home/mikeb/rpmbuild/BUILD/hugin-2013.0.0/src/foreign/zthread/src/FastMutex.cxx
cd /home/mikeb/rpmbuild/BUILD/hugin-2013.0.0/doc && /bin/gzip -f /home/mikeb/rpmbuild/BUILD/hugin-2013.0.0/doc/cpfind.1
/usr/bin/cmake -E cmake_progress_report /home/mikeb/rpmbuild/BUILD/hugin-2013.0.0/CMakeFiles
[ 23%] [34m [1mGenerating geocpset.1.gz
[0mcd /home/mikeb/rpmbuild/BUILD/hugin-2013.0.0/doc && /usr/bin/pod2man --section=\"1\" "--release=\"Version: 2013.0.0\"" --center=HUGIN /home/mikeb/rpmbuild/BUILD/hugin-2013.0.0/doc/geocpset.pod /home/mikeb/rpmbuild/BUILD/hugin-2013.0.0/doc/geocpset.1
cd /home/mikeb/rpmbuild/BUILD/hugin-2013.0.0/doc && /bin/gzip -f /home/mikeb/rpmbuild/BUILD/hugin-2013.0.0/doc/geocpset.1
/usr/bin/cmake -E cmake_progress_report /home/mikeb/rpmbuild/BUILD/hugin-2013.0.0/CMakeFiles
[ 23%] [34m [1mGenerating tca_correct.1.gz
[0mcd /home/mikeb/rpmbuild/BUILD/hugin-2013.0.0/doc && /usr/bin/pod2man --section=\"1\" "--release=\"Version: 2013.0.0\"" --center=HUGIN /home/mikeb/rpmbuild/BUILD/hugin-2013.0.0/doc/tca_correct.pod /home/mikeb/rpmbuild/BUILD/hugin-2013.0.0/doc/tca_correct.1
cd /home/mikeb/rpmbuild/BUILD/hugin-2013.0.0/doc && /bin/gzip -f /home/mikeb/rpmbuild/BUILD/hugin-2013.0.0/doc/tca_correct.1
c++: Internal error: Terminated (program cc1plus)
Please submit a full bug report.
make[2]: *** [src/hugin_base/makefilelib/CMakeFiles/makefilelib.dir/Comment.cpp.o] Error 1
make[2]: *** Waiting for unfinished jobs....
/usr/bin/cmake -E cmake_progress_report /home/mikeb/rpmbuild/BUILD/hugin-2013.0.0/CMakeFiles 15
/usr/bin/cmake -E cmake_progress_report /home/mikeb/rpmbuild/BUILD/hugin-2013.0.0/CMakeFiles 7
[ 24%] [ 25%] [32mBuilding CXX object src/foreign/zthread/src/CMakeFiles/ZThread.dir/FastRecursiveMutex.cxx.o
[0mcd /home/mikeb/rpmbuild/BUILD/hugin-2013.0.0/src/foreign/zthread/src && /usr/bin/c++ -DHUGIN_HSI -DNDEBUG -O2 -g -pipe -Wall -Wp,-D_FORTIFY_SOURCE=2 -fexceptions -fstack-protector --param=ssp-buffer-size=4 -m64 -mtune=generic -O2 -g -I/home/mikeb/rpmbuild/BUILD/hugin-2013.0.0/src -I/home/mikeb/rpmbuild/BUILD/hugin-2013.0.0/src/hugin_base -I/home/mikeb/rpmbuild/BUILD/hugin-2013.0.0/src/foreign/vigra -I/home/mikeb/rpmbuild/BUILD/hugin-2013.0.0/src/celeste -I/usr/include/OpenEXR -I/usr/include/python2.6 -I/home/mikeb/rpmbuild/BUILD/hugin-2013.0.0/src/foreign/zthread/src/../include -o CMakeFiles/ZThread.dir/FastRecursiveMutex.cxx.o -c /home/mikeb/rpmbuild/BUILD/hugin-2013.0.0/src/foreign/zthread/src/FastRecursiveMutex.cxx
[34m [1mGenerating deghosting_mask.1.gz
[0mcd /home/mikeb/rpmbuild/BUILD/hugin-2013.0.0/doc && /usr/bin/pod2man --section=\"1\" "--release=\"Version: 2013.0.0\"" --center=HUGIN /home/mikeb/rpmbuild/BUILD/hugin-2013.0.0/doc/deghosting_mask.pod /home/mikeb/rpmbuild/BUILD/hugin-2013.0.0/doc/deghosting_mask.1
/home/mikeb/rpmbuild/BUILD/hugin-2013.0.0/src/hugin_cpfind/localfeatures/CircularKeyPointDescriptor.cpp: In member function 'virtual int lfeat::CircularKeyPointDescriptor::assignOrientation(lfeat::KeyPoint&, double*) const':
/home/mikeb/rpmbuild/BUILD/hugin-2013.0.0/src/hugin_cpfind/localfeatures/CircularKeyPointDescriptor.cpp:189: warning: comparison between signed and unsigned integer expressions
/usr/bin/cmake -E cmake_progress_report /home/mikeb/rpmbuild/BUILD/hugin-2013.0.0/CMakeFiles
[ 25%] /usr/bin/cmake -E cmake_progress_report /home/mikeb/rpmbuild/BUILD/hugin-2013.0.0/CMakeFiles
[ 25%] [32mBuilding CXX object src/foreign/zthread/src/CMakeFiles/ZThread.dir/Mutex.cxx.o
[0mcd /home/mikeb/rpmbuild/BUILD/hugin-2013.0.0/src/foreign/zthread/src && /usr/bin/c++ -DHUGIN_HSI -DNDEBUG -O2 -g -pipe -Wall -Wp,-D_FORTIFY_SOURCE=2 -fexceptions -fstack-protector --param=ssp-buffer-size=4 -m64 -mtune=generic -O2 -g -I/home/mikeb/rpmbuild/BUILD/hugin-2013.0.0/src -I/home/mikeb/rpmbuild/BUILD/hugin-2013.0.0/src/hugin_base -I/home/mikeb/rpmbuild/BUILD/hugin-2013.0.0/src/foreign/vigra -I/home/mikeb/rpmbuild/BUILD/hugin-2013.0.0/src/celeste -I/usr/include/OpenEXR -I/usr/include/python2.6 -I/home/mikeb/rpmbuild/BUILD/hugin-2013.0.0/src/foreign/zthread/src/../include -o CMakeFiles/ZThread.dir/Mutex.cxx.o -c /home/mikeb/rpmbuild/BUILD/hugin-2013.0.0/src/foreign/zthread/src/Mutex.cxx
[34m [1mGenerating pto_gen.1.gz
[0mcd /home/mikeb/rpmbuild/BUILD/hugin-2013.0.0/doc && /usr/bin/pod2man --section=\"1\" "--release=\"Version: 2013.0.0\"" --center=HUGIN /home/mikeb/rpmbuild/BUILD/hugin-2013.0.0/doc/pto_gen.pod /home/mikeb/rpmbuild/BUILD/hugin-2013.0.0/doc/pto_gen.1
/usr/bin/cmake -E cmake_progress_report /home/mikeb/rpmbuild/BUILD/hugin-2013.0.0/CMakeFiles
[ 25%] /usr/bin/cmake -E cmake_progress_report /home/mikeb/rpmbuild/BUILD/hugin-2013.0.0/CMakeFiles
[ 25%] [32mBuilding CXX object src/foreign/zthread/src/CMakeFiles/ZThread.dir/RecursiveMutexImpl.cxx.o
[0mcd /home/mikeb/rpmbuild/BUILD/hugin-2013.0.0/src/foreign/zthread/src && /usr/bin/c++ -DHUGIN_HSI -DNDEBUG -O2 -g -pipe -Wall -Wp,-D_FORTIFY_SOURCE=2 -fexceptions -fstack-protector --param=ssp-buffer-size=4 -m64 -mtune=generic -O2 -g -I/home/mikeb/rpmbuild/BUILD/hugin-2013.0.0/src -I/home/mikeb/rpmbuild/BUILD/hugin-2013.0.0/src/hugin_base -I/home/mikeb/rpmbuild/BUILD/hugin-2013.0.0/src/foreign/vigra -I/home/mikeb/rpmbuild/BUILD/hugin-2013.0.0/src/celeste -I/usr/include/OpenEXR -I/usr/include/python2.6 -I/home/mikeb/rpmbuild/BUILD/hugin-2013.0.0/src/foreign/zthread/src/../include -o CMakeFiles/ZThread.dir/RecursiveMutexImpl.cxx.o -c /home/mikeb/rpmbuild/BUILD/hugin-2013.0.0/src/foreign/zthread/src/RecursiveMutexImpl.cxx
[34m [1mGenerating pto_lensstack.1.gz
[0mcd /home/mikeb/rpmbuild/BUILD/hugin-2013.0.0/doc && /usr/bin/pod2man --section=\"1\" "--release=\"Version: 2013.0.0\"" --center=HUGIN /home/mikeb/rpmbuild/BUILD/hugin-2013.0.0/doc/pto_lensstack.pod /home/mikeb/rpmbuild/BUILD/hugin-2013.0.0/doc/pto_lensstack.1
[31m [1mLinking C static library libhuginlevmar.a
[0mcd /home/mikeb/rpmbuild/BUILD/hugin-2013.0.0/src/foreign/levmar && /usr/bin/cmake -P CMakeFiles/huginlevmar.dir/cmake_clean_target.cmake
cd /home/mikeb/rpmbuild/BUILD/hugin-2013.0.0/doc && /bin/gzip -f /home/mikeb/rpmbuild/BUILD/hugin-2013.0.0/doc/deghosting_mask.1
In file included from /home/mikeb/rpmbuild/BUILD/hugin-2013.0.0/src/foreign/zthread/src/FastRecursiveLock.h:50,
from /home/mikeb/rpmbuild/BUILD/hugin-2013.0.0/src/foreign/zthread/src/FastRecursiveMutex.cxx:24:
/home/mikeb/rpmbuild/BUILD/hugin-2013.0.0/src/foreign/zthread/src/linux/FastRecursiveLock.h: In constructor 'ZThread::FastRecursiveLock::FastRecursiveLock()':
/home/mikeb/rpmbuild/BUILD/hugin-2013.0.0/src/foreign/zthread/src/linux/FastRecursiveLock.h:49: warning: missing braces around initializer for 'char [4]'
/usr/bin/cmake -E cmake_progress_report /home/mikeb/rpmbuild/BUILD/hugin-2013.0.0/CMakeFiles 16
[ 26%] /usr/bin/cmake -E cmake_progress_report /home/mikeb/rpmbuild/BUILD/hugin-2013.0.0/CMakeFiles 8
[ 27%] [32mBuilding CXX object src/foreign/zthread/src/CMakeFiles/ZThread.dir/RecursiveMutex.cxx.o
[0mcd /home/mikeb/rpmbuild/BUILD/hugin-2013.0.0/src/foreign/zthread/src && /usr/bin/c++ -DHUGIN_HSI -DNDEBUG -O2 -g -pipe -Wall -Wp,-D_FORTIFY_SOURCE=2 -fexceptions -fstack-protector --param=ssp-buffer-size=4 -m64 -mtune=generic -O2 -g -I/home/mikeb/rpmbuild/BUILD/hugin-2013.0.0/src -I/home/mikeb/rpmbuild/BUILD/hugin-2013.0.0/src/hugin_base -I/home/mikeb/rpmbuild/BUILD/hugin-2013.0.0/src/foreign/vigra -I/home/mikeb/rpmbuild/BUILD/hugin-2013.0.0/src/celeste -I/usr/include/OpenEXR -I/usr/include/python2.6 -I/home/mikeb/rpmbuild/BUILD/hugin-2013.0.0/src/foreign/zthread/src/../include -o CMakeFiles/ZThread.dir/RecursiveMutex.cxx.o -c /home/mikeb/rpmbuild/BUILD/hugin-2013.0.0/src/foreign/zthread/src/RecursiveMutex.cxx
[34m [1mGenerating hugin_hdrmerge.1.gz
[0mcd /home/mikeb/rpmbuild/BUILD/hugin-2013.0.0/doc && /usr/bin/pod2man --section=\"1\" "--release=\"Version: 2013.0.0\"" --center=HUGIN /home/mikeb/rpmbuild/BUILD/hugin-2013.0.0/doc/hugin_hdrmerge.pod /home/mikeb/rpmbuild/BUILD/hugin-2013.0.0/doc/hugin_hdrmerge.1
cd /home/mikeb/rpmbuild/BUILD/hugin-2013.0.0/src/foreign/levmar && /usr/bin/cmake -E cmake_link_script CMakeFiles/huginlevmar.dir/link.txt --verbose=1
/usr/bin/cmake -E cmake_progress_report /home/mikeb/rpmbuild/BUILD/hugin-2013.0.0/CMakeFiles
[ 27%] /usr/bin/cmake -E cmake_progress_report /home/mikeb/rpmbuild/BUILD/hugin-2013.0.0/CMakeFiles
[34m [1mGenerating fulla.1.gz
[0mcd /home/mikeb/rpmbuild/BUILD/hugin-2013.0.0/doc && /usr/bin/pod2man --section=\"1\" "--release=\"Version: 2013.0.0\"" --center=HUGIN /home/mikeb/rpmbuild/BUILD/hugin-2013.0.0/doc/fulla.pod /home/mikeb/rpmbuild/BUILD/hugin-2013.0.0/doc/fulla.1
/usr/bin/ar cr libhuginlevmar.a CMakeFiles/huginlevmar.dir/lm.c.o CMakeFiles/huginlevmar.dir/Axb.c.o CMakeFiles/huginlevmar.dir/misc.c.o CMakeFiles/huginlevmar.dir/lmlec.c.o CMakeFiles/huginlevmar.dir/lmbc.c.o
[ 27%] /usr/bin/cmake -E cmake_progress_report /home/mikeb/rpmbuild/BUILD/hugin-2013.0.0/CMakeFiles
/usr/bin/ranlib libhuginlevmar.a
[32mBuilding CXX object src/foreign/vigra/vigra_impex/CMakeFiles/huginvigraimpex.dir/gif.cxx.o
[0mcd /home/mikeb/rpmbuild/BUILD/hugin-2013.0.0/src/foreign/vigra/vigra_impex && /usr/bin/c++ -Dhuginvigraimpex_EXPORTS -DHUGIN_HSI -O2 -g -pipe -Wall -Wp,-D_FORTIFY_SOURCE=2 -fexceptions -fstack-protector --param=ssp-buffer-size=4 -m64 -mtune=generic -O2 -g -fPIC -I/home/mikeb/rpmbuild/BUILD/hugin-2013.0.0/src -I/home/mikeb/rpmbuild/BUILD/hugin-2013.0.0/src/hugin_base -I/home/mikeb/rpmbuild/BUILD/hugin-2013.0.0/src/foreign/vigra -I/home/mikeb/rpmbuild/BUILD/hugin-2013.0.0/src/celeste -I/usr/include/OpenEXR -I/usr/include/python2.6 -o CMakeFiles/huginvigraimpex.dir/gif.cxx.o -c /home/mikeb/rpmbuild/BUILD/hugin-2013.0.0/src/foreign/vigra/vigra_impex/gif.cxx
[ 27%] [31m [1mLinking CXX shared library liblocalfeatures.so
[0mcd /home/mikeb/rpmbuild/BUILD/hugin-2013.0.0/src/hugin_cpfind/localfeatures && /usr/bin/cmake -E cmake_link_script CMakeFiles/localfeatures.dir/link.txt --verbose=1
make[2]: Leaving directory `/home/mikeb/rpmbuild/BUILD/hugin-2013.0.0'
/usr/bin/cmake -E cmake_progress_report /home/mikeb/rpmbuild/BUILD/hugin-2013.0.0/CMakeFiles 74 75
[ 27%] [34m [1mGenerating nona.1.gz
[0mBuilt target huginlevmar
/usr/bin/cmake -E cmake_progress_report /home/mikeb/rpmbuild/BUILD/hugin-2013.0.0/CMakeFiles
/usr/bin/cmake -E cmake_progress_report /home/mikeb/rpmbuild/BUILD/hugin-2013.0.0/CMakeFiles 77
cd /home/mikeb/rpmbuild/BUILD/hugin-2013.0.0/doc && /usr/bin/pod2man --section=\"1\" "--release=\"Version: 2013.0.0\"" --center=HUGIN /home/mikeb/rpmbuild/BUILD/hugin-2013.0.0/doc/nona.pod /home/mikeb/rpmbuild/BUILD/hugin-2013.0.0/doc/nona.1
/usr/bin/c++ -fPIC -O2 -g -pipe -Wall -Wp,-D_FORTIFY_SOURCE=2 -fexceptions -fstack-protector --param=ssp-buffer-size=4 -m64 -mtune=generic -pthread -O2 -g -shared -Wl,-soname,liblocalfeatures.so.0.0 -o liblocalfeatures.so.0.0 CMakeFiles/localfeatures.dir/RansacFiltering.cpp.o CMakeFiles/localfeatures.dir/Homography.cpp.o CMakeFiles/localfeatures.dir/Image.cpp.o CMakeFiles/localfeatures.dir/CircularKeyPointDescriptor.cpp.o CMakeFiles/localfeatures.dir/KeyPointDetector.cpp.o CMakeFiles/localfeatures.dir/KeyPointIO.cpp.o CMakeFiles/localfeatures.dir/MathStuff.cpp.o
[ 27%] /usr/bin/cmake -E cmake_progress_report /home/mikeb/rpmbuild/BUILD/hugin-2013.0.0/CMakeFiles
[ 28%] /usr/bin/cmake -E cmake_progress_report /home/mikeb/rpmbuild/BUILD/hugin-2013.0.0/CMakeFiles
[ 28%] [ 28%] [34m [1mGenerating linefind.1.gz
[0mcd /home/mikeb/rpmbuild/BUILD/hugin-2013.0.0/doc && /usr/bin/pod2man --section=\"1\" "--release=\"Version: 2013.0.0\"" --center=HUGIN /home/mikeb/rpmbuild/BUILD/hugin-2013.0.0/doc/linefind.pod /home/mikeb/rpmbuild/BUILD/hugin-2013.0.0/doc/linefind.1
[32mBuilding CXX object src/foreign/zthread/src/CMakeFiles/ZThread.dir/Monitor.cxx.o
[0mcd /home/mikeb/rpmbuild/BUILD/hugin-2013.0.0/src/foreign/zthread/src && /usr/bin/c++ -DHUGIN_HSI -DNDEBUG -O2 -g -pipe -Wall -Wp,-D_FORTIFY_SOURCE=2 -fexceptions -fstack-protector --param=ssp-buffer-size=4 -m64 -mtune=generic -O2 -g -I/home/mikeb/rpmbuild/BUILD/hugin-2013.0.0/src -I/home/mikeb/rpmbuild/BUILD/hugin-2013.0.0/src/hugin_base -I/home/mikeb/rpmbuild/BUILD/hugin-2013.0.0/src/foreign/vigra -I/home/mikeb/rpmbuild/BUILD/hugin-2013.0.0/src/celeste -I/usr/include/OpenEXR -I/usr/include/python2.6 -I/home/mikeb/rpmbuild/BUILD/hugin-2013.0.0/src/foreign/zthread/src/../include -o CMakeFiles/ZThread.dir/Monitor.cxx.o -c /home/mikeb/rpmbuild/BUILD/hugin-2013.0.0/src/foreign/zthread/src/Monitor.cxx
[32mBuilding CXX object src/foreign/vigra/vigra_impex/CMakeFiles/huginvigraimpex.dir/imageinfo.cxx.o
[0mcd /home/mikeb/rpmbuild/BUILD/hugin-2013.0.0/src/hugin_cpfind/localfeatures && /usr/bin/cmake -E cmake_symlink_library liblocalfeatures.so.0.0 liblocalfeatures.so.0.0 liblocalfeatures.so
cd /home/mikeb/rpmbuild/BUILD/hugin-2013.0.0/src/foreign/vigra/vigra_impex && /usr/bin/c++ -Dhuginvigraimpex_EXPORTS -DHUGIN_HSI -O2 -g -pipe -Wall -Wp,-D_FORTIFY_SOURCE=2 -fexceptions -fstack-protector --param=ssp-buffer-size=4 -m64 -mtune=generic -O2 -g -fPIC -I/home/mikeb/rpmbuild/BUILD/hugin-2013.0.0/src -I/home/mikeb/rpmbuild/BUILD/hugin-2013.0.0/src/hugin_base -I/home/mikeb/rpmbuild/BUILD/hugin-2013.0.0/src/foreign/vigra -I/home/mikeb/rpmbuild/BUILD/hugin-2013.0.0/src/celeste -I/usr/include/OpenEXR -I/usr/include/python2.6 -o CMakeFiles/huginvigraimpex.dir/imageinfo.cxx.o -c /home/mikeb/rpmbuild/BUILD/hugin-2013.0.0/src/foreign/vigra/vigra_impex/imageinfo.cxx
[32mBuilding CXX object src/foreign/vigra/vigra_impex/CMakeFiles/huginvigraimpex.dir/jpeg.cxx.o
[0m/usr/bin/cmake -E cmake_progress_report /home/mikeb/rpmbuild/BUILD/hugin-2013.0.0/CMakeFiles
cd /home/mikeb/rpmbuild/BUILD/hugin-2013.0.0/src/foreign/vigra/vigra_impex && /usr/bin/c++ -Dhuginvigraimpex_EXPORTS -DHUGIN_HSI -O2 -g -pipe -Wall -Wp,-D_FORTIFY_SOURCE=2 -fexceptions -fstack-protector --param=ssp-buffer-size=4 -m64 -mtune=generic -O2 -g -fPIC -I/home/mikeb/rpmbuild/BUILD/hugin-2013.0.0/src -I/home/mikeb/rpmbuild/BUILD/hugin-2013.0.0/src/hugin_base -I/home/mikeb/rpmbuild/BUILD/hugin-2013.0.0/src/foreign/vigra -I/home/mikeb/rpmbuild/BUILD/hugin-2013.0.0/src/celeste -I/usr/include/OpenEXR -I/usr/include/python2.6 -o CMakeFiles/huginvigraimpex.dir/jpeg.cxx.o -c /home/mikeb/rpmbuild/BUILD/hugin-2013.0.0/src/foreign/vigra/vigra_impex/jpeg.cxx
cd /home/mikeb/rpmbuild/BUILD/hugin-2013.0.0/doc && /bin/gzip -f /home/mikeb/rpmbuild/BUILD/hugin-2013.0.0/doc/pto_gen.1
[ 28%] make[2]: Leaving directory `/home/mikeb/rpmbuild/BUILD/hugin-2013.0.0'
/usr/bin/cmake -E cmake_progress_report /home/mikeb/rpmbuild/BUILD/hugin-2013.0.0/CMakeFiles 82 83
[ 28%] Built target localfeatures
/usr/bin/cmake -E cmake_progress_report /home/mikeb/rpmbuild/BUILD/hugin-2013.0.0/CMakeFiles
cd /home/mikeb/rpmbuild/BUILD/hugin-2013.0.0/doc && /bin/gzip -f /home/mikeb/rpmbuild/BUILD/hugin-2013.0.0/doc/pto_lensstack.1
[32mBuilding CXX object src/foreign/zthread/src/CMakeFiles/ZThread.dir/PoolExecutor.cxx.o
[0mcd /home/mikeb/rpmbuild/BUILD/hugin-2013.0.0/src/foreign/zthread/src && /usr/bin/c++ -DHUGIN_HSI -DNDEBUG -O2 -g -pipe -Wall -Wp,-D_FORTIFY_SOURCE=2 -fexceptions -fstack-protector --param=ssp-buffer-size=4 -m64 -mtune=generic -O2 -g -I/home/mikeb/rpmbuild/BUILD/hugin-2013.0.0/src -I/home/mikeb/rpmbuild/BUILD/hugin-2013.0.0/src/hugin_base -I/home/mikeb/rpmbuild/BUILD/hugin-2013.0.0/src/foreign/vigra -I/home/mikeb/rpmbuild/BUILD/hugin-2013.0.0/src/celeste -I/usr/include/OpenEXR -I/usr/include/python2.6 -I/home/mikeb/rpmbuild/BUILD/hugin-2013.0.0/src/foreign/zthread/src/../include -o CMakeFiles/ZThread.dir/PoolExecutor.cxx.o -c /home/mikeb/rpmbuild/BUILD/hugin-2013.0.0/src/foreign/zthread/src/PoolExecutor.cxx
[ 28%] /usr/bin/cmake -E cmake_progress_report /home/mikeb/rpmbuild/BUILD/hugin-2013.0.0/CMakeFiles
make[2]: Leaving directory `/home/mikeb/rpmbuild/BUILD/hugin-2013.0.0'
make[1]: *** [src/hugin_base/makefilelib/CMakeFiles/makefilelib.dir/all] Error 2
make[1]: *** Waiting for unfinished jobs....
/usr/bin/cmake -E cmake_progress_report /home/mikeb/rpmbuild/BUILD/hugin-2013.0.0/CMakeFiles 9
/usr/bin/cmake -E cmake_progress_report /home/mikeb/rpmbuild/BUILD/hugin-2013.0.0/CMakeFiles 78
[ 28%] [32mBuilding CXX object src/foreign/vigra/vigra_impex/CMakeFiles/huginvigraimpex.dir/png.cxx.o
[0mcd /home/mikeb/rpmbuild/BUILD/hugin-2013.0.0/src/foreign/vigra/vigra_impex && /usr/bin/c++ -Dhuginvigraimpex_EXPORTS -DHUGIN_HSI -O2 -g -pipe -Wall -Wp,-D_FORTIFY_SOURCE=2 -fexceptions -fstack-protector --param=ssp-buffer-size=4 -m64 -mtune=generic -O2 -g -fPIC -I/home/mikeb/rpmbuild/BUILD/hugin-2013.0.0/src -I/home/mikeb/rpmbuild/BUILD/hugin-2013.0.0/src/hugin_base -I/home/mikeb/rpmbuild/BUILD/hugin-2013.0.0/src/foreign/vigra -I/home/mikeb/rpmbuild/BUILD/hugin-2013.0.0/src/celeste -I/usr/include/OpenEXR -I/usr/include/python2.6 -o CMakeFiles/huginvigraimpex.dir/png.cxx.o -c /home/mikeb/rpmbuild/BUILD/hugin-2013.0.0/src/foreign/vigra/vigra_impex/png.cxx
[ 29%] [ 30%] [34m [1mGenerating autooptimiser.1.gz
[0mcd /home/mikeb/rpmbuild/BUILD/hugin-2013.0.0/doc && /usr/bin/pod2man --section=\"1\" "--release=\"Version: 2013.0.0\"" --center=HUGIN /home/mikeb/rpmbuild/BUILD/hugin-2013.0.0/doc/autooptimiser.pod /home/mikeb/rpmbuild/BUILD/hugin-2013.0.0/doc/autooptimiser.1
[32mBuilding CXX object src/foreign/zthread/src/CMakeFiles/ZThread.dir/PriorityCondition.cxx.o
[0m/usr/bin/cmake -E cmake_progress_report /home/mikeb/rpmbuild/BUILD/hugin-2013.0.0/CMakeFiles 17
[ 31%] cd /home/mikeb/rpmbuild/BUILD/hugin-2013.0.0/src/foreign/zthread/src && /usr/bin/c++ -DHUGIN_HSI -DNDEBUG -O2 -g -pipe -Wall -Wp,-D_FORTIFY_SOURCE=2 -fexceptions -fstack-protector --param=ssp-buffer-size=4 -m64 -mtune=generic -O2 -g -I/home/mikeb/rpmbuild/BUILD/hugin-2013.0.0/src -I/home/mikeb/rpmbuild/BUILD/hugin-2013.0.0/src/hugin_base -I/home/mikeb/rpmbuild/BUILD/hugin-2013.0.0/src/foreign/vigra -I/home/mikeb/rpmbuild/BUILD/hugin-2013.0.0/src/celeste -I/usr/include/OpenEXR -I/usr/include/python2.6 -I/home/mikeb/rpmbuild/BUILD/hugin-2013.0.0/src/foreign/zthread/src/../include -o CMakeFiles/ZThread.dir/PriorityCondition.cxx.o -c /home/mikeb/rpmbuild/BUILD/hugin-2013.0.0/src/foreign/zthread/src/PriorityCondition.cxx
[32mBuilding CXX object src/foreign/vigra/vigra_impex/CMakeFiles/huginvigraimpex.dir/pnm.cxx.o
[0mcd /home/mikeb/rpmbuild/BUILD/hugin-2013.0.0/src/foreign/vigra/vigra_impex && /usr/bin/c++ -Dhuginvigraimpex_EXPORTS -DHUGIN_HSI -O2 -g -pipe -Wall -Wp,-D_FORTIFY_SOURCE=2 -fexceptions -fstack-protector --param=ssp-buffer-size=4 -m64 -mtune=generic -O2 -g -fPIC -I/home/mikeb/rpmbuild/BUILD/hugin-2013.0.0/src -I/home/mikeb/rpmbuild/BUILD/hugin-2013.0.0/src/hugin_base -I/home/mikeb/rpmbuild/BUILD/hugin-2013.0.0/src/foreign/vigra -I/home/mikeb/rpmbuild/BUILD/hugin-2013.0.0/src/celeste -I/usr/include/OpenEXR -I/usr/include/python2.6 -o CMakeFiles/huginvigraimpex.dir/pnm.cxx.o -c /home/mikeb/rpmbuild/BUILD/hugin-2013.0.0/src/foreign/vigra/vigra_impex/pnm.cxx
cd /home/mikeb/rpmbuild/BUILD/hugin-2013.0.0/doc && /bin/gzip -f /home/mikeb/rpmbuild/BUILD/hugin-2013.0.0/doc/hugin_hdrmerge.1
[32mBuilding CXX object src/foreign/zthread/src/CMakeFiles/ZThread.dir/PriorityInheritanceMutex.cxx.o
[0mcd /home/mikeb/rpmbuild/BUILD/hugin-2013.0.0/src/foreign/zthread/src && /usr/bin/c++ -DHUGIN_HSI -DNDEBUG -O2 -g -pipe -Wall -Wp,-D_FORTIFY_SOURCE=2 -fexceptions -fstack-protector --param=ssp-buffer-size=4 -m64 -mtune=generic -O2 -g -I/home/mikeb/rpmbuild/BUILD/hugin-2013.0.0/src -I/home/mikeb/rpmbuild/BUILD/hugin-2013.0.0/src/hugin_base -I/home/mikeb/rpmbuild/BUILD/hugin-2013.0.0/src/foreign/vigra -I/home/mikeb/rpmbuild/BUILD/hugin-2013.0.0/src/celeste -I/usr/include/OpenEXR -I/usr/include/python2.6 -I/home/mikeb/rpmbuild/BUILD/hugin-2013.0.0/src/foreign/zthread/src/../include -o CMakeFiles/ZThread.dir/PriorityInheritanceMutex.cxx.o -c /home/mikeb/rpmbuild/BUILD/hugin-2013.0.0/src/foreign/zthread/src/PriorityInheritanceMutex.cxx
cd /home/mikeb/rpmbuild/BUILD/hugin-2013.0.0/doc && /bin/gzip -f /home/mikeb/rpmbuild/BUILD/hugin-2013.0.0/doc/fulla.1
cd /home/mikeb/rpmbuild/BUILD/hugin-2013.0.0/doc && /bin/gzip -f /home/mikeb/rpmbuild/BUILD/hugin-2013.0.0/doc/nona.1
cd /home/mikeb/rpmbuild/BUILD/hugin-2013.0.0/doc && /bin/gzip -f /home/mikeb/rpmbuild/BUILD/hugin-2013.0.0/doc/linefind.1
/usr/bin/cmake -E cmake_progress_report /home/mikeb/rpmbuild/BUILD/hugin-2013.0.0/CMakeFiles
[ 31%] /usr/bin/cmake -E cmake_progress_report /home/mikeb/rpmbuild/BUILD/hugin-2013.0.0/CMakeFiles
[ 31%] [32mBuilding CXX object src/foreign/zthread/src/CMakeFiles/ZThread.dir/PriorityMutex.cxx.o
[0mcd /home/mikeb/rpmbuild/BUILD/hugin-2013.0.0/src/foreign/zthread/src && /usr/bin/c++ -DHUGIN_HSI -DNDEBUG -O2 -g -pipe -Wall -Wp,-D_FORTIFY_SOURCE=2 -fexceptions -fstack-protector --param=ssp-buffer-size=4 -m64 -mtune=generic -O2 -g -I/home/mikeb/rpmbuild/BUILD/hugin-2013.0.0/src -I/home/mikeb/rpmbuild/BUILD/hugin-2013.0.0/src/hugin_base -I/home/mikeb/rpmbuild/BUILD/hugin-2013.0.0/src/foreign/vigra -I/home/mikeb/rpmbuild/BUILD/hugin-2013.0.0/src/celeste -I/usr/include/OpenEXR -I/usr/include/python2.6 -I/home/mikeb/rpmbuild/BUILD/hugin-2013.0.0/src/foreign/zthread/src/../include -o CMakeFiles/ZThread.dir/PriorityMutex.cxx.o -c /home/mikeb/rpmbuild/BUILD/hugin-2013.0.0/src/foreign/zthread/src/PriorityMutex.cxx
cd /home/mikeb/rpmbuild/BUILD/hugin-2013.0.0/doc && /bin/gzip -f /home/mikeb/rpmbuild/BUILD/hugin-2013.0.0/doc/autooptimiser.1
[32mBuilding CXX object src/foreign/vigra/vigra_impex/CMakeFiles/huginvigraimpex.dir/sun.cxx.o
[0mcd /home/mikeb/rpmbuild/BUILD/hugin-2013.0.0/src/foreign/vigra/vigra_impex && /usr/bin/c++ -Dhuginvigraimpex_EXPORTS -DHUGIN_HSI -O2 -g -pipe -Wall -Wp,-D_FORTIFY_SOURCE=2 -fexceptions -fstack-protector --param=ssp-buffer-size=4 -m64 -mtune=generic -O2 -g -fPIC -I/home/mikeb/rpmbuild/BUILD/hugin-2013.0.0/src -I/home/mikeb/rpmbuild/BUILD/hugin-2013.0.0/src/hugin_base -I/home/mikeb/rpmbuild/BUILD/hugin-2013.0.0/src/foreign/vigra -I/home/mikeb/rpmbuild/BUILD/hugin-2013.0.0/src/celeste -I/usr/include/OpenEXR -I/usr/include/python2.6 -o CMakeFiles/huginvigraimpex.dir/sun.cxx.o -c /home/mikeb/rpmbuild/BUILD/hugin-2013.0.0/src/foreign/vigra/vigra_impex/sun.cxx
/usr/bin/cmake -E cmake_progress_report /home/mikeb/rpmbuild/BUILD/hugin-2013.0.0/CMakeFiles
In file included from /home/mikeb/rpmbuild/BUILD/hugin-2013.0.0/src/foreign/zthread/src/PoolExecutor.cxx:24:
/home/mikeb/rpmbuild/BUILD/hugin-2013.0.0/src/foreign/zthread/src/../include/zthread/PoolExecutor.h:58: warning: 'ZThread::PoolExecutor' has a field 'ZThread::PoolExecutor::_impl' whose type uses the anonymous namespace
[ 31%] /usr/bin/cmake -E cmake_progress_report /home/mikeb/rpmbuild/BUILD/hugin-2013.0.0/CMakeFiles
[ 31%] [32mBuilding CXX object src/foreign/vigra/vigra_impex/CMakeFiles/huginvigraimpex.dir/tiff.cxx.o
[0mcd /home/mikeb/rpmbuild/BUILD/hugin-2013.0.0/src/foreign/vigra/vigra_impex && /usr/bin/c++ -Dhuginvigraimpex_EXPORTS -DHUGIN_HSI -O2 -g -pipe -Wall -Wp,-D_FORTIFY_SOURCE=2 -fexceptions -fstack-protector --param=ssp-buffer-size=4 -m64 -mtune=generic -O2 -g -fPIC -I/home/mikeb/rpmbuild/BUILD/hugin-2013.0.0/src -I/home/mikeb/rpmbuild/BUILD/hugin-2013.0.0/src/hugin_base -I/home/mikeb/rpmbuild/BUILD/hugin-2013.0.0/src/foreign/vigra -I/home/mikeb/rpmbuild/BUILD/hugin-2013.0.0/src/celeste -I/usr/include/OpenEXR -I/usr/include/python2.6 -o CMakeFiles/huginvigraimpex.dir/tiff.cxx.o -c /home/mikeb/rpmbuild/BUILD/hugin-2013.0.0/src/foreign/vigra/vigra_impex/tiff.cxx
/usr/bin/cmake -E cmake_progress_report /home/mikeb/rpmbuild/BUILD/hugin-2013.0.0/CMakeFiles 79
[32mBuilding CXX object src/foreign/zthread/src/CMakeFiles/ZThread.dir/PrioritySemaphore.cxx.o
[0mcd /home/mikeb/rpmbuild/BUILD/hugin-2013.0.0/src/foreign/zthread/src && /usr/bin/c++ -DHUGIN_HSI -DNDEBUG -O2 -g -pipe -Wall -Wp,-D_FORTIFY_SOURCE=2 -fexceptions -fstack-protector --param=ssp-buffer-size=4 -m64 -mtune=generic -O2 -g -I/home/mikeb/rpmbuild/BUILD/hugin-2013.0.0/src -I/home/mikeb/rpmbuild/BUILD/hugin-2013.0.0/src/hugin_base -I/home/mikeb/rpmbuild/BUILD/hugin-2013.0.0/src/foreign/vigra -I/home/mikeb/rpmbuild/BUILD/hugin-2013.0.0/src/celeste -I/usr/include/OpenEXR -I/usr/include/python2.6 -I/home/mikeb/rpmbuild/BUILD/hugin-2013.0.0/src/foreign/zthread/src/../include -o CMakeFiles/ZThread.dir/PrioritySemaphore.cxx.o -c /home/mikeb/rpmbuild/BUILD/hugin-2013.0.0/src/foreign/zthread/src/PrioritySemaphore.cxx
/usr/bin/cmake -E cmake_progress_report /home/mikeb/rpmbuild/BUILD/hugin-2013.0.0/CMakeFiles 18
make[2]: Leaving directory `/home/mikeb/rpmbuild/BUILD/hugin-2013.0.0'
/usr/bin/cmake -E cmake_progress_report /home/mikeb/rpmbuild/BUILD/hugin-2013.0.0/CMakeFiles 1 2 3 4 5 6 7 8 9
[ 32%] [ 33%] [ 33%] [32mBuilding CXX object src/foreign/vigra/vigra_impex/CMakeFiles/huginvigraimpex.dir/viff.cxx.o
[0mcd /home/mikeb/rpmbuild/BUILD/hugin-2013.0.0/src/foreign/vigra/vigra_impex && /usr/bin/c++ -Dhuginvigraimpex_EXPORTS -DHUGIN_HSI -O2 -g -pipe -Wall -Wp,-D_FORTIFY_SOURCE=2 -fexceptions -fstack-protector --param=ssp-buffer-size=4 -m64 -mtune=generic -O2 -g -fPIC -I/home/mikeb/rpmbuild/BUILD/hugin-2013.0.0/src -I/home/mikeb/rpmbuild/BUILD/hugin-2013.0.0/src/hugin_base -I/home/mikeb/rpmbuild/BUILD/hugin-2013.0.0/src/foreign/vigra -I/home/mikeb/rpmbuild/BUILD/hugin-2013.0.0/src/celeste -I/usr/include/OpenEXR -I/usr/include/python2.6 -o CMakeFiles/huginvigraimpex.dir/viff.cxx.o -c /home/mikeb/rpmbuild/BUILD/hugin-2013.0.0/src/foreign/vigra/vigra_impex/viff.cxx
Built target ManPages
/usr/bin/cmake -E cmake_progress_report /home/mikeb/rpmbuild/BUILD/hugin-2013.0.0/CMakeFiles
[32mBuilding CXX object src/foreign/zthread/src/CMakeFiles/ZThread.dir/Semaphore.cxx.o
[0mcd /home/mikeb/rpmbuild/BUILD/hugin-2013.0.0/src/foreign/zthread/src && /usr/bin/c++ -DHUGIN_HSI -DNDEBUG -O2 -g -pipe -Wall -Wp,-D_FORTIFY_SOURCE=2 -fexceptions -fstack-protector --param=ssp-buffer-size=4 -m64 -mtune=generic -O2 -g -I/home/mikeb/rpmbuild/BUILD/hugin-2013.0.0/src -I/home/mikeb/rpmbuild/BUILD/hugin-2013.0.0/src/hugin_base -I/home/mikeb/rpmbuild/BUILD/hugin-2013.0.0/src/foreign/vigra -I/home/mikeb/rpmbuild/BUILD/hugin-2013.0.0/src/celeste -I/usr/include/OpenEXR -I/usr/include/python2.6 -I/home/mikeb/rpmbuild/BUILD/hugin-2013.0.0/src/foreign/zthread/src/../include -o CMakeFiles/ZThread.dir/Semaphore.cxx.o -c /home/mikeb/rpmbuild/BUILD/hugin-2013.0.0/src/foreign/zthread/src/Semaphore.cxx
[ 33%] [32mBuilding CXX object src/foreign/vigra/vigra_impex/CMakeFiles/huginvigraimpex.dir/void_vector.cxx.o
[0mcd /home/mikeb/rpmbuild/BUILD/hugin-2013.0.0/src/foreign/vigra/vigra_impex && /usr/bin/c++ -Dhuginvigraimpex_EXPORTS -DHUGIN_HSI -O2 -g -pipe -Wall -Wp,-D_FORTIFY_SOURCE=2 -fexceptions -fstack-protector --param=ssp-buffer-size=4 -m64 -mtune=generic -O2 -g -fPIC -I/home/mikeb/rpmbuild/BUILD/hugin-2013.0.0/src -I/home/mikeb/rpmbuild/BUILD/hugin-2013.0.0/src/hugin_base -I/home/mikeb/rpmbuild/BUILD/hugin-2013.0.0/src/foreign/vigra -I/home/mikeb/rpmbuild/BUILD/hugin-2013.0.0/src/celeste -I/usr/include/OpenEXR -I/usr/include/python2.6 -o CMakeFiles/huginvigraimpex.dir/void_vector.cxx.o -c /home/mikeb/rpmbuild/BUILD/hugin-2013.0.0/src/foreign/vigra/vigra_impex/void_vector.cxx
/usr/bin/cmake -E cmake_progress_report /home/mikeb/rpmbuild/BUILD/hugin-2013.0.0/CMakeFiles
[ 33%] [32mBuilding CXX object src/foreign/zthread/src/CMakeFiles/ZThread.dir/SynchronousExecutor.cxx.o
[0mcd /home/mikeb/rpmbuild/BUILD/hugin-2013.0.0/src/foreign/zthread/src && /usr/bin/c++ -DHUGIN_HSI -DNDEBUG -O2 -g -pipe -Wall -Wp,-D_FORTIFY_SOURCE=2 -fexceptions -fstack-protector --param=ssp-buffer-size=4 -m64 -mtune=generic -O2 -g -I/home/mikeb/rpmbuild/BUILD/hugin-2013.0.0/src -I/home/mikeb/rpmbuild/BUILD/hugin-2013.0.0/src/hugin_base -I/home/mikeb/rpmbuild/BUILD/hugin-2013.0.0/src/foreign/vigra -I/home/mikeb/rpmbuild/BUILD/hugin-2013.0.0/src/celeste -I/usr/include/OpenEXR -I/usr/include/python2.6 -I/home/mikeb/rpmbuild/BUILD/hugin-2013.0.0/src/foreign/zthread/src/../include -o CMakeFiles/ZThread.dir/SynchronousExecutor.cxx.o -c /home/mikeb/rpmbuild/BUILD/hugin-2013.0.0/src/foreign/zthread/src/SynchronousExecutor.cxx
/usr/bin/cmake -E cmake_progress_report /home/mikeb/rpmbuild/BUILD/hugin-2013.0.0/CMakeFiles
[ 33%] [32mBuilding C object src/foreign/vigra/vigra_impex/CMakeFiles/huginvigraimpex.dir/iccjpeg.c.o
[0mcd /home/mikeb/rpmbuild/BUILD/hugin-2013.0.0/src/foreign/vigra/vigra_impex && /usr/bin/gcc -Dhuginvigraimpex_EXPORTS -DHUGIN_HSI -O2 -g -pipe -Wall -Wp,-D_FORTIFY_SOURCE=2 -fexceptions -fstack-protector --param=ssp-buffer-size=4 -m64 -mtune=generic -O2 -g -fPIC -I/home/mikeb/rpmbuild/BUILD/hugin-2013.0.0/src -I/home/mikeb/rpmbuild/BUILD/hugin-2013.0.0/src/hugin_base -I/home/mikeb/rpmbuild/BUILD/hugin-2013.0.0/src/foreign/vigra -I/home/mikeb/rpmbuild/BUILD/hugin-2013.0.0/src/celeste -I/usr/include/OpenEXR -I/usr/include/python2.6 -o CMakeFiles/huginvigraimpex.dir/iccjpeg.c.o -c /home/mikeb/rpmbuild/BUILD/hugin-2013.0.0/src/foreign/vigra/vigra_impex/iccjpeg.c
/usr/bin/cmake -E cmake_progress_report /home/mikeb/rpmbuild/BUILD/hugin-2013.0.0/CMakeFiles
[ 33%] [32mBuilding CXX object src/foreign/zthread/src/CMakeFiles/ZThread.dir/Thread.cxx.o
[0mcd /home/mikeb/rpmbuild/BUILD/hugin-2013.0.0/src/foreign/zthread/src && /usr/bin/c++ -DHUGIN_HSI -DNDEBUG -O2 -g -pipe -Wall -Wp,-D_FORTIFY_SOURCE=2 -fexceptions -fstack-protector --param=ssp-buffer-size=4 -m64 -mtune=generic -O2 -g -I/home/mikeb/rpmbuild/BUILD/hugin-2013.0.0/src -I/home/mikeb/rpmbuild/BUILD/hugin-2013.0.0/src/hugin_base -I/home/mikeb/rpmbuild/BUILD/hugin-2013.0.0/src/foreign/vigra -I/home/mikeb/rpmbuild/BUILD/hugin-2013.0.0/src/celeste -I/usr/include/OpenEXR -I/usr/include/python2.6 -I/home/mikeb/rpmbuild/BUILD/hugin-2013.0.0/src/foreign/zthread/src/../include -o CMakeFiles/ZThread.dir/Thread.cxx.o -c /home/mikeb/rpmbuild/BUILD/hugin-2013.0.0/src/foreign/zthread/src/Thread.cxx
/usr/bin/cmake -E cmake_progress_report /home/mikeb/rpmbuild/BUILD/hugin-2013.0.0/CMakeFiles 19
[ 34%] [32mBuilding CXX object src/foreign/zthread/src/CMakeFiles/ZThread.dir/ThreadedExecutor.cxx.o
[0mcd /home/mikeb/rpmbuild/BUILD/hugin-2013.0.0/src/foreign/zthread/src && /usr/bin/c++ -DHUGIN_HSI -DNDEBUG -O2 -g -pipe -Wall -Wp,-D_FORTIFY_SOURCE=2 -fexceptions -fstack-protector --param=ssp-buffer-size=4 -m64 -mtune=generic -O2 -g -I/home/mikeb/rpmbuild/BUILD/hugin-2013.0.0/src -I/home/mikeb/rpmbuild/BUILD/hugin-2013.0.0/src/hugin_base -I/home/mikeb/rpmbuild/BUILD/hugin-2013.0.0/src/foreign/vigra -I/home/mikeb/rpmbuild/BUILD/hugin-2013.0.0/src/celeste -I/usr/include/OpenEXR -I/usr/include/python2.6 -I/home/mikeb/rpmbuild/BUILD/hugin-2013.0.0/src/foreign/zthread/src/../include -o CMakeFiles/ZThread.dir/ThreadedExecutor.cxx.o -c /home/mikeb/rpmbuild/BUILD/hugin-2013.0.0/src/foreign/zthread/src/ThreadedExecutor.cxx
/usr/bin/cmake -E cmake_progress_report /home/mikeb/rpmbuild/BUILD/hugin-2013.0.0/CMakeFiles
[ 34%] /usr/bin/cmake -E cmake_progress_report /home/mikeb/rpmbuild/BUILD/hugin-2013.0.0/CMakeFiles
[ 34%] [32mBuilding CXX object src/foreign/zthread/src/CMakeFiles/ZThread.dir/ThreadImpl.cxx.o
[0mcd /home/mikeb/rpmbuild/BUILD/hugin-2013.0.0/src/foreign/zthread/src && /usr/bin/c++ -DHUGIN_HSI -DNDEBUG -O2 -g -pipe -Wall -Wp,-D_FORTIFY_SOURCE=2 -fexceptions -fstack-protector --param=ssp-buffer-size=4 -m64 -mtune=generic -O2 -g -I/home/mikeb/rpmbuild/BUILD/hugin-2013.0.0/src -I/home/mikeb/rpmbuild/BUILD/hugin-2013.0.0/src/hugin_base -I/home/mikeb/rpmbuild/BUILD/hugin-2013.0.0/src/foreign/vigra -I/home/mikeb/rpmbuild/BUILD/hugin-2013.0.0/src/celeste -I/usr/include/OpenEXR -I/usr/include/python2.6 -I/home/mikeb/rpmbuild/BUILD/hugin-2013.0.0/src/foreign/zthread/src/../include -o CMakeFiles/ZThread.dir/ThreadImpl.cxx.o -c /home/mikeb/rpmbuild/BUILD/hugin-2013.0.0/src/foreign/zthread/src/ThreadImpl.cxx
[32mBuilding C object src/foreign/vigra/vigra_impex/CMakeFiles/huginvigraimpex.dir/rgbe.c.o
[0mcd /home/mikeb/rpmbuild/BUILD/hugin-2013.0.0/src/foreign/vigra/vigra_impex && /usr/bin/gcc -Dhuginvigraimpex_EXPORTS -DHUGIN_HSI -O2 -g -pipe -Wall -Wp,-D_FORTIFY_SOURCE=2 -fexceptions -fstack-protector --param=ssp-buffer-size=4 -m64 -mtune=generic -O2 -g -fPIC -I/home/mikeb/rpmbuild/BUILD/hugin-2013.0.0/src -I/home/mikeb/rpmbuild/BUILD/hugin-2013.0.0/src/hugin_base -I/home/mikeb/rpmbuild/BUILD/hugin-2013.0.0/src/foreign/vigra -I/home/mikeb/rpmbuild/BUILD/hugin-2013.0.0/src/celeste -I/usr/include/OpenEXR -I/usr/include/python2.6 -o CMakeFiles/huginvigraimpex.dir/rgbe.c.o -c /home/mikeb/rpmbuild/BUILD/hugin-2013.0.0/src/foreign/vigra/vigra_impex/rgbe.c
/usr/bin/cmake -E cmake_progress_report /home/mikeb/rpmbuild/BUILD/hugin-2013.0.0/CMakeFiles
[ 34%] /usr/bin/cmake -E cmake_progress_report /home/mikeb/rpmbuild/BUILD/hugin-2013.0.0/CMakeFiles 80
[32mBuilding CXX object src/foreign/zthread/src/CMakeFiles/ZThread.dir/ThreadLocalImpl.cxx.o
[0mcd /home/mikeb/rpmbuild/BUILD/hugin-2013.0.0/src/foreign/zthread/src && /usr/bin/c++ -DHUGIN_HSI -DNDEBUG -O2 -g -pipe -Wall -Wp,-D_FORTIFY_SOURCE=2 -fexceptions -fstack-protector --param=ssp-buffer-size=4 -m64 -mtune=generic -O2 -g -I/home/mikeb/rpmbuild/BUILD/hugin-2013.0.0/src -I/home/mikeb/rpmbuild/BUILD/hugin-2013.0.0/src/hugin_base -I/home/mikeb/rpmbuild/BUILD/hugin-2013.0.0/src/foreign/vigra -I/home/mikeb/rpmbuild/BUILD/hugin-2013.0.0/src/celeste -I/usr/include/OpenEXR -I/usr/include/python2.6 -I/home/mikeb/rpmbuild/BUILD/hugin-2013.0.0/src/foreign/zthread/src/../include -o CMakeFiles/ZThread.dir/ThreadLocalImpl.cxx.o -c /home/mikeb/rpmbuild/BUILD/hugin-2013.0.0/src/foreign/zthread/src/ThreadLocalImpl.cxx
[ 35%] /usr/bin/cmake -E cmake_progress_report /home/mikeb/rpmbuild/BUILD/hugin-2013.0.0/CMakeFiles
[32mBuilding CXX object src/foreign/vigra/vigra_impex/CMakeFiles/huginvigraimpex.dir/hdr.cxx.o
[0mcd /home/mikeb/rpmbuild/BUILD/hugin-2013.0.0/src/foreign/vigra/vigra_impex && /usr/bin/c++ -Dhuginvigraimpex_EXPORTS -DHUGIN_HSI -O2 -g -pipe -Wall -Wp,-D_FORTIFY_SOURCE=2 -fexceptions -fstack-protector --param=ssp-buffer-size=4 -m64 -mtune=generic -O2 -g -fPIC -I/home/mikeb/rpmbuild/BUILD/hugin-2013.0.0/src -I/home/mikeb/rpmbuild/BUILD/hugin-2013.0.0/src/hugin_base -I/home/mikeb/rpmbuild/BUILD/hugin-2013.0.0/src/foreign/vigra -I/home/mikeb/rpmbuild/BUILD/hugin-2013.0.0/src/celeste -I/usr/include/OpenEXR -I/usr/include/python2.6 -o CMakeFiles/huginvigraimpex.dir/hdr.cxx.o -c /home/mikeb/rpmbuild/BUILD/hugin-2013.0.0/src/foreign/vigra/vigra_impex/hdr.cxx
/usr/bin/cmake -E cmake_progress_report /home/mikeb/rpmbuild/BUILD/hugin-2013.0.0/CMakeFiles 20
[ 35%] [ 36%] /usr/bin/cmake -E cmake_progress_report /home/mikeb/rpmbuild/BUILD/hugin-2013.0.0/CMakeFiles
[32mBuilding CXX object src/foreign/vigra/vigra_impex/CMakeFiles/huginvigraimpex.dir/exr.cxx.o
[0m [32mBuilding CXX object src/foreign/zthread/src/CMakeFiles/ZThread.dir/ThreadQueue.cxx.o
[0mcd /home/mikeb/rpmbuild/BUILD/hugin-2013.0.0/src/foreign/vigra/vigra_impex && /usr/bin/c++ -Dhuginvigraimpex_EXPORTS -DHUGIN_HSI -O2 -g -pipe -Wall -Wp,-D_FORTIFY_SOURCE=2 -fexceptions -fstack-protector --param=ssp-buffer-size=4 -m64 -mtune=generic -O2 -g -fPIC -I/home/mikeb/rpmbuild/BUILD/hugin-2013.0.0/src -I/home/mikeb/rpmbuild/BUILD/hugin-2013.0.0/src/hugin_base -I/home/mikeb/rpmbuild/BUILD/hugin-2013.0.0/src/foreign/vigra -I/home/mikeb/rpmbuild/BUILD/hugin-2013.0.0/src/celeste -I/usr/include/OpenEXR -I/usr/include/python2.6 -o CMakeFiles/huginvigraimpex.dir/exr.cxx.o -c /home/mikeb/rpmbuild/BUILD/hugin-2013.0.0/src/foreign/vigra/vigra_impex/exr.cxx
[ 36%] cd /home/mikeb/rpmbuild/BUILD/hugin-2013.0.0/src/foreign/zthread/src && /usr/bin/c++ -DHUGIN_HSI -DNDEBUG -O2 -g -pipe -Wall -Wp,-D_FORTIFY_SOURCE=2 -fexceptions -fstack-protector --param=ssp-buffer-size=4 -m64 -mtune=generic -O2 -g -I/home/mikeb/rpmbuild/BUILD/hugin-2013.0.0/src -I/home/mikeb/rpmbuild/BUILD/hugin-2013.0.0/src/hugin_base -I/home/mikeb/rpmbuild/BUILD/hugin-2013.0.0/src/foreign/vigra -I/home/mikeb/rpmbuild/BUILD/hugin-2013.0.0/src/celeste -I/usr/include/OpenEXR -I/usr/include/python2.6 -I/home/mikeb/rpmbuild/BUILD/hugin-2013.0.0/src/foreign/zthread/src/../include -o CMakeFiles/ZThread.dir/ThreadQueue.cxx.o -c /home/mikeb/rpmbuild/BUILD/hugin-2013.0.0/src/foreign/zthread/src/ThreadQueue.cxx
/usr/bin/cmake -E cmake_progress_report /home/mikeb/rpmbuild/BUILD/hugin-2013.0.0/CMakeFiles
[32mBuilding CXX object src/foreign/zthread/src/CMakeFiles/ZThread.dir/Time.cxx.o
[0mcd /home/mikeb/rpmbuild/BUILD/hugin-2013.0.0/src/foreign/zthread/src && /usr/bin/c++ -DHUGIN_HSI -DNDEBUG -O2 -g -pipe -Wall -Wp,-D_FORTIFY_SOURCE=2 -fexceptions -fstack-protector --param=ssp-buffer-size=4 -m64 -mtune=generic -O2 -g -I/home/mikeb/rpmbuild/BUILD/hugin-2013.0.0/src -I/home/mikeb/rpmbuild/BUILD/hugin-2013.0.0/src/hugin_base -I/home/mikeb/rpmbuild/BUILD/hugin-2013.0.0/src/foreign/vigra -I/home/mikeb/rpmbuild/BUILD/hugin-2013.0.0/src/celeste -I/usr/include/OpenEXR -I/usr/include/python2.6 -I/home/mikeb/rpmbuild/BUILD/hugin-2013.0.0/src/foreign/zthread/src/../include -o CMakeFiles/ZThread.dir/Time.cxx.o -c /home/mikeb/rpmbuild/BUILD/hugin-2013.0.0/src/foreign/zthread/src/Time.cxx
[ 36%] [32mBuilding CXX object src/foreign/zthread/src/CMakeFiles/ZThread.dir/ThreadOps.cxx.o
[0mcd /home/mikeb/rpmbuild/BUILD/hugin-2013.0.0/src/foreign/zthread/src && /usr/bin/c++ -DHUGIN_HSI -DNDEBUG -O2 -g -pipe -Wall -Wp,-D_FORTIFY_SOURCE=2 -fexceptions -fstack-protector --param=ssp-buffer-size=4 -m64 -mtune=generic -O2 -g -I/home/mikeb/rpmbuild/BUILD/hugin-2013.0.0/src -I/home/mikeb/rpmbuild/BUILD/hugin-2013.0.0/src/hugin_base -I/home/mikeb/rpmbuild/BUILD/hugin-2013.0.0/src/foreign/vigra -I/home/mikeb/rpmbuild/BUILD/hugin-2013.0.0/src/celeste -I/usr/include/OpenEXR -I/usr/include/python2.6 -I/home/mikeb/rpmbuild/BUILD/hugin-2013.0.0/src/foreign/zthread/src/../include -o CMakeFiles/ZThread.dir/ThreadOps.cxx.o -c /home/mikeb/rpmbuild/BUILD/hugin-2013.0.0/src/foreign/zthread/src/ThreadOps.cxx
In file included from /home/mikeb/rpmbuild/BUILD/hugin-2013.0.0/src/foreign/zthread/src/ThreadedExecutor.cxx:23:
/home/mikeb/rpmbuild/BUILD/hugin-2013.0.0/src/foreign/zthread/src/../include/zthread/ThreadedExecutor.h:56: warning: 'ZThread::ThreadedExecutor' has a field 'ZThread::ThreadedExecutor::_impl' whose type uses the anonymous namespace
In file included from /home/mikeb/rpmbuild/BUILD/hugin-2013.0.0/src/foreign/zthread/src/ThreadOps.cxx:52:
/home/mikeb/rpmbuild/BUILD/hugin-2013.0.0/src/foreign/zthread/src/posix/ThreadOps.cxx: In static member function 'static bool ZThread::ThreadOps::getPriority(ZThread::ThreadOps*, ZThread::Priority&)':
/home/mikeb/rpmbuild/BUILD/hugin-2013.0.0/src/foreign/zthread/src/posix/ThreadOps.cxx:106: warning: suggest parentheses around assignment used as truth value
/home/mikeb/rpmbuild/BUILD/hugin-2013.0.0/src/foreign/zthread/src/ThreadQueue.cxx: In member function 'void ZThread::ThreadQueue::insertPendingThread(ZThread::ThreadImpl*)':
/home/mikeb/rpmbuild/BUILD/hugin-2013.0.0/src/foreign/zthread/src/ThreadQueue.cxx:143: warning: suggest explicit braces to avoid ambiguous 'else'
[31m [1mLinking CXX static library libZThread.a
[0mcd /home/mikeb/rpmbuild/BUILD/hugin-2013.0.0/src/foreign/zthread/src && /usr/bin/cmake -P CMakeFiles/ZThread.dir/cmake_clean_target.cmake
cd /home/mikeb/rpmbuild/BUILD/hugin-2013.0.0/src/foreign/zthread/src && /usr/bin/cmake -E cmake_link_script CMakeFiles/ZThread.dir/link.txt --verbose=1
/usr/bin/ar cr libZThread.a CMakeFiles/ZThread.dir/AtomicCount.cxx.o CMakeFiles/ZThread.dir/Condition.cxx.o CMakeFiles/ZThread.dir/ConcurrentExecutor.cxx.o CMakeFiles/ZThread.dir/CountingSemaphore.cxx.o CMakeFiles/ZThread.dir/FastMutex.cxx.o CMakeFiles/ZThread.dir/FastRecursiveMutex.cxx.o CMakeFiles/ZThread.dir/Mutex.cxx.o CMakeFiles/ZThread.dir/RecursiveMutexImpl.cxx.o CMakeFiles/ZThread.dir/RecursiveMutex.cxx.o CMakeFiles/ZThread.dir/Monitor.cxx.o CMakeFiles/ZThread.dir/PoolExecutor.cxx.o CMakeFiles/ZThread.dir/PriorityCondition.cxx.o CMakeFiles/ZThread.dir/PriorityInheritanceMutex.cxx.o CMakeFiles/ZThread.dir/PriorityMutex.cxx.o CMakeFiles/ZThread.dir/PrioritySemaphore.cxx.o CMakeFiles/ZThread.dir/Semaphore.cxx.o CMakeFiles/ZThread.dir/SynchronousExecutor.cxx.o CMakeFiles/ZThread.dir/Thread.cxx.o CMakeFiles/ZThread.dir/ThreadedExecutor.cxx.o CMakeFiles/ZThread.dir/ThreadImpl.cxx.o CMakeFiles/ZThread.dir/ThreadLocalImpl.cxx.o CMakeFiles/ZThread.dir/ThreadQueue.cxx.o CMakeFiles/ZThread.dir/Time.cxx.o CMakeFiles/ZThread.dir/ThreadOps.cxx.o
/usr/bin/ranlib libZThread.a
make[2]: Leaving directory `/home/mikeb/rpmbuild/BUILD/hugin-2013.0.0'
/usr/bin/cmake -E cmake_progress_report /home/mikeb/rpmbuild/BUILD/hugin-2013.0.0/CMakeFiles 14 15 16 17 18 19 20
[ 36%] Built target ZThread
[31m [1mLinking CXX shared library libhuginvigraimpex.so
[0mcd /home/mikeb/rpmbuild/BUILD/hugin-2013.0.0/src/foreign/vigra/vigra_impex && /usr/bin/cmake -E cmake_link_script CMakeFiles/huginvigraimpex.dir/link.txt --verbose=1
/usr/bin/c++ -fPIC -O2 -g -pipe -Wall -Wp,-D_FORTIFY_SOURCE=2 -fexceptions -fstack-protector --param=ssp-buffer-size=4 -m64 -mtune=generic -O2 -g -shared -Wl,-soname,libhuginvigraimpex.so.0.0 -o libhuginvigraimpex.so.0.0 CMakeFiles/huginvigraimpex.dir/bmp.cxx.o CMakeFiles/huginvigraimpex.dir/byteorder.cxx.o CMakeFiles/huginvigraimpex.dir/codecmanager.cxx.o CMakeFiles/huginvigraimpex.dir/gif.cxx.o CMakeFiles/huginvigraimpex.dir/imageinfo.cxx.o CMakeFiles/huginvigraimpex.dir/jpeg.cxx.o CMakeFiles/huginvigraimpex.dir/png.cxx.o CMakeFiles/huginvigraimpex.dir/pnm.cxx.o CMakeFiles/huginvigraimpex.dir/sun.cxx.o CMakeFiles/huginvigraimpex.dir/tiff.cxx.o CMakeFiles/huginvigraimpex.dir/viff.cxx.o CMakeFiles/huginvigraimpex.dir/void_vector.cxx.o CMakeFiles/huginvigraimpex.dir/iccjpeg.c.o CMakeFiles/huginvigraimpex.dir/rgbe.c.o CMakeFiles/huginvigraimpex.dir/hdr.cxx.o CMakeFiles/huginvigraimpex.dir/exr.cxx.o -lpthread -ljpeg -lImath -lIlmImf -lIex -lHalf -lIlmThread -lpng -lz -ltiff
cd /home/mikeb/rpmbuild/BUILD/hugin-2013.0.0/src/foreign/vigra/vigra_impex && /usr/bin/cmake -E cmake_symlink_library libhuginvigraimpex.so.0.0 libhuginvigraimpex.so.0.0 libhuginvigraimpex.so
make[2]: Leaving directory `/home/mikeb/rpmbuild/BUILD/hugin-2013.0.0'
/usr/bin/cmake -E cmake_progress_report /home/mikeb/rpmbuild/BUILD/hugin-2013.0.0/CMakeFiles 76 77 78 79 80
[ 36%] Built target huginvigraimpex
make[1]: Leaving directory `/home/mikeb/rpmbuild/BUILD/hugin-2013.0.0'
make: *** [all] Error 2
error: Bad exit status from /var/tmp/rpm-tmp.jHXyRp (%build)
RPM build errors:
user mockbuild does not exist - using root
group mockbuild does not exist - using root
user mockbuild does not exist - using root
group mockbuild does not exist - using root
Bad exit status from /var/tmp/rpm-tmp.jHXyRp (%build)