Changes:
[bg2382] see if I can figure out what is wrong with Jenkins
------------------------------------------
Started by an SCM change
Building in workspace <http://d1m1s1b1.stat.columbia.edu:8080/job/Stan/ws/>
Checkout:workspace / <http://d1m1s1b1.stat.columbia.edu:8080/job/Stan/ws/> - hudson.remoting.LocalChannel@d7cf62
Using strategy: Default
Last Built Revision: Revision 5393b967cf82ffdad3f0c1256c29162ab8b600d9 (origin/master)
Checkout:workspace / <http://d1m1s1b1.stat.columbia.edu:8080/job/Stan/ws/> - hudson.remoting.LocalChannel@d7cf62
Fetching changes from 1 remote Git repository
Fetching upstream changes from https://code.google.com/p/stan/
Commencing build of Revision 727c03cf0aa35e418da982e5a5ccd88fb18e2b2a (origin/master)
Checking out Revision 727c03cf0aa35e418da982e5a5ccd88fb18e2b2a (origin/master)
[workspace] $ cmd /c call C:\Windows\TEMP\hudson1407691936425812320.bat
<http://d1m1s1b1.stat.columbia.edu:8080/job/Stan/ws/>make> clean-all
rm -f -r *.dSYM
rm -f -r models src/stan/model/model_header.hpp.gch src/stan/model/model_header.hpp.pch
rm -f -r doc/api
rm -f -r demo
rm -f -r test bin
<http://d1m1s1b1.stat.columbia.edu:8080/job/Stan/ws/>make> test-all -j4
g++ -I src -I lib -O0 -Wall -std=gnu++0x -Wno-unused-function -Wno-uninitialized -static-libgcc -static-libstdc++ -c -I lib/gtest/include -I lib/gtest -DGTEST_HAS_PTHREAD=0 -o test/gtest.o lib/gtest/src/gtest-all.cc
g++.exe: error: unrecognized option '-static-libstdc++'
make/tests:47: recipe for target `test/gtest.o' failed
make: *** [test/gtest.o] Error 1
<http://d1m1s1b1.stat.columbia.edu:8080/job/Stan/ws/>exit> 2
Build step 'Execute Windows batch command' marked build as failure
Recording test results
Changes:
[bg2382] use LDFLAGS instead of CFLAGS for -static stuff
------------------------------------------
Started by an SCM change
Building in workspace <http://d1m1s1b1.stat.columbia.edu:8080/job/Stan/ws/>
Checkout:workspace / <http://d1m1s1b1.stat.columbia.edu:8080/job/Stan/ws/> - hudson.remoting.LocalChannel@d7cf62
Using strategy: Default
Last Built Revision: Revision 727c03cf0aa35e418da982e5a5ccd88fb18e2b2a (origin/master)
Checkout:workspace / <http://d1m1s1b1.stat.columbia.edu:8080/job/Stan/ws/> - hudson.remoting.LocalChannel@d7cf62
Fetching changes from 1 remote Git repository
Fetching upstream changes from https://code.google.com/p/stan/
Commencing build of Revision 2d271acd33ba2f10cc8a0b9df24e368fa439f566 (origin/master)
Checking out Revision 2d271acd33ba2f10cc8a0b9df24e368fa439f566 (origin/master)
[workspace] $ cmd /c call C:\Windows\TEMP\hudson3345500575597013250.bat
<http://d1m1s1b1.stat.columbia.edu:8080/job/Stan/ws/>make> clean-all
rm -f -r *.dSYM
rm -f -r models src/stan/model/model_header.hpp.gch src/stan/model/model_header.hpp.pch
rm -f -r doc/api
rm -f -r demo
rm -f -r test bin
<http://d1m1s1b1.stat.columbia.edu:8080/job/Stan/ws/>make> test-all -j4
g++ -I src -I lib -O1 -Wall -std=gnu++0x -Wno-unused-function -Wno-uninitialized -c -I lib/gtest/include -I lib/gtest -DGTEST_HAS_PTHREAD=0 -o test/gtest.o lib/gtest/src/gtest-all.cc
ar rv test/libgtest.a test/gtest.o
a - test/gtest.o
C:\MinGW64\bin\ar.exe: creating test/libgtest.a
make: Warning: File `test/libgtest.a' has modification time 0.001 s in the future
g++ -I src -I lib -O1 -Wall -std=gnu++0x -Wno-unused-function -Wno-uninitialized -c -I lib/gtest/include -I lib/gtest -DGTEST_HAS_PTHREAD=0 -o test/agrad/agrad.o src/test/agrad/agrad_test.cpp
g++ -I src -I lib -O1 -Wall -std=gnu++0x -Wno-unused-function -Wno-uninitialized -c -I lib/gtest/include -I lib/gtest -DGTEST_HAS_PTHREAD=0 -o test/agrad/distributions/multivariate/continuous/dirichlet.o src/test/agrad/distributions/multivariate/continuous/dirichlet_test.cpp
g++ -I src -I lib -O1 -Wall -std=gnu++0x -Wno-unused-function -Wno-uninitialized -c -I lib/gtest/include -I lib/gtest -DGTEST_HAS_PTHREAD=0 -o test/agrad/distributions/multivariate/continuous/multi_normal.o src/test/agrad/distributions/multivariate/continuous/multi_normal_test.cpp
g++ -I src -I lib -O1 -Wall -std=gnu++0x -Wno-unused-function -Wno-uninitialized -c -I lib/gtest/include -I lib/gtest -DGTEST_HAS_PTHREAD=0 -o test/agrad/distributions/multivariate/continuous/inv_wishart.o src/test/agrad/distributions/multivariate/continuous/inv_wishart_test.cpp
g++ -I src -I lib -O1 -Wall -std=gnu++0x -Wno-unused-function -Wno-uninitialized -c -I lib/gtest/include -I lib/gtest -DGTEST_HAS_PTHREAD=0 -o test/agrad/distributions/multivariate/continuous/wishart.o src/test/agrad/distributions/multivariate/continuous/wishart_test.cpp
g++ -I src -I lib -O1 -Wall -std=gnu++0x -Wno-unused-function -Wno-uninitialized -c -I lib/gtest/include -I lib/gtest -DGTEST_HAS_PTHREAD=0 -o test/agrad/distributions/multivariate/discrete/multinomial.o src/test/agrad/distributions/multivariate/discrete/multinomial_test.cpp
g++ -I src -I lib -O1 -Wall -std=gnu++0x -Wno-unused-function -Wno-uninitialized -c -I lib/gtest/include -I lib/gtest -DGTEST_HAS_PTHREAD=0 -o test/agrad/distributions/univariate/continuous/beta.o src/test/agrad/distributions/univariate/continuous/beta_test.cpp
g++ -I src -I lib -O1 -Wall -std=gnu++0x -Wno-unused-function -Wno-uninitialized -c -I lib/gtest/include -I lib/gtest -DGTEST_HAS_PTHREAD=0 -o test/agrad/distributions/univariate/continuous/cauchy.o src/test/agrad/distributions/univariate/continuous/cauchy_test.cpp
g++ -I src -I lib -O1 -Wall -std=gnu++0x -Wno-unused-function -Wno-uninitialized -c -I lib/gtest/include -I lib/gtest -DGTEST_HAS_PTHREAD=0 -o test/agrad/distributions/univariate/continuous/chi_square.o src/test/agrad/distributions/univariate/continuous/chi_square_test.cpp
g++ -I src -I lib -O1 -Wall -std=gnu++0x -Wno-unused-function -Wno-uninitialized -c -I lib/gtest/include -I lib/gtest -DGTEST_HAS_PTHREAD=0 -o test/agrad/distributions/univariate/continuous/double_exponential.o src/test/agrad/distributions/univariate/continuous/double_exponential_test.cpp
g++ -I src -I lib -O1 -Wall -std=gnu++0x -Wno-unused-function -Wno-uninitialized -c -I lib/gtest/include -I lib/gtest -DGTEST_HAS_PTHREAD=0 -o test/agrad/distributions/univariate/continuous/exponential.o src/test/agrad/distributions/univariate/continuous/exponential_test.cpp
g++ -I src -I lib -O1 -Wall -std=gnu++0x -Wno-unused-function -Wno-uninitialized -c -I lib/gtest/include -I lib/gtest -DGTEST_HAS_PTHREAD=0 -o test/agrad/distributions/univariate/continuous/gamma.o src/test/agrad/distributions/univariate/continuous/gamma_test.cpp
g++ -I src -I lib -O1 -Wall -std=gnu++0x -Wno-unused-function -Wno-uninitialized -c -I lib/gtest/include -I lib/gtest -DGTEST_HAS_PTHREAD=0 -o test/agrad/distributions/univariate/continuous/inv_chi_square.o src/test/agrad/distributions/univariate/continuous/inv_chi_square_test.cpp
g++ -I src -I lib -O1 -Wall -std=gnu++0x -Wno-unused-function -Wno-uninitialized -c -I lib/gtest/include -I lib/gtest -DGTEST_HAS_PTHREAD=0 -o test/agrad/distributions/univariate/continuous/inv_gamma.o src/test/agrad/distributions/univariate/continuous/inv_gamma_test.cpp
g++ -I src -I lib -O1 -Wall -std=gnu++0x -Wno-unused-function -Wno-uninitialized -c -I lib/gtest/include -I lib/gtest -DGTEST_HAS_PTHREAD=0 -o test/agrad/distributions/univariate/continuous/logistic.o src/test/agrad/distributions/univariate/continuous/logistic_test.cpp
g++ -I src -I lib -O1 -Wall -std=gnu++0x -Wno-unused-function -Wno-uninitialized -c -I lib/gtest/include -I lib/gtest -DGTEST_HAS_PTHREAD=0 -o test/agrad/distributions/univariate/continuous/lognormal.o src/test/agrad/distributions/univariate/continuous/lognormal_test.cpp
g++ -I src -I lib -O1 -Wall -std=gnu++0x -Wno-unused-function -Wno-uninitialized -c -I lib/gtest/include -I lib/gtest -DGTEST_HAS_PTHREAD=0 -o test/agrad/distributions/univariate/continuous/normal.o src/test/agrad/distributions/univariate/continuous/normal_test.cpp
g++ -I src -I lib -O1 -Wall -std=gnu++0x -Wno-unused-function -Wno-uninitialized -c -I lib/gtest/include -I lib/gtest -DGTEST_HAS_PTHREAD=0 -o test/agrad/distributions/univariate/continuous/pareto.o src/test/agrad/distributions/univariate/continuous/pareto_test.cpp
g++ -I src -I lib -O1 -Wall -std=gnu++0x -Wno-unused-function -Wno-uninitialized -c -I lib/gtest/include -I lib/gtest -DGTEST_HAS_PTHREAD=0 -o test/agrad/distributions/univariate/continuous/scaled_inv_chi_square.o src/test/agrad/distributions/univariate/continuous/scaled_inv_chi_square_test.cpp
g++ -I src -I lib -O1 -Wall -std=gnu++0x -Wno-unused-function -Wno-uninitialized -c -I lib/gtest/include -I lib/gtest -DGTEST_HAS_PTHREAD=0 -o test/agrad/distributions/univariate/continuous/student_t.o src/test/agrad/distributions/univariate/continuous/student_t_test.cpp
g++ -I src -I lib -O1 -Wall -std=gnu++0x -Wno-unused-function -Wno-uninitialized -c -I lib/gtest/include -I lib/gtest -DGTEST_HAS_PTHREAD=0 -o test/agrad/distributions/univariate/continuous/uniform.o src/test/agrad/distributions/univariate/continuous/uniform_test.cpp
g++ -I src -I lib -O1 -Wall -std=gnu++0x -Wno-unused-function -Wno-uninitialized -c -I lib/gtest/include -I lib/gtest -DGTEST_HAS_PTHREAD=0 -o test/agrad/distributions/univariate/continuous/weibull.o src/test/agrad/distributions/univariate/continuous/weibull_test.cpp
g++ -I src -I lib -O1 -Wall -std=gnu++0x -Wno-unused-function -Wno-uninitialized -c -I lib/gtest/include -I lib/gtest -DGTEST_HAS_PTHREAD=0 -o test/agrad/distributions/univariate/discrete/bernoulli.o src/test/agrad/distributions/univariate/discrete/bernoulli_test.cpp
g++ -I src -I lib -O1 -Wall -std=gnu++0x -Wno-unused-function -Wno-uninitialized -c -I lib/gtest/include -I lib/gtest -DGTEST_HAS_PTHREAD=0 -o test/agrad/distributions/univariate/discrete/beta_binomial.o src/test/agrad/distributions/univariate/discrete/beta_binomial_test.cpp
g++ -I src -I lib -O1 -Wall -std=gnu++0x -Wno-unused-function -Wno-uninitialized -c -I lib/gtest/include -I lib/gtest -DGTEST_HAS_PTHREAD=0 -o test/agrad/distributions/univariate/discrete/binomial.o src/test/agrad/distributions/univariate/discrete/binomial_test.cpp
g++ -I src -I lib -O1 -Wall -std=gnu++0x -Wno-unused-function -Wno-uninitialized -c -I lib/gtest/include -I lib/gtest -DGTEST_HAS_PTHREAD=0 -o test/agrad/distributions/univariate/discrete/categorical.o src/test/agrad/distributions/univariate/discrete/categorical_test.cpp
cc1plus.exe: out of memory allocating 4072 bytes
make/tests:68: recipe for target `test/agrad/distributions/multivariate/continuous/inv_wishart.o' failed
make: *** [test/agrad/distributions/multivariate/continuous/inv_wishart.o] Error 1
make: *** Waiting for unfinished jobs....
cc1plus.exe: out of memory allocating 4072 bytes
make/tests:68: recipe for target `test/agrad/distributions/multivariate/continuous/multi_normal.o' failed
make: *** [test/agrad/distributions/multivariate/continuous/multi_normal.o] Error 1
cc1plus.exe: out of memory allocating 4072 bytes
make/tests:68: recipe for target `test/agrad/distributions/multivariate/continuous/wishart.o' failed
make: *** [test/agrad/distributions/multivariate/continuous/wishart.o] Error 1
Changes:
[bg2382] try with -static-libgcc
------------------------------------------
Started by an SCM change
Building in workspace <http://d1m1s1b1.stat.columbia.edu:8080/job/Stan/ws/>
Checkout:workspace / <http://d1m1s1b1.stat.columbia.edu:8080/job/Stan/ws/> - hudson.remoting.LocalChannel@d7cf62
Using strategy: Default
Last Built Revision: Revision 2d271acd33ba2f10cc8a0b9df24e368fa439f566 (origin/master)
Checkout:workspace / <http://d1m1s1b1.stat.columbia.edu:8080/job/Stan/ws/> - hudson.remoting.LocalChannel@d7cf62
Fetching changes from 1 remote Git repository
Fetching upstream changes from https://code.google.com/p/stan/
Commencing build of Revision 954464efae690396eb11c21328665e4f73db5d0f (origin/master)
Checking out Revision 954464efae690396eb11c21328665e4f73db5d0f (origin/master)
[workspace] $ cmd /c call C:\Windows\TEMP\hudson5487518146931899988.bat
<http://d1m1s1b1.stat.columbia.edu:8080/job/Stan/ws/>make> clean-all
rm -f -r *.dSYM
rm -f -r models src/stan/model/model_header.hpp.gch src/stan/model/model_header.hpp.pch
rm -f -r doc/api
rm -f -r demo
rm -f -r test bin
<http://d1m1s1b1.stat.columbia.edu:8080/job/Stan/ws/>make> test-all -j4
g++ -I src -I lib -O1 -Wall -std=gnu++0x -Wno-unused-function -Wno-uninitialized -static-libgcc -c -I lib/gtest/include -I lib/gtest -DGTEST_HAS_PTHREAD=0 -o test/gtest.o lib/gtest/src/gtest-all.cc
ar rv test/libgtest.a test/gtest.o
a - test/gtest.o
C:\MinGW64\bin\ar.exe: creating test/libgtest.a
make: Warning: File `test/libgtest.a' has modification time 0.00081 s in the future
g++ -I src -I lib -O1 -Wall -std=gnu++0x -Wno-unused-function -Wno-uninitialized -static-libgcc -c -I lib/gtest/include -I lib/gtest -DGTEST_HAS_PTHREAD=0 -o test/agrad/agrad.o src/test/agrad/agrad_test.cpp
g++ -I src -I lib -O1 -Wall -std=gnu++0x -Wno-unused-function -Wno-uninitialized -static-libgcc -c -I lib/gtest/include -I lib/gtest -DGTEST_HAS_PTHREAD=0 -o test/agrad/distributions/multivariate/continuous/dirichlet.o src/test/agrad/distributions/multivariate/continuous/dirichlet_test.cpp
g++ -I src -I lib -O1 -Wall -std=gnu++0x -Wno-unused-function -Wno-uninitialized -static-libgcc -c -I lib/gtest/include -I lib/gtest -DGTEST_HAS_PTHREAD=0 -o test/agrad/distributions/multivariate/continuous/inv_wishart.o src/test/agrad/distributions/multivariate/continuous/inv_wishart_test.cpp
g++ -I src -I lib -O1 -Wall -std=gnu++0x -Wno-unused-function -Wno-uninitialized -static-libgcc -c -I lib/gtest/include -I lib/gtest -DGTEST_HAS_PTHREAD=0 -o test/agrad/distributions/multivariate/continuous/multi_normal.o src/test/agrad/distributions/multivariate/continuous/multi_normal_test.cpp
g++ -I src -I lib -O1 -Wall -std=gnu++0x -Wno-unused-function -Wno-uninitialized -static-libgcc -c -I lib/gtest/include -I lib/gtest -DGTEST_HAS_PTHREAD=0 -o test/agrad/distributions/multivariate/continuous/wishart.o src/test/agrad/distributions/multivariate/continuous/wishart_test.cpp
g++ -I src -I lib -O1 -Wall -std=gnu++0x -Wno-unused-function -Wno-uninitialized -static-libgcc -c -I lib/gtest/include -I lib/gtest -DGTEST_HAS_PTHREAD=0 -o test/agrad/distributions/multivariate/discrete/multinomial.o src/test/agrad/distributions/multivariate/discrete/multinomial_test.cpp
g++ -I src -I lib -O1 -Wall -std=gnu++0x -Wno-unused-function -Wno-uninitialized -static-libgcc -c -I lib/gtest/include -I lib/gtest -DGTEST_HAS_PTHREAD=0 -o test/agrad/distributions/univariate/continuous/beta.o src/test/agrad/distributions/univariate/continuous/beta_test.cpp
g++ -I src -I lib -O1 -Wall -std=gnu++0x -Wno-unused-function -Wno-uninitialized -static-libgcc -c -I lib/gtest/include -I lib/gtest -DGTEST_HAS_PTHREAD=0 -o test/agrad/distributions/univariate/continuous/cauchy.o src/test/agrad/distributions/univariate/continuous/cauchy_test.cpp
g++ -I src -I lib -O1 -Wall -std=gnu++0x -Wno-unused-function -Wno-uninitialized -static-libgcc -c -I lib/gtest/include -I lib/gtest -DGTEST_HAS_PTHREAD=0 -o test/agrad/distributions/univariate/continuous/chi_square.o src/test/agrad/distributions/univariate/continuous/chi_square_test.cpp
g++ -I src -I lib -O1 -Wall -std=gnu++0x -Wno-unused-function -Wno-uninitialized -static-libgcc -c -I lib/gtest/include -I lib/gtest -DGTEST_HAS_PTHREAD=0 -o test/agrad/distributions/univariate/continuous/double_exponential.o src/test/agrad/distributions/univariate/continuous/double_exponential_test.cpp
g++ -I src -I lib -O1 -Wall -std=gnu++0x -Wno-unused-function -Wno-uninitialized -static-libgcc -c -I lib/gtest/include -I lib/gtest -DGTEST_HAS_PTHREAD=0 -o test/agrad/distributions/univariate/continuous/exponential.o src/test/agrad/distributions/univariate/continuous/exponential_test.cpp
g++ -I src -I lib -O1 -Wall -std=gnu++0x -Wno-unused-function -Wno-uninitialized -static-libgcc -c -I lib/gtest/include -I lib/gtest -DGTEST_HAS_PTHREAD=0 -o test/agrad/distributions/univariate/continuous/gamma.o src/test/agrad/distributions/univariate/continuous/gamma_test.cpp
g++ -I src -I lib -O1 -Wall -std=gnu++0x -Wno-unused-function -Wno-uninitialized -static-libgcc -c -I lib/gtest/include -I lib/gtest -DGTEST_HAS_PTHREAD=0 -o test/agrad/distributions/univariate/continuous/inv_chi_square.o src/test/agrad/distributions/univariate/continuous/inv_chi_square_test.cpp
g++ -I src -I lib -O1 -Wall -std=gnu++0x -Wno-unused-function -Wno-uninitialized -static-libgcc -c -I lib/gtest/include -I lib/gtest -DGTEST_HAS_PTHREAD=0 -o test/agrad/distributions/univariate/continuous/inv_gamma.o src/test/agrad/distributions/univariate/continuous/inv_gamma_test.cpp
g++ -I src -I lib -O1 -Wall -std=gnu++0x -Wno-unused-function -Wno-uninitialized -static-libgcc -c -I lib/gtest/include -I lib/gtest -DGTEST_HAS_PTHREAD=0 -o test/agrad/distributions/univariate/continuous/logistic.o src/test/agrad/distributions/univariate/continuous/logistic_test.cpp
g++ -I src -I lib -O1 -Wall -std=gnu++0x -Wno-unused-function -Wno-uninitialized -static-libgcc -c -I lib/gtest/include -I lib/gtest -DGTEST_HAS_PTHREAD=0 -o test/agrad/distributions/univariate/continuous/lognormal.o src/test/agrad/distributions/univariate/continuous/lognormal_test.cpp
g++ -I src -I lib -O1 -Wall -std=gnu++0x -Wno-unused-function -Wno-uninitialized -static-libgcc -c -I lib/gtest/include -I lib/gtest -DGTEST_HAS_PTHREAD=0 -o test/agrad/distributions/univariate/continuous/normal.o src/test/agrad/distributions/univariate/continuous/normal_test.cpp
g++ -I src -I lib -O1 -Wall -std=gnu++0x -Wno-unused-function -Wno-uninitialized -static-libgcc -c -I lib/gtest/include -I lib/gtest -DGTEST_HAS_PTHREAD=0 -o test/agrad/distributions/univariate/continuous/pareto.o src/test/agrad/distributions/univariate/continuous/pareto_test.cpp
g++ -I src -I lib -O1 -Wall -std=gnu++0x -Wno-unused-function -Wno-uninitialized -static-libgcc -c -I lib/gtest/include -I lib/gtest -DGTEST_HAS_PTHREAD=0 -o test/agrad/distributions/univariate/continuous/scaled_inv_chi_square.o src/test/agrad/distributions/univariate/continuous/scaled_inv_chi_square_test.cpp
g++ -I src -I lib -O1 -Wall -std=gnu++0x -Wno-unused-function -Wno-uninitialized -static-libgcc -c -I lib/gtest/include -I lib/gtest -DGTEST_HAS_PTHREAD=0 -o test/agrad/distributions/univariate/continuous/student_t.o src/test/agrad/distributions/univariate/continuous/student_t_test.cpp
g++ -I src -I lib -O1 -Wall -std=gnu++0x -Wno-unused-function -Wno-uninitialized -static-libgcc -c -I lib/gtest/include -I lib/gtest -DGTEST_HAS_PTHREAD=0 -o test/agrad/distributions/univariate/continuous/uniform.o src/test/agrad/distributions/univariate/continuous/uniform_test.cpp
g++ -I src -I lib -O1 -Wall -std=gnu++0x -Wno-unused-function -Wno-uninitialized -static-libgcc -c -I lib/gtest/include -I lib/gtest -DGTEST_HAS_PTHREAD=0 -o test/agrad/distributions/univariate/continuous/weibull.o src/test/agrad/distributions/univariate/continuous/weibull_test.cpp
g++ -I src -I lib -O1 -Wall -std=gnu++0x -Wno-unused-function -Wno-uninitialized -static-libgcc -c -I lib/gtest/include -I lib/gtest -DGTEST_HAS_PTHREAD=0 -o test/agrad/distributions/univariate/discrete/bernoulli.o src/test/agrad/distributions/univariate/discrete/bernoulli_test.cpp
g++ -I src -I lib -O1 -Wall -std=gnu++0x -Wno-unused-function -Wno-uninitialized -static-libgcc -c -I lib/gtest/include -I lib/gtest -DGTEST_HAS_PTHREAD=0 -o test/agrad/distributions/univariate/discrete/beta_binomial.o src/test/agrad/distributions/univariate/discrete/beta_binomial_test.cpp
g++ -I src -I lib -O1 -Wall -std=gnu++0x -Wno-unused-function -Wno-uninitialized -static-libgcc -c -I lib/gtest/include -I lib/gtest -DGTEST_HAS_PTHREAD=0 -o test/agrad/distributions/univariate/discrete/binomial.o src/test/agrad/distributions/univariate/discrete/binomial_test.cpp
g++ -I src -I lib -O1 -Wall -std=gnu++0x -Wno-unused-function -Wno-uninitialized -static-libgcc -c -I lib/gtest/include -I lib/gtest -DGTEST_HAS_PTHREAD=0 -o test/agrad/distributions/univariate/discrete/categorical.o src/test/agrad/distributions/univariate/discrete/categorical_test.cpp
cc1plus.exe: out of memory allocating 4072 bytes
cc1plus.exe: out of memory allocating 4072 bytes
make/tests:68: recipe for target `test/agrad/distributions/multivariate/continuous/multi_normal.o' failed
make: *** [test/agrad/distributions/multivariate/continuous/multi_normal.o] Error 1
make: *** Waiting for unfinished jobs....
make/tests:68: recipe for target `test/agrad/distributions/multivariate/continuous/inv_wishart.o' failed
make: *** [test/agrad/distributions/multivariate/continuous/inv_wishart.o] Error 1
cc1plus.exe: out of memory allocating 4072 bytes
Changes:
[bg2382] back to O=0 on Jenkins
------------------------------------------
Started by an SCM change
Building in workspace <http://d1m1s1b1.stat.columbia.edu:8080/job/Stan/ws/>
Checkout:workspace / <http://d1m1s1b1.stat.columbia.edu:8080/job/Stan/ws/> - hudson.remoting.LocalChannel@d7cf62
Using strategy: Default
Last Built Revision: Revision 954464efae690396eb11c21328665e4f73db5d0f (origin/master)
Checkout:workspace / <http://d1m1s1b1.stat.columbia.edu:8080/job/Stan/ws/> - hudson.remoting.LocalChannel@d7cf62
Fetching changes from 1 remote Git repository
Fetching upstream changes from https://code.google.com/p/stan/
Commencing build of Revision f1eacd1f9144d4480f5154db85563bc2feda7cad (origin/master)
Checking out Revision f1eacd1f9144d4480f5154db85563bc2feda7cad (origin/master)
[workspace] $ cmd /c call C:\Windows\TEMP\hudson5672474579056769328.bat
<http://d1m1s1b1.stat.columbia.edu:8080/job/Stan/ws/>make> clean-all
rm -f -r *.dSYM
rm -f -r models src/stan/model/model_header.hpp.gch src/stan/model/model_header.hpp.pch
rm -f -r doc/api
rm -f -r demo
rm -f -r test bin
<http://d1m1s1b1.stat.columbia.edu:8080/job/Stan/ws/>make> test-all -j4
g++ -I src -I lib -O0 -Wall -std=gnu++0x -Wno-unused-function -Wno-uninitialized -static-libgcc -c -I lib/gtest/include -I lib/gtest -DGTEST_HAS_PTHREAD=0 -o test/gtest.o lib/gtest/src/gtest-all.cc
ar rv test/libgtest.a test/gtest.o
a - test/gtest.o
C:\MinGW64\bin\ar.exe: creating test/libgtest.a
make: Warning: File `test/libgtest.a' has modification time 0.00061 s in the future
g++ -I src -I lib -O0 -Wall -std=gnu++0x -Wno-unused-function -Wno-uninitialized -static-libgcc -c -I lib/gtest/include -I lib/gtest -DGTEST_HAS_PTHREAD=0 -o test/agrad/distributions/multivariate/continuous/multi_normal.o src/test/agrad/distributions/multivariate/continuous/multi_normal_test.cpp
g++ -I src -I lib -O0 -Wall -std=gnu++0x -Wno-unused-function -Wno-uninitialized -static-libgcc -c -I lib/gtest/include -I lib/gtest -DGTEST_HAS_PTHREAD=0 -o test/agrad/agrad.o src/test/agrad/agrad_test.cpp
g++ -I src -I lib -O0 -Wall -std=gnu++0x -Wno-unused-function -Wno-uninitialized -static-libgcc -c -I lib/gtest/include -I lib/gtest -DGTEST_HAS_PTHREAD=0 -o test/agrad/distributions/multivariate/continuous/dirichlet.o src/test/agrad/distributions/multivariate/continuous/dirichlet_test.cpp
g++ -I src -I lib -O0 -Wall -std=gnu++0x -Wno-unused-function -Wno-uninitialized -static-libgcc -c -I lib/gtest/include -I lib/gtest -DGTEST_HAS_PTHREAD=0 -o test/agrad/distributions/multivariate/continuous/inv_wishart.o src/test/agrad/distributions/multivariate/continuous/inv_wishart_test.cpp
g++ -I src -I lib -O0 -Wall -std=gnu++0x -Wno-unused-function -Wno-uninitialized -static-libgcc -c -I lib/gtest/include -I lib/gtest -DGTEST_HAS_PTHREAD=0 -o test/agrad/distributions/multivariate/continuous/wishart.o src/test/agrad/distributions/multivariate/continuous/wishart_test.cpp
g++ -I src -I lib -O0 -Wall -std=gnu++0x -Wno-unused-function -Wno-uninitialized -static-libgcc -c -I lib/gtest/include -I lib/gtest -DGTEST_HAS_PTHREAD=0 -o test/agrad/distributions/multivariate/discrete/multinomial.o src/test/agrad/distributions/multivariate/discrete/multinomial_test.cpp
g++ -I src -I lib -O0 -Wall -std=gnu++0x -Wno-unused-function -Wno-uninitialized -static-libgcc -c -I lib/gtest/include -I lib/gtest -DGTEST_HAS_PTHREAD=0 -o test/agrad/distributions/univariate/continuous/beta.o src/test/agrad/distributions/univariate/continuous/beta_test.cpp
g++ -I src -I lib -O0 -Wall -std=gnu++0x -Wno-unused-function -Wno-uninitialized -static-libgcc -c -I lib/gtest/include -I lib/gtest -DGTEST_HAS_PTHREAD=0 -o test/agrad/distributions/univariate/continuous/cauchy.o src/test/agrad/distributions/univariate/continuous/cauchy_test.cpp
g++ -I src -I lib -O0 -Wall -std=gnu++0x -Wno-unused-function -Wno-uninitialized -static-libgcc -c -I lib/gtest/include -I lib/gtest -DGTEST_HAS_PTHREAD=0 -o test/agrad/distributions/univariate/continuous/chi_square.o src/test/agrad/distributions/univariate/continuous/chi_square_test.cpp
g++ -I src -I lib -O0 -Wall -std=gnu++0x -Wno-unused-function -Wno-uninitialized -static-libgcc -c -I lib/gtest/include -I lib/gtest -DGTEST_HAS_PTHREAD=0 -o test/agrad/distributions/univariate/continuous/double_exponential.o src/test/agrad/distributions/univariate/continuous/double_exponential_test.cpp
g++ -I src -I lib -O0 -Wall -std=gnu++0x -Wno-unused-function -Wno-uninitialized -static-libgcc -c -I lib/gtest/include -I lib/gtest -DGTEST_HAS_PTHREAD=0 -o test/agrad/distributions/univariate/continuous/exponential.o src/test/agrad/distributions/univariate/continuous/exponential_test.cpp
g++ -I src -I lib -O0 -Wall -std=gnu++0x -Wno-unused-function -Wno-uninitialized -static-libgcc -c -I lib/gtest/include -I lib/gtest -DGTEST_HAS_PTHREAD=0 -o test/agrad/distributions/univariate/continuous/gamma.o src/test/agrad/distributions/univariate/continuous/gamma_test.cpp
g++ -I src -I lib -O0 -Wall -std=gnu++0x -Wno-unused-function -Wno-uninitialized -static-libgcc -c -I lib/gtest/include -I lib/gtest -DGTEST_HAS_PTHREAD=0 -o test/agrad/distributions/univariate/continuous/inv_chi_square.o src/test/agrad/distributions/univariate/continuous/inv_chi_square_test.cpp
g++ -I src -I lib -O0 -Wall -std=gnu++0x -Wno-unused-function -Wno-uninitialized -static-libgcc -c -I lib/gtest/include -I lib/gtest -DGTEST_HAS_PTHREAD=0 -o test/agrad/distributions/univariate/continuous/inv_gamma.o src/test/agrad/distributions/univariate/continuous/inv_gamma_test.cpp
g++ -I src -I lib -O0 -Wall -std=gnu++0x -Wno-unused-function -Wno-uninitialized -static-libgcc -c -I lib/gtest/include -I lib/gtest -DGTEST_HAS_PTHREAD=0 -o test/agrad/distributions/univariate/continuous/logistic.o src/test/agrad/distributions/univariate/continuous/logistic_test.cpp
g++ -I src -I lib -O0 -Wall -std=gnu++0x -Wno-unused-function -Wno-uninitialized -static-libgcc -c -I lib/gtest/include -I lib/gtest -DGTEST_HAS_PTHREAD=0 -o test/agrad/distributions/univariate/continuous/lognormal.o src/test/agrad/distributions/univariate/continuous/lognormal_test.cpp
g++ -I src -I lib -O0 -Wall -std=gnu++0x -Wno-unused-function -Wno-uninitialized -static-libgcc -c -I lib/gtest/include -I lib/gtest -DGTEST_HAS_PTHREAD=0 -o test/agrad/distributions/univariate/continuous/normal.o src/test/agrad/distributions/univariate/continuous/normal_test.cpp
g++ -I src -I lib -O0 -Wall -std=gnu++0x -Wno-unused-function -Wno-uninitialized -static-libgcc -c -I lib/gtest/include -I lib/gtest -DGTEST_HAS_PTHREAD=0 -o test/agrad/distributions/univariate/continuous/pareto.o src/test/agrad/distributions/univariate/continuous/pareto_test.cpp
g++ -I src -I lib -O0 -Wall -std=gnu++0x -Wno-unused-function -Wno-uninitialized -static-libgcc -c -I lib/gtest/include -I lib/gtest -DGTEST_HAS_PTHREAD=0 -o test/agrad/distributions/univariate/continuous/scaled_inv_chi_square.o src/test/agrad/distributions/univariate/continuous/scaled_inv_chi_square_test.cpp
g++ -I src -I lib -O0 -Wall -std=gnu++0x -Wno-unused-function -Wno-uninitialized -static-libgcc -c -I lib/gtest/include -I lib/gtest -DGTEST_HAS_PTHREAD=0 -o test/agrad/distributions/univariate/continuous/student_t.o src/test/agrad/distributions/univariate/continuous/student_t_test.cpp
g++ -I src -I lib -O0 -Wall -std=gnu++0x -Wno-unused-function -Wno-uninitialized -static-libgcc -c -I lib/gtest/include -I lib/gtest -DGTEST_HAS_PTHREAD=0 -o test/agrad/distributions/univariate/continuous/uniform.o src/test/agrad/distributions/univariate/continuous/uniform_test.cpp
g++ -I src -I lib -O0 -Wall -std=gnu++0x -Wno-unused-function -Wno-uninitialized -static-libgcc -c -I lib/gtest/include -I lib/gtest -DGTEST_HAS_PTHREAD=0 -o test/agrad/distributions/univariate/continuous/weibull.o src/test/agrad/distributions/univariate/continuous/weibull_test.cpp
g++ -I src -I lib -O0 -Wall -std=gnu++0x -Wno-unused-function -Wno-uninitialized -static-libgcc -c -I lib/gtest/include -I lib/gtest -DGTEST_HAS_PTHREAD=0 -o test/agrad/distributions/univariate/discrete/bernoulli.o src/test/agrad/distributions/univariate/discrete/bernoulli_test.cpp
g++ -I src -I lib -O0 -Wall -std=gnu++0x -Wno-unused-function -Wno-uninitialized -static-libgcc -c -I lib/gtest/include -I lib/gtest -DGTEST_HAS_PTHREAD=0 -o test/agrad/distributions/univariate/discrete/beta_binomial.o src/test/agrad/distributions/univariate/discrete/beta_binomial_test.cpp
g++ -I src -I lib -O0 -Wall -std=gnu++0x -Wno-unused-function -Wno-uninitialized -static-libgcc -c -I lib/gtest/include -I lib/gtest -DGTEST_HAS_PTHREAD=0 -o test/agrad/distributions/univariate/discrete/binomial.o src/test/agrad/distributions/univariate/discrete/binomial_test.cpp
g++ -I src -I lib -O0 -Wall -std=gnu++0x -Wno-unused-function -Wno-uninitialized -static-libgcc -c -I lib/gtest/include -I lib/gtest -DGTEST_HAS_PTHREAD=0 -o test/agrad/distributions/univariate/discrete/categorical.o src/test/agrad/distributions/univariate/discrete/categorical_test.cpp
g++ -I src -I lib -O0 -Wall -std=gnu++0x -Wno-unused-function -Wno-uninitialized -static-libgcc -c -I lib/gtest/include -I lib/gtest -DGTEST_HAS_PTHREAD=0 -o test/agrad/distributions/univariate/discrete/neg_binomial.o src/test/agrad/distributions/univariate/discrete/neg_binomial_test.cpp
g++ -I src -I lib -O0 -Wall -std=gnu++0x -Wno-unused-function -Wno-uninitialized -static-libgcc -c -I lib/gtest/include -I lib/gtest -DGTEST_HAS_PTHREAD=0 -o test/agrad/distributions/univariate/discrete/poisson.o src/test/agrad/distributions/univariate/discrete/poisson_test.cpp
g++ -I src -I lib -O0 -Wall -std=gnu++0x -Wno-unused-function -Wno-uninitialized -static-libgcc -c -I lib/gtest/include -I lib/gtest -DGTEST_HAS_PTHREAD=0 -o test/agrad/error_handling.o src/test/agrad/error_handling_test.cpp
g++ -I src -I lib -O0 -Wall -std=gnu++0x -Wno-unused-function -Wno-uninitialized -static-libgcc -c -I lib/gtest/include -I lib/gtest -DGTEST_HAS_PTHREAD=0 -o test/agrad/matrix.o src/test/agrad/matrix_test.cpp
g++ -I src -I lib -O0 -Wall -std=gnu++0x -Wno-unused-function -Wno-uninitialized -static-libgcc -c -I lib/gtest/include -I lib/gtest -DGTEST_HAS_PTHREAD=0 -o test/agrad/special_functions.o src/test/agrad/special_functions_test.cpp
g++ -I src -I lib -O0 -Wall -std=gnu++0x -Wno-unused-function -Wno-uninitialized -static-libgcc -c -I lib/gtest/include -I lib/gtest -DGTEST_HAS_PTHREAD=0 -o test/file_includes/stan_agrad_agrad.o src/test/file_includes/stan_agrad_agrad_test.cpp
g++ -I src -I lib -O0 -Wall -std=gnu++0x -Wno-unused-function -Wno-uninitialized -static-libgcc -c -I lib/gtest/include -I lib/gtest -DGTEST_HAS_PTHREAD=0 -o test/file_includes/stan_agrad_matrix.o src/test/file_includes/stan_agrad_matrix_test.cpp
g++ -I src -I lib -O0 -Wall -std=gnu++0x -Wno-unused-function -Wno-uninitialized -static-libgcc -c -I lib/gtest/include -I lib/gtest -DGTEST_HAS_PTHREAD=0 -o test/file_includes/stan_agrad_special_functions.o src/test/file_includes/stan_agrad_special_functions_test.cpp
g++ -I src -I lib -O0 -Wall -std=gnu++0x -Wno-unused-function -Wno-uninitialized -static-libgcc -c -I lib/gtest/include -I lib/gtest -DGTEST_HAS_PTHREAD=0 -o test/file_includes/stan_agrad.o src/test/file_includes/stan_agrad_test.cpp
g++ -I src -I lib -O0 -Wall -std=gnu++0x -Wno-unused-function -Wno-uninitialized -static-libgcc -c -I lib/gtest/include -I lib/gtest -DGTEST_HAS_PTHREAD=0 -o test/file_includes/stan_gm_ast.o src/test/file_includes/stan_gm_ast_test.cpp
g++ -I src -I lib -O0 -Wall -std=gnu++0x -Wno-unused-function -Wno-uninitialized -static-libgcc -c -I lib/gtest/include -I lib/gtest -DGTEST_HAS_PTHREAD=0 -o test/file_includes/stan_gm_generator.o src/test/file_includes/stan_gm_generator_test.cpp
g++ -I src -I lib -O0 -Wall -std=gnu++0x -Wno-unused-function -Wno-uninitialized -static-libgcc -c -I lib/gtest/include -I lib/gtest -DGTEST_HAS_PTHREAD=0 -o test/file_includes/stan_gm_parser.o src/test/file_includes/stan_gm_parser_test.cpp
g++ -I src -I lib -O0 -Wall -std=gnu++0x -Wno-unused-function -Wno-uninitialized -static-libgcc -c -I lib/gtest/include -I lib/gtest -DGTEST_HAS_PTHREAD=0 -o test/file_includes/stan_gm.o src/test/file_includes/stan_gm_test.cpp
g++ -I src -I lib -O0 -Wall -std=gnu++0x -Wno-unused-function -Wno-uninitialized -static-libgcc -c -I lib/gtest/include -I lib/gtest -DGTEST_HAS_PTHREAD=0 -o test/file_includes/stan_io_cmd_line.o src/test/file_includes/stan_io_cmd_line_test.cpp
g++ -I src -I lib -O0 -Wall -std=gnu++0x -Wno-unused-function -Wno-uninitialized -static-libgcc -c -I lib/gtest/include -I lib/gtest -DGTEST_HAS_PTHREAD=0 -o test/file_includes/stan_io_csv_writer.o src/test/file_includes/stan_io_csv_writer_test.cpp
g++ -I src -I lib -O0 -Wall -std=gnu++0x -Wno-unused-function -Wno-uninitialized -static-libgcc -c -I lib/gtest/include -I lib/gtest -DGTEST_HAS_PTHREAD=0 -o test/file_includes/stan_io_dump.o src/test/file_includes/stan_io_dump_test.cpp
g++ -I src -I lib -O0 -Wall -std=gnu++0x -Wno-unused-function -Wno-uninitialized -static-libgcc -c -I lib/gtest/include -I lib/gtest -DGTEST_HAS_PTHREAD=0 -o test/file_includes/stan_io_reader.o src/test/file_includes/stan_io_reader_test.cpp
g++ -I src -I lib -O0 -Wall -std=gnu++0x -Wno-unused-function -Wno-uninitialized -static-libgcc -c -I lib/gtest/include -I lib/gtest -DGTEST_HAS_PTHREAD=0 -o test/file_includes/stan_io.o src/test/file_includes/stan_io_test.cpp
g++ -I src -I lib -O0 -Wall -std=gnu++0x -Wno-unused-function -Wno-uninitialized -static-libgcc -c -I lib/gtest/include -I lib/gtest -DGTEST_HAS_PTHREAD=0 -o test/file_includes/stan_io_util.o src/test/file_includes/stan_io_util_test.cpp
g++ -I src -I lib -O0 -Wall -std=gnu++0x -Wno-unused-function -Wno-uninitialized -static-libgcc -c -I lib/gtest/include -I lib/gtest -DGTEST_HAS_PTHREAD=0 -o test/file_includes/stan_io_var_context.o src/test/file_includes/stan_io_var_context_test.cpp
g++ -I src -I lib -O0 -Wall -std=gnu++0x -Wno-unused-function -Wno-uninitialized -static-libgcc -c -I lib/gtest/include -I lib/gtest -DGTEST_HAS_PTHREAD=0 -o test/file_includes/stan_io_writer.o src/test/file_includes/stan_io_writer_test.cpp
g++ -I src -I lib -O0 -Wall -std=gnu++0x -Wno-unused-function -Wno-uninitialized -static-libgcc -c -I lib/gtest/include -I lib/gtest -DGTEST_HAS_PTHREAD=0 -o test/file_includes/stan_maths_constants.o src/test/file_includes/stan_maths_constants_test.cpp
g++ -I src -I lib -O0 -Wall -std=gnu++0x -Wno-unused-function -Wno-uninitialized -static-libgcc -c -I lib/gtest/include -I lib/gtest -DGTEST_HAS_PTHREAD=0 -o test/file_includes/stan_maths_error_handling.o src/test/file_includes/stan_maths_error_handling_test.cpp
g++ -I src -I lib -O0 -Wall -std=gnu++0x -Wno-unused-function -Wno-uninitialized -static-libgcc -c -I lib/gtest/include -I lib/gtest -DGTEST_HAS_PTHREAD=0 -o test/file_includes/stan_maths_matrix_error_handling.o src/test/file_includes/stan_maths_matrix_error_handling_test.cpp
g++ -I src -I lib -O0 -Wall -std=gnu++0x -Wno-unused-function -Wno-uninitialized -static-libgcc -c -I lib/gtest/include -I lib/gtest -DGTEST_HAS_PTHREAD=0 -o test/file_includes/stan_maths_matrix.o src/test/file_includes/stan_maths_matrix_test.cpp
g++ -I src -I lib -O0 -Wall -std=gnu++0x -Wno-unused-function -Wno-uninitialized -static-libgcc -c -I lib/gtest/include -I lib/gtest -DGTEST_HAS_PTHREAD=0 -o test/file_includes/stan_maths_special_functions.o src/test/file_includes/stan_maths_special_functions_test.cpp
g++ -I src -I lib -O0 -Wall -std=gnu++0x -Wno-unused-function -Wno-uninitialized -static-libgcc -c -I lib/gtest/include -I lib/gtest -DGTEST_HAS_PTHREAD=0 -o test/file_includes/stan_maths_util.o src/test/file_includes/stan_maths_util_test.cpp
g++ -I src -I lib -O0 -Wall -std=gnu++0x -Wno-unused-function -Wno-uninitialized -static-libgcc -c -I lib/gtest/include -I lib/gtest -DGTEST_HAS_PTHREAD=0 -o test/file_includes/stan_mcmc_adaptive_cdhmc.o src/test/file_includes/stan_mcmc_adaptive_cdhmc_test.cpp
g++ -I src -I lib -O0 -Wall -std=gnu++0x -Wno-unused-function -Wno-uninitialized -static-libgcc -c -I lib/gtest/include -I lib/gtest -DGTEST_HAS_PTHREAD=0 -o test/file_includes/stan_mcmc_adaptive_hmc.o src/test/file_includes/stan_mcmc_adaptive_hmc_test.cpp
g++ -I src -I lib -O0 -Wall -std=gnu++0x -Wno-unused-function -Wno-uninitialized -static-libgcc -c -I lib/gtest/include -I lib/gtest -DGTEST_HAS_PTHREAD=0 -o test/file_includes/stan_mcmc_adaptive_sampler.o src/test/file_includes/stan_mcmc_adaptive_sampler_test.cpp
g++ -I src -I lib -O0 -Wall -std=gnu++0x -Wno-unused-function -Wno-uninitialized -static-libgcc -c -I lib/gtest/include -I lib/gtest -DGTEST_HAS_PTHREAD=0 -o test/file_includes/stan_mcmc_dualaverage.o src/test/file_includes/stan_mcmc_dualaverage_test.cpp
g++ -I src -I lib -O0 -Wall -std=gnu++0x -Wno-unused-function -Wno-uninitialized -static-libgcc -c -I lib/gtest/include -I lib/gtest -DGTEST_HAS_PTHREAD=0 -o test/file_includes/stan_mcmc_hmc.o src/test/file_includes/stan_mcmc_hmc_test.cpp
g++ -I src -I lib -O0 -Wall -std=gnu++0x -Wno-unused-function -Wno-uninitialized -static-libgcc -c -I lib/gtest/include -I lib/gtest -DGTEST_HAS_PTHREAD=0 -o test/file_includes/stan_mcmc_nuts.o src/test/file_includes/stan_mcmc_nuts_test.cpp
g++ -I src -I lib -O0 -Wall -std=gnu++0x -Wno-unused-function -Wno-uninitialized -static-libgcc -c -I lib/gtest/include -I lib/gtest -DGTEST_HAS_PTHREAD=0 -o test/file_includes/stan_mcmc_sampler.o src/test/file_includes/stan_mcmc_sampler_test.cpp
g++ -I src -I lib -O0 -Wall -std=gnu++0x -Wno-unused-function -Wno-uninitialized -static-libgcc -c -I lib/gtest/include -I lib/gtest -DGTEST_HAS_PTHREAD=0 -o test/file_includes/stan_mcmc.o src/test/file_includes/stan_mcmc_test.cpp
g++ -I src -I lib -O0 -Wall -std=gnu++0x -Wno-unused-function -Wno-uninitialized -static-libgcc -c -I lib/gtest/include -I lib/gtest -DGTEST_HAS_PTHREAD=0 -o test/file_includes/stan_mcmc_util.o src/test/file_includes/stan_mcmc_util_test.cpp
g++ -I src -I lib -O0 -Wall -std=gnu++0x -Wno-unused-function -Wno-uninitialized -static-libgcc -c -I lib/gtest/include -I lib/gtest -DGTEST_HAS_PTHREAD=0 -o test/file_includes/stan_memory_stack_alloc.o src/test/file_includes/stan_memory_stack_alloc_test.cpp
g++ -I src -I lib -O0 -Wall -std=gnu++0x -Wno-unused-function -Wno-uninitialized -static-libgcc -c -I lib/gtest/include -I lib/gtest -DGTEST_HAS_PTHREAD=0 -o test/file_includes/stan_memory.o src/test/file_includes/stan_memory_test.cpp
g++ -I src -I lib -O0 -Wall -std=gnu++0x -Wno-unused-function -Wno-uninitialized -static-libgcc -c -I lib/gtest/include -I lib/gtest -DGTEST_HAS_PTHREAD=0 -o test/file_includes/stan_meta.o src/test/file_includes/stan_meta_test.cpp
g++ -I src -I lib -O0 -Wall -std=gnu++0x -Wno-unused-function -Wno-uninitialized -static-libgcc -c -I lib/gtest/include -I lib/gtest -DGTEST_HAS_PTHREAD=0 -o test/file_includes/stan_meta_traits.o src/test/file_includes/stan_meta_traits_test.cpp
g++ -I src -I lib -O0 -Wall -std=gnu++0x -Wno-unused-function -Wno-uninitialized -static-libgcc -c -I lib/gtest/include -I lib/gtest -DGTEST_HAS_PTHREAD=0 -o test/file_includes/stan_model_prob_grad_ad.o src/test/file_includes/stan_model_prob_grad_ad_test.cpp
g++ -I src -I lib -O0 -Wall -std=gnu++0x -Wno-unused-function -Wno-uninitialized -static-libgcc -c -I lib/gtest/include -I lib/gtest -DGTEST_HAS_PTHREAD=0 -o test/file_includes/stan_model_prob_grad.o src/test/file_includes/stan_model_prob_grad_test.cpp
g++ -I src -I lib -O0 -Wall -std=gnu++0x -Wno-unused-function -Wno-uninitialized -static-libgcc -c -I lib/gtest/include -I lib/gtest -DGTEST_HAS_PTHREAD=0 -o test/file_includes/stan_model.o src/test/file_includes/stan_model_test.cpp
g++ -I src -I lib -O0 -Wall -std=gnu++0x -Wno-unused-function -Wno-uninitialized -static-libgcc -c -I lib/gtest/include -I lib/gtest -DGTEST_HAS_PTHREAD=0 -o test/file_includes/stan_prob_constants.o src/test/file_includes/stan_prob_constants_test.cpp
g++ -I src -I lib -O0 -Wall -std=gnu++0x -Wno-unused-function -Wno-uninitialized -static-libgcc -c -I lib/gtest/include -I lib/gtest -DGTEST_HAS_PTHREAD=0 -o test/file_includes/stan_prob_distributions_multivariate.o src/test/file_includes/stan_prob_distributions_multivariate_test.cpp
g++ -I src -I lib -O0 -Wall -std=gnu++0x -Wno-unused-function -Wno-uninitialized -static-libgcc -c -I lib/gtest/include -I lib/gtest -DGTEST_HAS_PTHREAD=0 -o test/file_includes/stan_prob_distributions.o src/test/file_includes/stan_prob_distributions_test.cpp
g++ -I src -I lib -O0 -Wall -std=gnu++0x -Wno-unused-function -Wno-uninitialized -static-libgcc -c -I lib/gtest/include -I lib/gtest -DGTEST_HAS_PTHREAD=0 -o test/file_includes/stan_prob_distributions_univariate.o src/test/file_includes/stan_prob_distributions_univariate_test.cpp
c:/mingw64/bin/../lib/gcc/x86_64-w64-mingw32/4.6.1/../../../../x86_64-w64-mingw32/bin/as.exe: test/file_includes/stan_gm.o: too many sections (58915)
C:\Windows\TEMP\cc93AGur.s: Assembler messages:
C:\Windows\TEMP\cc93AGur.s: Fatal error: can't write test/file_includes/stan_gm.o: File too big
c:/mingw64/bin/../lib/gcc/x86_64-w64-mingw32/4.6.1/../../../../x86_64-w64-mingw32/bin/as.exe: test/file_includes/stan_gm.o: too many sections (58915)
C:\Windows\TEMP\cc93AGur.s: Fatal error: can't close test/file_includes/stan_gm.o: File too big
make/tests:68: recipe for target `test/file_includes/stan_gm.o' failed
make: *** [test/file_includes/stan_gm.o] Error 1
make: *** Waiting for unfinished jobs....
<http://d1m1s1b1.stat.columbia.edu:8080/job/Stan/ws/>exit> 2