libvpx install error in test/dct16x16_test.cc.o on CentOS 6.5

131 views
Skip to first unread message

bolt...@gmail.com

unread,
Jan 30, 2014, 10:13:02 PM1/30/14
to apps-...@webmproject.org
Hi

I am having issues installing libvpx and need some help please.
My system is CentOS 6.5

I downloaded using git like so: 


When I run make I get the following fatal error:

[CXX] test/dct16x16_test.cc.o
In file included from ./vp9/common/vp9_entropy.h:16,
                 from test/dct16x16_test.cc:22:
./vp9/common/vp9_blockd.h:255: error: declaration of ‘const int16_t (* macroblockd::interp_kernel)[8]’
./vp9/common/vp9_filter.h:36: error: changes meaning of ‘interp_kernel’ from ‘typedef int16_t interp_kernel [8]’
test/dct16x16_test.cc:506: warning: ‘<unnamed>::gtest_CTrans16x16DCT_dummy_’ defined but not used
test/dct16x16_test.cc:513: warning: ‘<unnamed>::gtest_CTrans16x16HT_dummy_’ defined but not used
test/dct16x16_test.cc:520: warning: ‘<unnamed>::gtest_SSE2Trans16x16DCT_dummy_’ defined but not used
test/dct16x16_test.cc:527: warning: ‘<unnamed>::gtest_SSE2Trans16x16HT_dummy_’ defined but not used
test/dct16x16_test.cc:446: warning: ‘<unnamed>::Trans16x16DCT_AccuracyCheck_Test::gtest_registering_dummy_’ defined but not used
test/dct16x16_test.cc:450: warning: ‘<unnamed>::Trans16x16DCT_CoeffCheck_Test::gtest_registering_dummy_’ defined but not used
test/dct16x16_test.cc:454: warning: ‘<unnamed>::Trans16x16DCT_MemCheck_Test::gtest_registering_dummy_’ defined but not used
test/dct16x16_test.cc:458: warning: ‘<unnamed>::Trans16x16DCT_InvAccuracyCheck_Test::gtest_registering_dummy_’ defined but not used
test/dct16x16_test.cc:489: warning: ‘<unnamed>::Trans16x16HT_AccuracyCheck_Test::gtest_registering_dummy_’ defined but not used
test/dct16x16_test.cc:493: warning: ‘<unnamed>::Trans16x16HT_CoeffCheck_Test::gtest_registering_dummy_’ defined but not used
test/dct16x16_test.cc:497: warning: ‘<unnamed>::Trans16x16HT_MemCheck_Test::gtest_registering_dummy_’ defined but not used
make[1]: *** [test/dct16x16_test.cc.o] Error 1
make: *** [.DEFAULT] Error 2

I have attached full terminal output.
Any help is appreciated.

Thanks
Chris







libvpx-make-error.txt

James Zern

unread,
Feb 3, 2014, 7:52:10 PM2/3/14
to Application Developers
On Thu, Jan 30, 2014 at 7:13 PM, <bolt...@gmail.com> wrote:
> Hi
>
> I am having issues installing libvpx and need some help please.
> My system is CentOS 6.5
>
> I downloaded using git like so:
>
> git clone --depth 1 http://git.chromium.org/webm/libvpx.git
>
> When I run make I get the following fatal error:
>
> [CXX] test/dct16x16_test.cc.o
> In file included from ./vp9/common/vp9_entropy.h:16,
> from test/dct16x16_test.cc:22:
> ./vp9/common/vp9_blockd.h:255: error: declaration of ‘const int16_t (*
> macroblockd::interp_kernel)[8]’
> ./vp9/common/vp9_filter.h:36: error: changes meaning of ‘interp_kernel’ from
> ‘typedef int16_t interp_kernel [8]’
> [...]
>
> I have attached full terminal output.
> Any help is appreciated.
>

Good catch. A fix is here [1].

[1] https://gerrit.chromium.org/gerrit/68624

James Zern

unread,
Feb 4, 2014, 2:14:36 AM2/4/14
to Application Developers
This has been merged:
2b7338a Merge "vp9_filter.h: rename interp_kernel type"

> [1] https://gerrit.chromium.org/gerrit/68624
Reply all
Reply to author
Forward
0 new messages