e2e Test is failing.

43 views
Skip to first unread message

aadesh deshmukh

unread,
Feb 8, 2020, 11:06:57 PM2/8/20
to h...@tensorflow.org
Hi there,

I am Aadesh, computer science undergraduate at IIIT.
Thinking of implementing the ULMFIT for Tensorflow hub.
have gone through the docs and examples over Github repo,
After building TensorFlowHub from the e2e Test fails,
These are the packages in my conda environment.
How can i fix this?

# Name Version Build Channel
absl-py 0.9.0 pypi_0 pypi
appnope 0.1.0 py36hf537a9a_0
astor 0.8.1 pypi_0 pypi
attrs 19.3.0 py_0
backcall 0.1.0 py36_0
bleach 3.1.0 py36_0
ca-certificates 2020.1.1 0
cachetools 4.0.0 pypi_0 pypi
certifi 2019.11.28 pypi_0 pypi
chardet 3.0.4 pypi_0 pypi
cycler 0.10.0 pypi_0 pypi
decorator 4.4.1 py_0
defusedxml 0.6.0 py_0
entrypoints 0.3 py36_0
gast 0.2.2 pypi_0 pypi
google-auth 1.11.0 pypi_0 pypi
google-auth-oauthlib 0.4.1 pypi_0 pypi
google-pasta 0.1.8 pypi_0 pypi
grpcio 1.26.0 pypi_0 pypi
h5py 2.10.0 pypi_0 pypi
idna 2.8 pypi_0 pypi
importlib_metadata 1.4.0 py36_0
ipykernel 5.1.4 py36h39e3cac_0
ipython 7.11.1 py36h39e3cac_0
ipython_genutils 0.2.0 py36_0
jedi 0.16.0 py36_0
jinja2 2.10.3 py_0
joblib 0.14.1 pypi_0 pypi
json5 0.8.5 py_0
jsonschema 3.2.0 py36_0
jupyter_client 5.3.4 py36_0
jupyter_core 4.6.1 py36_0
jupyterlab 1.2.5 pyhf63ae98_0
jupyterlab_server 1.0.6 py_0
keras-applications 1.0.8 pypi_0 pypi
keras-preprocessing 1.1.0 pypi_0 pypi
kiwisolver 1.1.0 pypi_0 pypi
libcxx 4.0.1 hcfea43d_1
libcxxabi 4.0.1 hcfea43d_1
libedit 3.1.20181209 hb402a30_0
libffi 3.2.1 h475c297_4
libsodium 1.0.16 h3efe00b_0
markdown 3.1.1 pypi_0 pypi
markupsafe 1.1.1 py36h1de35cc_0
matplotlib 3.1.2 pypi_0 pypi
mistune 0.8.4 py36h1de35cc_0
more-itertools 8.0.2 py_0
nbconvert 5.6.1 py36_0
nbformat 5.0.4 py_0
ncurses 6.1 h0a44026_1
notebook 6.0.3 py36_0
numpy 1.18.1 pypi_0 pypi
oauthlib 3.1.0 pypi_0 pypi
openssl 1.1.1d h1de35cc_3
opt-einsum 3.1.0 pypi_0 pypi
pandas 1.0.0 pypi_0 pypi
pandoc 2.2.3.2 0
pandocfilters 1.4.2 py36_1
parso 0.6.0 py_0
pexpect 4.8.0 py36_0
pickleshare 0.7.5 py36_0
pip 20.0.2 py36_1
prometheus_client 0.7.1 py_0
prompt_toolkit 3.0.3 py_0
protobuf 3.11.2 pypi_0 pypi
ptyprocess 0.6.0 py36_0
pyasn1 0.4.8 pypi_0 pypi
pyasn1-modules 0.2.8 pypi_0 pypi
pygments 2.5.2 py_0
pyparsing 2.4.6 pypi_0 pypi
pyrsistent 0.15.7 py36h1de35cc_0
python 3.6.10 h359304d_0
python-dateutil 2.8.1 py_0
python-slugify 4.0.0 pypi_0 pypi
pytz 2019.3 pypi_0 pypi
pyzmq 18.1.0 py36h0a44026_0
readline 7.0 h1de35cc_5
requests 2.22.0 pypi_0 pypi
requests-oauthlib 1.3.0 pypi_0 pypi
rsa 4.0 pypi_0 pypi
scikit-learn 0.22.1 pypi_0 pypi
scipy 1.4.1 pypi_0 pypi
seaborn 0.10.0 pypi_0 pypi
send2trash 1.5.0 py36_0
setuptools 45.1.0 pypi_0 pypi
six 1.14.0 py36_0
sklearn 0.0 pypi_0 pypi
sqlite 3.30.1 ha441bb4_0
tensorboard 2.1.0 pypi_0 pypi
tensorflow 2.1.0 pypi_0 pypi
tensorflow-estimator 2.1.0 pypi_0 pypi
tensorflow-hub 0.8.0.dev0 pypi_0 pypi
termcolor 1.1.0 pypi_0 pypi
terminado 0.8.3 py36_0
testpath 0.4.4 py_0
text-unidecode 1.3 pypi_0 pypi
tk 8.6.8 ha441bb4_0
tornado 6.0.3 py36h1de35cc_0
tqdm 4.42.0 pypi_0 pypi
traitlets 4.3.3 py36_0
urllib3 1.24.3 pypi_0 pypi
wcwidth 0.1.7 py36_0
webencodings 0.5.1 py36_1
werkzeug 0.16.1 pypi_0 pypi
wheel 0.34.2 pypi_0 pypi
wrapt 1.11.2 pypi_0 pypi
xz 5.2.4 h1de35cc_4
zeromq 4.3.1 h0a44026_3
zipp 0.6.0 py_0
zlib 1.2.11 h1de35cc_3


(tensorflow_hub) aa25desh@DESHMUKHs-MacBook-Air hub % bazel test tensorflow_hub:all
INFO: Analyzed 45 targets (24 packages loaded, 784 targets configured).
INFO: Found 31 targets and 14 test targets...
INFO: Deleting stale sandbox base /private/var/tmp/_bazel_aa25desh/77e659fcacdebb0f6342727d124228e3/sandbox
INFO: From Linking external/com_google_protobuf/libprotobuf_lite.a [for host]:
/Library/Developer/CommandLineTools/usr/bin/libtool: file: bazel-out/host/bin/external/com_google_protobuf/_objs/protobuf_lite/io_win32.o has no symbols
INFO: From Linking external/com_google_protobuf/libprotobuf.a [for host]:
/Library/Developer/CommandLineTools/usr/bin/libtool: file: bazel-out/host/bin/external/com_google_protobuf/_objs/protobuf/error_listener.o has no symbols
FAIL: //tensorflow_hub:e2e_test (see /private/var/tmp/_bazel_aa25desh/77e659fcacdebb0f6342727d124228e3/execroot/org_tensorflow_hub/bazel-out/darwin-fastbuild/testlogs/tensorflow_hub/e2e_test/test.log)
INFO: Elapsed time: 250.550s, Critical Path: 71.46s
INFO: 200 processes: 200 darwin-sandbox.
INFO: Build completed, 1 test FAILED, 216 total actions
//tensorflow_hub:compressed_module_resolver_test PASSED in 32.3s
//tensorflow_hub:estimator_test PASSED in 10.0s
//tensorflow_hub:feature_column_test PASSED in 20.8s
//tensorflow_hub:image_util_test PASSED in 5.5s
//tensorflow_hub:module_test PASSED in 12.3s
//tensorflow_hub:module_v2_test PASSED in 5.4s
//tensorflow_hub:native_module_test PASSED in 18.6s
//tensorflow_hub:registry_test PASSED in 9.5s
//tensorflow_hub:resolver_test PASSED in 71.4s
//tensorflow_hub:saved_model_lib_test PASSED in 5.4s
//tensorflow_hub:saved_model_module_test PASSED in 8.6s
//tensorflow_hub:tensor_info_test PASSED in 5.1s
//tensorflow_hub:e2e_test FAILED in 10.2s
/private/var/tmp/_bazel_aa25desh/77e659fcacdebb0f6342727d124228e3/execroot/org_tensorflow_hub/bazel-out/darwin-fastbuild/testlogs/tensorflow_hub/e2e_test/test.log
//tensorflow_hub:keras_layer_test PASSED in 35.8s
Stats over 2 runs: max = 35.8s, min = 30.0s, avg = 32.9s, dev = 2.9s

Executed 14 out of 14 tests: 13 tests pass and 1 fails locally.
There were tests whose specified size is too big. Use the --test_verbose_timeout_warnings command line option to see which ones thINFO: Build completed, 1 test FAILED, 216 total actions

Best,
Aadesh.



aadesh deshmukh

unread,
Feb 8, 2020, 11:08:45 PM2/8/20
to h...@tensorflow.org
After Build from source (on MacBook)
Reply all
Reply to author
Forward
0 new messages