HUE install issues

229 views
Skip to first unread message

Hassaan mustafa

unread,
Aug 25, 2017, 12:22:16 PM8/25/17
to Hue-Users
getting this error when make apps command run 

build/temp.linux-x86_64-2.7/_openssl.c:73020:18: error: initializer element is not constant
     sizeof(RSA), offsetof(struct _cffi_align__RSA, y), 118, 8 },
                  ^
build/temp.linux-x86_64-2.7/_openssl.c:73020:18: note: (near initialization for ‘_cffi_struct_unions[131].alignment’)
build/temp.linux-x86_64-2.7/_openssl.c:73024:12: error: invalid application of ‘sizeof’ to incomplete type ‘X509_STORE_CTX {aka struct x509_store_ctx_st}’
     sizeof(X509_STORE_CTX), offsetof(struct _cffi_align__X509_STORE_CTX, y), 126, 10 },
            ^
build/temp.linux-x86_64-2.7/_openssl.c:73024:5: error: initializer element is not constant
     sizeof(X509_STORE_CTX), offsetof(struct _cffi_align__X509_STORE_CTX, y), 126, 10 },
     ^
build/temp.linux-x86_64-2.7/_openssl.c:73024:5: note: (near initialization for ‘_cffi_struct_unions[133].size’)
In file included from /usr/include/sched.h:28:0,
                 from /usr/include/pthread.h:23,
                 from /usr/include/openssl/crypto.h:406,
                 from /usr/include/openssl/bio.h:20,
                 from /usr/include/openssl/asn1.h:16,
                 from build/temp.linux-x86_64-2.7/_openssl.c:432:
build/temp.linux-x86_64-2.7/_openssl.c:73024:29: error: initializer element is not constant
     sizeof(X509_STORE_CTX), offsetof(struct _cffi_align__X509_STORE_CTX, y), 126, 10 },
                             ^
build/temp.linux-x86_64-2.7/_openssl.c:73024:29: note: (near initialization for ‘_cffi_struct_unions[133].alignment’)
error: command 'x86_64-linux-gnu-gcc' failed with exit status 1
/var/www/vhosts/hue/Makefile.sdk:120: recipe for target '/var/www/vhosts/hue/desktop/core/build/cryptography-1.3.1/egg.stamp' failed
make[2]: *** [/var/www/vhosts/hue/desktop/core/build/cryptography-1.3.1/egg.stamp] Error 1
make[2]: Leaving directory '/var/www/vhosts/hue/desktop/core'
Makefile:106: recipe for target '.recursive-env-install/core' failed
make[1]: *** [.recursive-env-install/core] Error 2
make[1]: Leaving directory '/var/www/vhosts/hue/desktop'
Makefile:148: recipe for target 'desktop' failed
make: *** [desktop] Error 2

homoz...@gmail.com

unread,
Aug 31, 2017, 9:28:38 PM8/31/17
to Hue-Users
I have the same problem.

在 2017年8月26日星期六 UTC+8上午12:22:16,Hassaan mustafa写道:

Romain Rigaux

unread,
Sep 4, 2017, 2:30:21 AM9/4/17
to homoz...@gmail.com, Hue-Users
On which OS?
Did you install all the package dependencies?
--
You received this message because you are subscribed to the Google Groups "Hue-Users" group.
To unsubscribe from this group and stop receiving emails from it, send an email to hue-user+u...@cloudera.org.

Aditya Pal

unread,
Jun 21, 2020, 1:28:38 AM6/21/20
to Hue-Users, Romain Rigaux, homoz...@gmail.com
Reviving this 2 year old thread .. same issue on Ubuntu docker !! Did you guys find a solution?

Romain Rigaux

unread,
Jun 22, 2020, 9:17:15 AM6/22/20
to Hassaan mustafa, Hue-Users

(no issue for me on the LTS 18.04 or 20.04)


Reply all
Reply to author
Forward
0 new messages